{"text_format":"1","workbook":"xlsx","n_sheets":36,"sheets":["Start Here","My Students","1","2","3","4","5","6","7","8","9","10","11","12","13","14","15","Printable Task List","Day 1 Notes","Day 1 Notes--v2","Task Guide","Helpful links","Dept-specific reqs","A","B","C","D","E","F","G","H","Messages","Paste to FR Form","Data Lists","What to include","Old"],"not_rendered":{"charts":0,"images":0,"macros":1,"external_links":0,"defined_names":19,"comments":3,"pivot_tables":0},"unopened":[],"bounds":{"document_bytes":16777216,"sheet_cells":100000,"rows_first":2000,"rows_last":500,"rows_between":2000,"halvings":0,"cell_chars":16384,"cell_head_chars":4096},"cells_cut":0,"cells_raw":0,"read":"whole","date_system":"1900"}

{"sheet":"Start Here","index":0,"n_rows":13,"n_cols":4,"rows_kept":13,"cut":false,"hidden":false,"merged":[]}
[]
[]
[]
[]
[]
[]
[]
[]
[]
[]
[]
[]
["Tech options:",null,null,"Not a big fan of computers?  Just disregard this section!  :)"]

{"sheet":"My Students","index":1,"n_rows":55,"n_cols":42,"rows_kept":55,"cut":false,"hidden":false,"merged":[[33,1,33,6],[38,0,43,0],[34,0,37,0],[37,1,37,6],[36,1,36,6],[35,1,35,6],[34,1,34,6]]}
[null,"Caseload Students",null,null,null,"(The color-coding on these headers is for Bonnie.  No need to know what it means.  :)",null,null,null,null,null,"Prescribeds: (Math / Writing / Reading / StSkills / NDRT)",null,null,null,"Academics:",null,null,null,null,null,"Country/group:",null,"Majors:",null,"Advisors:",null,"Holds, missing immunizations, etc. & Notes",null,null,null,null,null,null,null,"Contact info:",null,null,null,"Nursing eligibility:"]
["tabs","M#","Deleted","SAcad","VetOrDep","PREN","1stGen","FR/TR","StudentName","Major","Order/Time","PrescribedCrsMath","PrescribedCrsWriting","PrescribedCrsReading","PrescribedCrsStudySkills","HonorsElig","ACTEngl","HighSchoolGPA","ACTCompositeScore","InclusiveGPA","HrsEarned","CountrySlot","CUSTOMSGrp","CustomsPOS","BannerPOS","Assigned Advisor","Customs Advisor","Holds","RegistrationRestrictions","MissingChecklistItems","AdmissionDecision","ReverseTransfer","TermDesc","DateOfBirth","Notes","MTSUEmail","PersonalEmail","PermPhone","MailingPhone","NursElig","ACTMathScre","ACTScienceScre"]
[1,"M00000001","This is sample data. The purple button will paste over it. Just ignore it for now!","reg","","","N","F","Smith, Brenda","Psychology (Pre-Grad)","2/10:30 AM","College level","College level","College level",0,"UH: elig","",3.95,25,3.9161999999999999,28,"FR - France (s756)","PSY","BS_PSYPGSC","BS_PSYPGSC","Amy","Jennifer","None",0,0,"LF-Freshman Final Acceptance","","Fall 2019","2002-03-08","","2@mtmail.mtsu.edu","2@aol.com",0,"(615) 556-0000","",20,22]
[2,"M00000002","This is sample data. The purple button will paste over it. Just ignore it for now!","","","","N","F","Cook, Alan","Pre-Social Work","4/11:30 AM","College level","College level","College level",0,"UH: elig","Waiver",3.8,33,4,13,"FR - France (s756)","PSY","BSW_SOWO","BS_PSYPGSC","Chloe","Amy","None",0,"Final HS Tran upon Graduation","FC-Freshman Tentative Accept","","Fall 2019","2000-12-31","","3@mtmail.mtsu.edu","3@gmail.com","(423) 618-0000","(423) 618-0000","",29,34]
[3,"M00000003","This is sample data. The purple button will paste over it. Just ignore it for now!","","","Y","N","F","Jones, Abigail","Nursing Candidate","2/10:30 AM","MATH 1010K/1530K/1710K","College level","College level",0,"Formula: N","",4,21,3.33,6,"PO - Portugal (s751)","SOWO"," ","BSN_NURSPREN","Eileen","Chloe","None",0,"Final HS Tran upon Graduation","FC-Freshman Tentative Accept","","Fall 2019","2001-08-26","Assigned advisor based on primary major","4@mtmail.mtsu.edu","4@gmail.com","(615) 822-0000",0,"N",17,22]
[4,"M00000004","This is sample data. The purple button will paste over it. Just ignore it for now!","","","","N","F","Jones, Briana","PREN--Psychology","3/11:00 AM",0,0,0,0,"Formula: N","",3.29,22,"","","VE - Venezuela (s759)","PSY","BS_PSY","BS_PSY","Chloe","Stacey","None",0,"Final HS Tran upon Graduation","LC-Freshman Tentative Admission","","Fall 2019","2001-03-09","","5@mtmail.mtsu.edu","5@gmail.com","(615) 319-0000","(615) 594-0000","",21,19]
[5,"M00000005","This is sample data. The purple button will paste over it. Just ignore it for now!","","","","N","F","Jones, Christina","LSTS","1/10:00 AM","SAILS","College level","College level","College level","Formula: N","",3.22,20,"","","BZ - Belize (s139)","HHP","BS-LSTS","AFC-YAFCYGEC","Dauthan","Amy","None",0,"Final HS Tran upon Graduation","FC-Freshman Tentative Accept","","Fall 2019","2001-03-26","","6@mtmail.mtsu.edu","6@gmail.com","(330) 531-0000","(330) 531-0000","",20,20]
[6,null,""]
[7,null,"","","","","","","","","","","","","","","","","","","","","","","","","","","","","","","","","","","","","","","",""]
[8]
[9]
[10]
[11]
[12]
[13]
[14]
[15]
[]
[null,"Customs Students",null,null,null,null,null,null,null,null,null,"Prescribeds: (Math / Writing / Reading / StSkills / NDRT)",null,null,null,"Academics:",null,null,null,null,null,"Country/group:",null,"Majors:",null,"Advisors:",null,null,null,null,null,null,null,null,null,"Contact info:",null,null,null,"Nursing eligibility:"]
["tabs","M#","Deleted","SAcad","VetOrDep","PREN","1stGen","FR/TR","StudentName","Major","Order/Time","PrescribedCrsMath","PrescribedCrsWriting","PrescribedCrsReading","PrescribedCrsStudySkills","HonorsElig","ACTEngl","HighSchoolGPA","ACTCompositeScore","InclusiveGPA","HrsEarned","CountrySlot","CUSTOMSGrp","CustomsPOS","BannerPOS","Assigned Advisor","CUSTOMS Advisor","Holds","RegistrationRestrictions","MissingChecklistItems","AdmissionDecision","ReverseTransfer","TermDesc","DateofBirth","Notes","MTSUEmail","PersonalEmail","PermPhone","MailingPhone","NursElig","ACTMathScre","ACTScienceScre"]
["A","M00000002","This is sample data. The purple button will paste over it. Just ignore it for now!","","","","N","F","Cook, Alan","Psychology (Pre-Grad)","4/11:30 AM","College level","College level","College level",0,"UH: elig","Waiver",3.8,33,4,13,"FR - France (s756)","PSY","BS_PSYPGSC","BS_PSYPGSC","Chloe","Amy","None",0,"Final HS Tran upon Graduation","FC-Freshman Tentative Accept","","Fall 2019","2000-12-31","","3@mtmail.mtsu.edu","3@gmail.com","(423) 618-0000","(423) 618-0000","",29,34]
["B","M00000003","This is sample data. The purple button will paste over it. Just ignore it for now!","","","Y","N","F","Jones, Abigail","Nursing Candidate","2/10:30 AM","MATH 1010K/1530K/1710K","College level","College level",0,"Formula: N","",4,21,3.33,6,"PO - Portugal (s751)","NURS","BSN_NURSPREN","BSN_NURSPREN","Eileen","Chloe","None",0,"Final HS Tran upon Graduation","FC-Freshman Tentative Accept","","Fall 2019","2001-08-26","Assigned advisor based on primary major","4@mtmail.mtsu.edu","4@gmail.com","(615) 822-0000",0,"N",17,22]
["C","M00000004","This is sample data. The purple button will paste over it. Just ignore it for now!","","","","N","F","Jones, Briana","PREN--Psychology","3/11:00 AM",0,0,0,0,"Formula: N","",3.29,22,"","","VE - Venezuela (s759)","PSY","BS_PSY","BS_PSY","Bonnie","Stacey","None",0,"Final HS Tran upon Graduation","LC-Freshman Tentative Admission","","Fall 2019","2001-03-09","","5@mtmail.mtsu.edu","5@gmail.com","(615) 319-0000","(615) 594-0000","",21,19]
["D",null,"","","","","","","","","","","","","","","","","","","","","","","","","","","","","","","","","","","","","","","",""]
["E",null,"","","","","","","","","","","","","","","","","","","","","","","","","","","","","","","","","","","","","","","",""]
["F"]
["G"]
["H"]
[]
["Manually added students: (Copy-paste here to avoid losing this data with the newest list-paste!!)"]
[]
[]
["General To-Do List (optional)",null,null,null,null,null,null,"Early:","Late group/all:"]
[null,"Task",null,null,null,null,null,"Done","Done"]
["Before","Check for summer admits"]
[null,"Send welcome email"]
[null,"Prep caseload group"]
[null,"Give folders to Customs advisors",null,null,null,null,null,null,null,"Who:"]
["After","Advising reports and messages on SSC",null,null,null,null,null,null,null,"Just the students I saw"]
[null,"Change of major forms via PipelineMT",null,null,null,null,null,null,null,"Just the students I saw"]
[null,"Notify advisors of major changes or other notes",null,null,null,null,null,null,null,"Just the students I saw"]
[null,"BUAF forms on V drive",null,null,null,null,null,null,null,"Any vet benefit recipients on my caseload"]
[null,"Assign advisor on SGAADVR",null,null,null,null,null,null,null,"All students on my caseload"]
[null,"Add students to caseload spreadsheet",null,null,null,null,null,null,null,"All students on my caseload"]
[]
["Changes of Major (green = data pulled in for you, yellow = look up the data and type it in)"]
["All stus","Change?","Fname","M#","CustomsPOS","BannerPOS","Athlete","Vet","ACM?","Notes on majors/minors","Notes","COM Done","AdvNote?","Contacted advisor"]
[{"$f":"A21","v":"A"},{"$f":"IF(A!$K$1<>\"\",A!$K$1,\"n/a\")","v":"n/a"},{"$f":"IFERROR(IFERROR(MID(B21,SEARCH(\" \",I21,1)+1,SEARCH(\" \",I21,SEARCH(\" \",I21,1)+1)-SEARCH(\" \",I21,1)-1),MID(I21,FIND(\" \",I21)+1,256)),\"\")","v":"Alan"},{"$f":"B21","v":"M00000002"},{"$f":"X21","v":"BS_PSYPGSC"},{"$f":"Y21","v":"BS_PSYPGSC"},null,{"$f":"E21","v":""},null,null,null,null,{"$f":"IF(A!$K$2<>\"\",A!$K$2,\"n/a\")","v":"n/a"}]
["B",{"$f":"IF(B!$K$1<>\"\",B!$K$1,\"n/a\")","v":"n/a"},{"$f":"IFERROR(IFERROR(MID(B22,SEARCH(\" \",I22,1)+1,SEARCH(\" \",I22,SEARCH(\" \",I22,1)+1)-SEARCH(\" \",I22,1)-1),MID(I22,FIND(\" \",I22)+1,256)),\"\")","v":"Abigail"},{"$f":"B22","v":"M00000003"},{"$f":"X22","v":"BSN_NURSPREN"},{"$f":"Y22","v":"BSN_NURSPREN"},null,{"$f":"E22","v":""},null,null,null,null,{"$f":"IF(B!$K$2<>\"\",B!$K$2,\"n/a\")","v":"n/a"}]
["C",{"$f":"IF('C'!$K$1<>\"\",'C'!$K$1,\"n/a\")","v":"n/a"},"Briana",{"$f":"B23","v":"M00000004"},"BS_PSY","BS_PSY",null,"",null,null,null,null,{"$f":"IF('C'!$K$2<>\"\",'C'!$K$2,\"n/a\")","v":"n/a"}]
["D",{"$f":"IF(D!$K$1<>\"\",D!$K$1,\"n/a\")","v":"n/a"},"",0,"","",null,"",null,null,null,null,{"$f":"IF(D!$K$2<>\"\",D!$K$2,\"n/a\")","v":"n/a"}]
["E",{"$f":"IF(E!$K$1<>\"\",E!$K$1,\"n/a\")","v":"n/a"},"",0,"","",null,"",null,null,null,null,{"$f":"IF(E!$K$2<>\"\",E!$K$2,\"n/a\")","v":"n/a"}]
["F",{"$f":"IF(F!$K$1<>\"\",F!$K$1,\"n/a\")","v":"n/a"},"",0,0,0,null,0,null,null,null,null,{"$f":"IF(F!$K$2<>\"\",F!$K$2,\"n/a\")","v":"n/a"}]
["G",{"$f":"IF(G!$K$1<>\"\",G!$K$1,\"n/a\")","v":"n/a"},"",0,0,0,null,0,null,null,null,null,{"$f":"IF(G!$K$2<>\"\",G!$K$2,\"n/a\")","v":"n/a"}]
["H",{"$f":"IF(H!$K$1<>\"\",H!$K$1,\"n/a\")","v":"n/a"},"",0,0,0,null,0,null,null,null,null,{"$f":"IF(H!$K$2<>\"\",H!$K$2,\"n/a\")","v":"n/a"}]

{"sheet":"1","index":2,"n_rows":91,"n_cols":20,"rows_kept":91,"cut":false,"hidden":false,"merged":[[90,0,114,1],[90,3,114,4],[74,12,80,12],[75,13,76,13],[78,13,79,13],[82,12,91,12],[83,13,84,13],[86,13,87,13],[89,13,90,13],[59,12,71,12],[60,13,61,13],[63,13,64,13],[66,13,67,13],[69,13,70,13],[34,12,43,12],[35,13,36,13],[38,13,39,13],[41,13,42,13],[45,12,57,12],[46,13,47,13],[49,13,50,13],[52,13,53,13],[55,13,56,13],[15,12,24,12],[16,13,17,13],[19,13,20,13],[22,13,23,13],[22,6,27,6],[23,9,26,9],[26,12,32,12],[27,13,28,13],[30,13,31,13],[2,12,12,12],[2,13,3,13],[5,13,6,13],[8,13,9,13],[11,13,12,13],[2,9,5,9],[1,6,6,6],[8,6,13,6],[9,9,12,9],[15,6,20,6],[16,9,19,9],[14,0,15,0],[14,1,15,1],[64,6,68,10],[44,6,47,10],[50,9,53,9],[56,6,61,6],[57,9,60,9],[49,6,54,6],[29,6,34,6],[30,9,33,9],[36,6,41,6],[37,9,40,9],[14,3,15,3],[14,4,15,4]]}
["Contact & Demographic Info",null,null,"Academic Info",null,null,"Pre-Customs To-Do List",null,null,{"$f":"CONCATENATE($B$2,\" (\",$B$3,\")\"&\", \"&B21)","v":"Brenda Smith (M00000001), Psychology--Pre-Grad"},null,null,"Pre-Customs Task Guide",null,null,null,null,"M#",{"$f":"'My Students'!B3","v":"M00000001"}]
["Name",{"$f":"CONCATENATE(A20,\" \",B20)","v":"Brenda Smith"},null,"Transferred hours",{"$f":"INDEX($S:$S,MATCH(\"HrsEarned\",$R:$R,0))","v":28},null,"General",null,null,null,null,null,null,"Task","Where to find info / What to check",null,null,"Deleted",{"$f":"INDEX('My Students'!$2:$16,MATCH($S$1,'My Students'!$B$2:$B$16,0),MATCH(R2,'My Students'!$2:$2,0))","v":"This is sample data. The purple button will paste over it. Just ignore it for now!"}]
["M#",{"$f":"S1","v":"M00000001"},null,"HS GPA",{"$f":"INDEX($S:$S,MATCH(\"HighSchoolGPA\",$R:$R,0))","v":3.95},null,null,null,"Make stu folder in Z drive",null,null,null,"General","Make stu folder in Z drive","Naming scheme: <major> <conc> <last>, <first> <M#>",null,null,"SAcad",{"$f":"INDEX('My Students'!$2:$16,MATCH($S$1,'My Students'!$B$2:$B$16,0),MATCH(R3,'My Students'!$2:$2,0))","v":"reg"}]
["MTSUEmail",{"$f":"INDEX($S:$S,MATCH(A4,$R:$R,0))","v":"2@mtmail.mtsu.edu"},null,"Inclusive GPA",{"$f":"INDEX($S:$S,MATCH(\"InclusiveGPA\",$R:$R,0))","v":3.9161999999999999},null,null,null,"Check admit term",null,null,null,null,null,"e.g., CRJU LAEN Smith, John M01234567",null,null,"VetOrDep",{"$f":"INDEX('My Students'!$2:$16,MATCH($S$1,'My Students'!$B$2:$B$16,0),MATCH(R4,'My Students'!$2:$2,0))","v":""}]
["PersonalEmail",{"$f":"INDEX($S:$S,MATCH(A5,$R:$R,0))","v":"2@aol.com"},null,"ACT Math",{"$f":"INDEX($S:$S,MATCH(\"ACTMathScre\",$R:$R,0))","v":20},null,null,null,"Major",null,null,null,null,null,null,null,null,"PREN",{"$f":"INDEX('My Students'!$2:$16,MATCH($S$1,'My Students'!$B$2:$B$16,0),MATCH(R5,'My Students'!$2:$2,0))","v":""}]
["PermPhone",{"$f":"INDEX($S:$S,MATCH(A6,$R:$R,0))","v":0},null,"ACT Science",{"$f":"INDEX($S:$S,MATCH(\"ACTScienceScre\",$R:$R,0))","v":22},null,null,null,"Acad standing (TRs only)",null,null,null,null,"Check admit term","SAAADMS, Customs chart--\"Flags\"",null,null,"1stGen",{"$f":"INDEX('My Students'!$2:$16,MATCH($S$1,'My Students'!$B$2:$B$16,0),MATCH(R6,'My Students'!$2:$2,0))","v":"N"}]
["MailingPhone",{"$f":"INDEX($S:$S,MATCH(A7,$R:$R,0))","v":"(615) 556-0000"},null,"CustomsPOS",{"$f":"INDEX($S:$S,MATCH(D7,$R:$R,0))","v":"BS_PSYPGSC"},null,null,null,null,null,null,null,null,null,"If summer: Verify w/ stu before Customs",null,null,"ReverseTransfer",{"$f":"INDEX('My Students'!$2:$16,MATCH($S$1,'My Students'!$B$2:$B$16,0),MATCH(R7,'My Students'!$2:$2,0))","v":""}]
[null,null,null,null,{"$f":"INDEX('Data Lists'!$B:$B,MATCH($E$7,'Data Lists'!$A:$A,0))","v":"Psychology--Pre-Grad"},null,null,null,null,null,null,null,null,null,null,null,null,"FR/TR",{"$f":"INDEX('My Students'!$2:$16,MATCH($S$1,'My Students'!$B$2:$B$16,0),MATCH(R8,'My Students'!$2:$2,0))","v":"F"}]
["Customs Info",null,null,"BannerPOS",{"$f":"INDEX($S:$S,MATCH(D9,$R:$R,0))","v":"BS_PSYPGSC"},null,"Special Pops",null,null,null,null,null,null,"Major","SGASTDN, Customs chart--\"Academic\" (& updates from stu)",null,null,"StudentName",{"$f":"INDEX('My Students'!$2:$16,MATCH($S$1,'My Students'!$B$2:$B$16,0),MATCH(R9,'My Students'!$2:$2,0))","v":"Smith, Brenda"}]
["CountrySlot",{"$f":"INDEX(S:S,MATCH(A10,R:R,0))","v":"FR - France (s756)"},null,"Majors match?",{"$f":"IF(AND(E11=\"\",E7=E9),\"Y\",\"N, Submit change of major\")","v":"Y"},null,null,null,"Vet benefits",null,null,null,null,null,null,null,null,"Major",{"$f":"INDEX('My Students'!$2:$16,MATCH($S$1,'My Students'!$B$2:$B$16,0),MATCH(R10,'My Students'!$2:$2,0))","v":"Psychology (Pre-Grad)"}]
["Order/Time",{"$f":"CONCATENATE(INDEX(S:S,MATCH(A11,R:R,0)),\" (\",LEFT(S23,2),\")\")","v":"2/10:30 AM (PS)"},null,"Override major",null,null,null,null,"Student athlete",null,null,null,null,null,null,null,null,"Order/Time",{"$f":"INDEX('My Students'!$2:$16,MATCH($S$1,'My Students'!$B$2:$B$16,0),MATCH(R11,'My Students'!$2:$2,0))","v":"2/10:30 AM"}]
["Acad Advisor",{"$f":"INDEX($S:$S,MATCH(\"Assigned Advisor\",$R:$R,0))","v":"Amy"},null,null,null,null,null,null,"Pre-Professional",null,null,null,null,"Acad standing (TRs only)","SHATERM, SAAADMS, Transcript",null,null,"PrescribedCrsMath",{"$f":"INDEX('My Students'!$2:$16,MATCH($S$1,'My Students'!$B$2:$B$16,0),MATCH(R12,'My Students'!$2:$2,0))","v":"College level"},{"$f":"IF(S12=\"college level\",\"n\",IF(S12=0,\"blank--check\",\"y\"))","v":"n"}]
["Customs Advisor",{"$f":"INDEX($S:$S,MATCH(\"Customs Advisor\",$R:$R,0))","v":"Jennifer"},null,"Factors in Choosing Classes",null,null,null,null,null,null,null,null,null,null,"Probation on SHATERM? Must take U2020, meet GPA reqs 1st sem.",null,null,"PrescribedCrsWriting",{"$f":"INDEX('My Students'!$2:$16,MATCH($S$1,'My Students'!$B$2:$B$16,0),MATCH(R13,'My Students'!$2:$2,0))","v":"College level"},{"$f":"IF(S13=\"college level\",\"n\",IF(S13=0,\"blank--check\",\"y\"))","v":"n"}]
[null,null,null,"Honors",{"$f":"INDEX($S:$S,MATCH(\"HonorsElig\",$R:$R,0))","v":"UH: elig"},null,null,null,null,null,null,null,null,null,null,null,null,"PrescribedCrsReading",{"$f":"INDEX('My Students'!$2:$16,MATCH($S$1,'My Students'!$B$2:$B$16,0),MATCH(R14,'My Students'!$2:$2,0))","v":"College level"},{"$f":"IF(S14=\"college level\",\"n\",IF(S14=0,\"blank--check\",\"y\"))","v":"n"}]
["Emily's Notes",{"$f":"INDEX($S:$S,MATCH(\"Notes\",$R:$R,0))","v":""},null,"Prescribeds",{"$f":"IF(AND(T12=\"n\",T13=\"n\",T14=\"n\"),\"\",\nCONCATENATE(\"Ks: \"&IF(T12=\"y\",S12,\"\")&IF(T13=\"y\",\", \",\"\")&IF(T12=\"blank--check\",\"Math--check; \",\"\")&\nIF(T13=\"y\",\"ENGL\",\"\")&IF(T14=\"y\",\", \",\"\")&IF(T13=\"blank--check\",\"Engl--check; \",\"\")&\nIF(T14=\"y\",\"READ\",\"\")&IF(T15=\"y\",\", \",\"\")&IF(T14=\"blank--check\",\"Read--check; \",\"\")&\nIF(T15=\"y\",\"U1010\",\"\")))","v":""},null,null,null,null,null,null,null,null,null,null,null,null,"PrescribedCrsStudySkills",{"$f":"INDEX('My Students'!$2:$16,MATCH($S$1,'My Students'!$B$2:$B$16,0),MATCH(R15,'My Students'!$2:$2,0))","v":0},{"$f":"IF((T12<>\"n\")+(T13=\"y\")+(T14=\"y\")>=2,\"y\",\"n\")","v":"n"}]
[null,null,null,null,null,null,"Reg Issues",null,null,null,null,null,"Special Pops","Task","Where to find info / What to check",null,null,"HonorsElig",{"$f":"INDEX('My Students'!$2:$16,MATCH($S$1,'My Students'!$B$2:$B$16,0),MATCH(R16,'My Students'!$2:$2,0))","v":"UH: elig"}]
[null,null,null,"Scholars Acad",{"$f":"INDEX($S:$S,MATCH(\"Sacad\",$R:$R,0))","v":"reg"},null,null,null,"Immunization issues?",null,null,null,null,"Vet benefits","SAAQUAN, SGASTDN, SPAIDEN, Customs chart--\"Flags\", ask student",null,null,"ACTEngl",{"$f":"INDEX('My Students'!$2:$16,MATCH($S$1,'My Students'!$B$2:$B$16,0),MATCH(R17,'My Students'!$2:$2,0))","v":""}]
["Copy-Pastes & Folder Links",null,null,"Pre-Nursing",{"$f":"INDEX($S:$S,MATCH(\"PREN\",$R:$R,0))","v":""},null,null,null,"Holds",null,null,null,null,null,"Need a BUAF form?  (FYI: Flag on Customs list doesn't always mean getting vet benefits!!)",null,null,"HighSchoolGPA",{"$f":"INDEX('My Students'!$2:$16,MATCH($S$1,'My Students'!$B$2:$B$16,0),MATCH(R18,'My Students'!$2:$2,0))","v":3.95}]
[{"$f":"INDEX(S:S,MATCH(\"StudentName\",R:R,0))","v":"Smith, Brenda"},{"$f":"S1","v":"M00000001"},null,"ACTEngl",{"$f":"INDEX($S:$S,MATCH(\"ACTEngl\",$R:$R,0))","v":""},null,null,null,null,null,null,null,null,null,null,null,null,"ACTCompositeScore",{"$f":"INDEX('My Students'!$2:$16,MATCH($S$1,'My Students'!$B$2:$B$16,0),MATCH(R19,'My Students'!$2:$2,0))","v":25}]
[{"$f":"IFERROR(MID(A19,SEARCH(\" \",A19,1)+1,SEARCH(\" \",A19,SEARCH(\" \",A19,1)+1)-SEARCH(\" \",A19,1)-1),MID(A19,FIND(\" \",A19)+1,256))","v":"Brenda"},{"$f":"CONCATENATE(LEFT(A19,FIND(\", \",A19,1)-1))","v":"Smith"},null,null,null,null,null,null,null,null,null,null,null,"Student athlete","SGASPRT (Also on main Customs spreadsheet but not sure if accurate)",null,null,"InclusiveGPA",{"$f":"INDEX('My Students'!$2:$16,MATCH($S$1,'My Students'!$B$2:$B$16,0),MATCH(R20,'My Students'!$2:$2,0))","v":3.9161999999999999}]
["Major name",{"$f":"CONCATENATE(IF(E11=\"\",INDEX('Data Lists'!$B:$B,MATCH($E$7,'Data Lists'!$A:$A,0)),INDEX('Data Lists'!$B:$B,MATCH($E$11,'Data Lists'!$B:$B,0)))&IF(E18=\"Y\",\" (PREN)\",\"\"))","v":"Psychology--Pre-Grad"},null,"Flags",null,null,null,null,null,null,null,null,null,null,"Stu meet with SAEC advisor; Scheduling challenges; Major changes approved through SAEC",null,null,"HrsEarned",{"$f":"INDEX('My Students'!$2:$16,MATCH($S$1,'My Students'!$B$2:$B$16,0),MATCH(R21,'My Students'!$2:$2,0))","v":28}]
["Folder name",{"$f":"IF(E11=\"\",CONCATENATE(INDEX('Data Lists'!$E:$E,MATCH($E$7,'Data Lists'!$A:$A,0)),\" \",B20,\", \",A20,\" \",B3),CONCATENATE(INDEX('Data Lists'!$E:$E,MATCH($E$11,'Data Lists'!$B:$B,0)),\" \",B20,\", \",A20,\" \",B3))","v":"PSY PGSC Smith, Brenda M00000001"},null,"Holds",{"$f":"INDEX($S:$S,MATCH(D22,$R:$R,0))","v":"None"},null,null,null,null,null,null,null,null,null,null,null,null,"CountrySlot",{"$f":"INDEX('My Students'!$2:$16,MATCH($S$1,'My Students'!$B$2:$B$16,0),MATCH(R22,'My Students'!$2:$2,0))","v":"FR - France (s756)"}]
["Dept folders",{"$f":"HYPERLINK(CONCATENATE(\"Z:\\CoBHS Advising\\Departments\\\",IF(E11=\"\",INDEX('Data Lists'!D:D,MATCH(E7,'Data Lists'!A:A,0)),INDEX('Data Lists'!D:D,MATCH(E11,'Data Lists'!B:B,0))),\"\\Student Forms\\\"))","v":"Z:\\CoBHS Advising\\Departments\\Psychology\\Student Forms\\"},null,"Reg Restrictions",{"$f":"INDEX($S:$S,MATCH(\"RegistrationRestrictions\",$R:$R,0))","v":0},null,"Transcripts",null,null,null,null,null,null,"Pre-Professional","May not know until stu or CBAS reports to us; ask in welcome email!",null,null,"CUSTOMSGrp",{"$f":"INDEX('My Students'!$2:$16,MATCH($S$1,'My Students'!$B$2:$B$16,0),MATCH(R23,'My Students'!$2:$2,0))","v":"PSY"}]
["Stu folder",{"$f":"HYPERLINK(CONCATENATE(\"Z:\\CoBHS Advising\\Departments\\\",IF(E11=\"\",INDEX('Data Lists'!D:D,MATCH(E7,'Data Lists'!A:A,0)),INDEX('Data Lists'!D:D,MATCH(E11,'Data Lists'!B:B,0))),\"\\Student Forms\\\",B22))","v":"Z:\\CoBHS Advising\\Departments\\Psychology\\Student Forms\\PSY PGSC Smith, Brenda M00000001"},null,"Immunizations",{"$f":"INDEX($S:$S,MATCH(\"RegistrationRestrictions\",$R:$R,0))","v":0},null,null,null,"Prior schools",null,null,null,null,null,"Provide Pre-Prof info packet and info session flyer",null,null,"CustomsPOS",{"$f":"INDEX('My Students'!$2:$16,MATCH($S$1,'My Students'!$B$2:$B$16,0),MATCH(R24,'My Students'!$2:$2,0))","v":"BS_PSYPGSC"}]
[null,null,{"$f":"YEARFRAC(S33,NOW())","v":17.894444444444446},"Under 18 & Imm",{"$f":"IF(C25>=18,\"OK--over 18\",\"If need imms, will need parent sig\")","v":"If need imms, will need parent sig"},null,null,null,"Missing classes/transcripts",null,null,null,null,null,null,null,null,"BannerPOS",{"$f":"INDEX('My Students'!$2:$16,MATCH($S$1,'My Students'!$B$2:$B$16,0),MATCH(R25,'My Students'!$2:$2,0))","v":"BS_PSYPGSC"}]
[null,null,null,"Missing Items",{"$f":"INDEX($S:$S,MATCH(\"MissingChecklistItems\",$R:$R,0))","v":0},null,null,null,"Subs needed",null,null,null,null,null,null,null,null,"Assigned Advisor",{"$f":"INDEX('My Students'!$2:$16,MATCH($S$1,'My Students'!$B$2:$B$16,0),MATCH(R26,'My Students'!$2:$2,0))","v":"Amy"}]
[null,null,null,"Term",{"$f":"INDEX($S:$S,MATCH(\"TermDesc\",$R:$R,0))","v":"Fall 2019"},null,null,null,null,null,null,null,"Reg Issues","Task","Where to find info / What to check",null,null,"Customs Advisor",{"$f":"INDEX('My Students'!$2:$16,MATCH($S$1,'My Students'!$B$2:$B$16,0),MATCH(R27,'My Students'!$2:$2,0))","v":"Jennifer"}]
[null,null,null,"Might need BUAF",{"$f":"INDEX($S:$S,MATCH(\"VetOrDep\",$R:$R,0))","v":""},null,null,null,null,null,null,null,null,"Immunization issues?","Banner: SZAITRK",null,null,"Holds",{"$f":"INDEX('My Students'!$2:$16,MATCH($S$1,'My Students'!$B$2:$B$16,0),MATCH(R28,'My Students'!$2:$2,0))","v":"None"}]
[null,null,null,"Reverse Transfer",{"$f":"INDEX($S:$S,MATCH(\"ReverseTransfer\",$R:$R,0))","v":""},null,null,null,null,null,null,null,null,null,"Missing imm docs, under 18--need parent form",null,null,"RegistrationRestrictions",{"$f":"INDEX('My Students'!$2:$16,MATCH($S$1,'My Students'!$B$2:$B$16,0),MATCH(R29,'My Students'!$2:$2,0))","v":0}]
[null,null,null,"First Generation",{"$f":"INDEX($S:$S,MATCH(\"1stGen\",$R:$R,0))","v":"N"},null,"Course Types",null,null,null,null,null,null,null,null,null,null,"MissingChecklistItems",{"$f":"INDEX('My Students'!$2:$16,MATCH($S$1,'My Students'!$B$2:$B$16,0),MATCH(R30,'My Students'!$2:$2,0))","v":0}]
["Want to add a link to the student's folder? ",null,null,null,null,null,null,null,"Prescribeds",null,null,null,null,"Holds","SOAHOLD, Customs chart--\"Factors\"",null,null,"AdmissionDecision",{"$f":"INDEX('My Students'!$2:$16,MATCH($S$1,'My Students'!$B$2:$B$16,0),MATCH(R31,'My Students'!$2:$2,0))","v":"LF-Freshman Final Acceptance"}]
["--Click on the \"Stu folder\" field above (B21).",null,null,null,null,null,null,null,"Check RLC options",null,null,null,null,null,null,null,null,"TermDesc",{"$f":"INDEX('My Students'!$2:$16,MATCH($S$1,'My Students'!$B$2:$B$16,0),MATCH(R32,'My Students'!$2:$2,0))","v":"Fall 2019"}]
["--Control-K to start the process of creating a link.",null,null,null,null,null,null,null,"Honors",null,null,null,null,null,null,null,null,"DateofBirth",{"$f":"INDEX('My Students'!$2:$16,MATCH($S$1,'My Students'!$B$2:$B$16,0),MATCH(R33,'My Students'!$2:$2,0))","v":"2002-03-08"}]
["--Browse to the student's folder.",null,null,null,null,null,null,null,"Pre-Nursing",null,null,null,null,null,null,null,null,"Notes",{"$f":"INDEX('My Students'!$2:$16,MATCH($S$1,'My Students'!$B$2:$B$16,0),MATCH(R34,'My Students'!$2:$2,0))","v":""}]
["--Choose any file in the folder and double-click on it.",null,null,null,null,null,null,null,null,null,null,null,"Check Transcripts","Task","Where to find info / What to check",null,null,"MTSUEmail",{"$f":"INDEX('My Students'!$2:$16,MATCH($S$1,'My Students'!$B$2:$B$16,0),MATCH(R35,'My Students'!$2:$2,0))","v":"2@mtmail.mtsu.edu"}]
["--In the Address box, delete the file name (back to the \\ after the folder name).",null,null,null,null,null,null,null,null,null,null,null,null,"Prior schools","Banner: SOAPCOL / Pipeline: Prior College Info",null,null,"PersonalEmail",{"$f":"INDEX('My Students'!$2:$16,MATCH($S$1,'My Students'!$B$2:$B$16,0),MATCH(R36,'My Students'!$2:$2,0))","v":"2@aol.com"}]
["--Click OK.",null,null,null,null,null,"Major-Specific",null,null,null,null,null,null,null,null,null,null,"PermPhone",{"$f":"INDEX('My Students'!$2:$16,MATCH($S$1,'My Students'!$B$2:$B$16,0),MATCH(R37,'My Students'!$2:$2,0))","v":0}]
["--Now you should see the path to the folder, underlined as a link.",null,null,null,null,null,null,null,null,null,null,null,null,null,null,null,null,"MailingPhone",{"$f":"INDEX('My Students'!$2:$16,MATCH($S$1,'My Students'!$B$2:$B$16,0),MATCH(R38,'My Students'!$2:$2,0))","v":"(615) 556-0000"}]
["--When you click on your link, the folder should open in a separate window.",null,null,null,null,null,null,null,null,null,null,null,null,"Missing classes/ transcripts","BDMS (Banner: SAAADMS, click search icon) / Pline: Transfer Eval / Ask stu in welcome email",null,null,"NursElig",{"$f":"INDEX('My Students'!$2:$16,MATCH($S$1,'My Students'!$B$2:$B$16,0),MATCH(R39,'My Students'!$2:$2,0))","v":""}]
[null,null,null,null,null,null,null,null,null,null,null,null,null,null,"FRs: AP, IB, DE, Dual Credit, Cambridge  /  TRs: Sems in progress or missing from MT transcript",null,null,"ACTMathScre",{"$f":"INDEX('My Students'!$2:$16,MATCH($S$1,'My Students'!$B$2:$B$16,0),MATCH(R40,'My Students'!$2:$2,0))","v":20}]
[null,null,null,null,null,null,null,null,null,null,null,null,null,null,null,null,null,"ACTScienceScre",{"$f":"INDEX('My Students'!$2:$16,MATCH($S$1,'My Students'!$B$2:$B$16,0),MATCH(R41,'My Students'!$2:$2,0))","v":22}]
[null,null,null,null,null,null,null,null,null,null,null,null,null,"Subs needed","By comparing transcript, transfer eval, & UD form.  Use TES for course descriptions.",null,null,"A&P?",{"$f":"IF(S1<>\"\",IF(OR(AND(S40=21,S41>21),AND(S40>21,S41=21)),\"maybe\",IF(AND(S31>=21,S41>=21),\"Y\",\"N\")),\"\")","v":"Y"}]
[null,null,null,null,null,null,null,null,null,null,null,null,null,null,"Any classes that might/should count but aren't?",null,null,"Major by Look-up",{"$f":"INDEX('Data Lists'!B:B,MATCH(S24,'Data Lists'!A:A,0))","v":"Psychology--Pre-Grad"}]
[null,null,null,null,null,null,"Notes:",null,null,null,null,null,null,null,null,null,null,"NameM#",{"$f":"CONCATENATE(S47,\", \",S46,\" \",S45)","v":"Smith, Brenda M00000001"}]
[null,null,null,null,null,null,null,null,null,null,null,null,"Pre-Customs Task Guide--Page 2",null,null,null,null,"M# copy",{"$f":"S1","v":"M00000001"}]
[null,null,null,null,null,null,null,null,null,null,null,null,"Specific Course Types","Task","Where to find info / What to check",null,null,"Fname",{"$f":"IF(1<>\"\",IFERROR(MID(S9,SEARCH(\" \",S9,1)+1,SEARCH(\" \",S9,SEARCH(\" \",S9,1)+1)-SEARCH(\" \",S9,1)-1),MID(S9,FIND(\" \",S9)+1,256)),\"\")","v":"Brenda"}]
[null,null,null,null,null,null,null,null,null,null,null,null,null,"Prescribeds","Compare SZAADEF and SOATEST scores",null,null,"Lname",{"$f":"IF(S1<>\"\",CONCATENATE(LEFT(S9,FIND(\", \",S9,1)-1)),\"\")","v":"Smith"}]
[null,null,null,null,null,null,null,null,null,null,null,null,null,null,"Do they match? What K classes are required?  (\"SAILS Math\"=1010 or 1530 non-K or 1710K)"]
[null,null,null,null,null,null,"Post-Customs To-Do List",null,null,{"$f":"CONCATENATE($B$2,\" (\",$B$3,\")\")","v":"Brenda Smith (M00000001)"}]
[null,null,null,null,null,null,"General",null,null,null,null,null,null,"Check RLC options","Based on class list"]
[null,null,null,null,null,null,null,null,"Assign advisor in Banner",null,null,null,null,null,"Must use for students who need READ 1000K/HIST 2020. May recommend for other students."]
[null,null,null,null,null,null,null,null,"Submit appointment report"]
[null,null,null,null,null,null,null,null,null,null,null,null,null,"Honors","Customs chart--\"Factors\" box"]
[null,null,null,null,null,null,null,null,null,null,null,null,null,null,"Is the student eligible to take honors classes? If TR, email Judy Albakry to add honors code."]
[]
[null,null,null,null,null,null,null,null,null,null,null,null,null,"Pre-Nursing","Customs chart--\"Factors\" box"]
[null,null,null,null,null,null,"Special Pops",null,null,null,null,null,null,null,"Do they need different gen eds for PREN vs major?"]
[null,null,null,null,null,null,null,null,"Vet benefits"]
[null,null,null,null,null,null,null,null,"Submit change of major form"]
[null,null,null,null,null,null,null,null,"Send follow-up emails, if needed",null,null,null,"Major-Specific Checks","Task","Where to find info / What to check"]
[null,null,null,null,null,null,null,null,null,null,null,null,null,"Check advising folder","Should have UD form, Reg checklist, anything else specific to major"]
[]
[]
[null,null,null,null,null,null,"Notes:"]
[]
[]
["Copy-Pastes & Folder Links",null,null,"MTSUEmail",{"$f":"B4","v":"2@mtmail.mtsu.edu"}]
[{"$f":"A19","v":"Smith, Brenda"},{"$f":"$S$1","v":"M00000001"},null,"PersonalEmail",{"$f":"B5","v":"2@aol.com"}]
[{"$f":"A20","v":"Brenda"},{"$f":"B20","v":"Smith"},null,"CustomsPOS",{"$f":"E7","v":"BS_PSYPGSC"}]
["Major name",{"$f":"B21","v":"Psychology--Pre-Grad"},null,null,{"$f":"E8","v":"Psychology--Pre-Grad"}]
["Folder name","PSY PGSC Smith, Brenda M00000001",null,"BannerPOS",{"$f":"E9","v":"BS_PSYPGSC"}]
["Dept folders",{"$f":"HYPERLINK(B24)","v":"Z:\\CoBHS Advising\\Departments\\Psychology\\Student Forms\\PSY PGSC Smith, Brenda M00000001"},null,"Majors match?",{"$f":"E10","v":"Y"}]
["Stu folder",{"$f":"HYPERLINK(B25)","v":""},null,"Override major",{"$f":"E11","v":0}]
[null,null,null,"Might need BUAF",{"$f":"E28","v":""},null,null,null,null,null,null,null,"Post-Customs Task Guide"]
[null,null,null,null,null,null,null,null,null,null,null,null,"General","Task","Where to find info / What to check"]
["Start",null,null,"Change major",null,null,null,null,null,null,null,null,null,"Assign advisor in Banner","SGAADVR"]
["Stop",null,null,"Notes for advisor",null,null,null,null,null,null,null,null,null,null,"Our type is COLL; We generally are the primary advisor."]
[]
[null,"Report Builder",null,null,"Student Message Builder",null,null,null,null,null,null,null,null,"Submit appointment report","Navigate (SSC)"]
["Registered","a","see below","Docs attached","x","x (to say that you've attached docs for the student)"]
["Attaching Scan","x","x","Drop/Add info",null,"x (to give info on switching classes & steps to do so)"]
["Submitted COM","x","x","Acad success tips",null,"x (to give acad tips, tutoring & SI websites, & \"ask for help\")"]
["Supp Instructn","x","x","NURS Info Session",null,"x (to refer student to nursing info webpage and session)",null,null,null,null,null,null,"Special Pops","Task","Where to find info / What to check"]
["RTTP","x","x","Check phone #",null,"x (to tell stu their listed ph #s are wrong, & how to fix)",null,null,null,null,null,null,null,"Vet benefits","Submit BUAF"]
["Note 1",null,"x","Advisor info",{"$f":"INDEX('Data Lists'!$J:$J,MATCH($B$12,'Data Lists'!$H:$H,0))","v":"your advisor, Amy (Amy.Foster@mtsu.edu)"},"(leave formula, or type \"me <email>\")",null,null,null,null,null,null,null,null,"Form: Z:> Advising> Advising Forms> \"VA Benefit User Adv Form\"; Submit: V drive along w/ UD form"]
["Other","asdgf","[notes]","Other",null,"[type any notes to student]"]
["Paste in advising report:",{"$f":"CONCATENATE(\"Student came for advising during Customs.\",IF(B81<>\"\",\"  Attaching scanned copy of notes.\",\"\"),IF(B80=\"a\",Messages!$C$2,IF(B80=\"b\",Messages!$C$3,IF(B80<>\"\",CONCATENATE(\"  Registered student for classes for upcoming semester: \",B80),\"\"))),IF(B86<>\"\",CONCATENATE(\"\n\n\",B86),\"\"),IF(B82<>\"\",\"\n\nSubmitted change of major form. \",\"\"),IF(B83<>\"\",Messages!$C$4,\"\"),IF(B84<>\"\",Messages!$C$5,\"\"),IF(B85<>\"\",Messages!$C$6,\"\"))","v":"Student came for advising during Customs.  Attaching scanned copy of notes.  Student self-registered for classes in computer lab setting on Day 2, following Registration Checklist provided in advising folder on Day 1. See Registration Checklist for list of recommended courses.\n\nasdgf\n\nSubmitted change of major form. \n\nEncouraged student to attend Supplemental Instruction sessions, provided SI website.  \n\nRecommended Reacting to the Past (RTTP) sections of History.  "},null,"Paste in stu msg:",{"$f":"CONCATENATE(\"We enjoyed seeing you at the CBHS Advising Center Customs session today, \",$A$21,\"!  \",IF(E80=\"x\",\"I've attached your Registration Checklist, for your records.\",\"\"),IF(E86<>\"\",CONCATENATE(\"\n\n\",E86),\"\"),IF(E81=\"x\",CONCATENATE(Messages!$C$7&E85&\", before making changes.\"),\"\"),IF(E84=\"x\",Messages!$C$10,\"\"),IF(E82=\"x\",Messages!$C$8,\"\"),IF(E83<>\"\",Messages!$C$9,\"\"),CONCATENATE(\"\n\nIf you have any questions or concerns, please contact \"&E85&\".  You'll also want to plan to come in for an advising appointment around mid-terms each semester, to talk about your classes for the upcoming term.  You can find Instructions and Schedule links at mtsu.edu/cbhsadv. \"),\"\n\nWe look forward to seeing you at MTSU this semester!\n\n\",$B$2,\"\n\",$B$3)","v":"We enjoyed seeing you at the CBHS Advising Center Customs session today, Major name!  I've attached your Registration Checklist, for your records.\n\nIf you have any questions or concerns, please contact your advisor, Amy (Amy.Foster@mtsu.edu).  You'll also want to plan to come in for an advising appointment around mid-terms each semester, to talk about your classes for the upcoming term.  You can find Instructions and Schedule links at mtsu.edu/cbhsadv. \n\nWe look forward to seeing you at MTSU this semester!\n\nBrenda Smith\nM00000001"},null,null,null,null,null,null,null,null,"Submit change of major form","(If applicable)  Pipeline > Bottom of Advisor menu"]
["\"Registered\" choices: \"a\" to get message re stu registering in lab, \"b\" to get message re helping stu register in office, or type list of classes to be inserted."]
[]
["This is what it will say:",null,null,"This is what it will say:",null,null,null,null,null,null,null,null,null,"Send follow-up emails","(if needed)"]
[{"$f":"B87","v":"Student came for advising during Customs.  Attaching scanned copy of notes.  Student self-registered for classes in computer lab setting on Day 2, following Registration Checklist provided in advising folder on Day 1. See Registration Checklist for list of recommended courses.\n\nasdgf\n\nSubmitted change of major form. \n\nEncouraged student to attend Supplemental Instruction sessions, provided SI website.  \n\nRecommended Reacting to the Past (RTTP) sections of History.  "},null,null,{"$f":"E87","v":"We enjoyed seeing you at the CBHS Advising Center Customs session today, Major name!  I've attached your Registration Checklist, for your records.\n\nIf you have any questions or concerns, please contact your advisor, Amy (Amy.Foster@mtsu.edu).  You'll also want to plan to come in for an advising appointment around mid-terms each semester, to talk about your classes for the upcoming term.  You can find Instructions and Schedule links at mtsu.edu/cbhsadv. \n\nWe look forward to seeing you at MTSU this semester!\n\nBrenda Smith\nM00000001"},null,null,null,null,null,null,null,null,null,null,"e.g., To new advisor if student changed major during advising session"]

{"sheet":"2","index":3,"n_rows":91,"n_cols":20,"rows_kept":91,"cut":false,"hidden":false,"merged":[[90,0,114,1],[90,3,114,4],[82,12,91,12],[83,13,84,13],[86,13,87,13],[89,13,90,13],[66,13,67,13],[69,13,70,13],[74,12,80,12],[75,13,76,13],[78,13,79,13],[38,13,39,13],[41,13,42,13],[44,6,47,10],[45,12,57,12],[46,13,47,13],[49,6,54,6],[49,13,50,13],[50,9,53,9],[52,13,53,13],[55,13,56,13],[56,6,61,6],[57,9,60,9],[59,12,71,12],[60,13,61,13],[63,13,64,13],[64,6,68,10],[15,12,24,12],[16,9,19,9],[16,13,17,13],[19,13,20,13],[22,6,27,6],[22,13,23,13],[23,9,26,9],[26,12,32,12],[27,13,28,13],[29,6,34,6],[30,9,33,9],[30,13,31,13],[34,12,43,12],[35,13,36,13],[36,6,41,6],[37,9,40,9],[1,6,6,6],[2,9,5,9],[2,12,12,12],[2,13,3,13],[5,13,6,13],[8,6,13,6],[8,13,9,13],[9,9,12,9],[11,13,12,13],[14,0,15,0],[14,1,15,1],[14,3,15,3],[14,4,15,4],[15,6,20,6]]}
["Contact & Demographic Info",null,null,"Academic Info",null,null,"Pre-Customs To-Do List",null,null,{"$f":"CONCATENATE($B$2,\" (\",$B$3,\")\"&\", \"&B21)","v":"Alan Cook (M00000002), Social Work"},null,null,"Pre-Customs Task Guide",null,null,null,null,"M#",{"$f":"'My Students'!B4","v":"M00000002"}]
["Name",{"$f":"CONCATENATE(A20,\" \",B20)","v":"Alan Cook"},null,"Transferred hours",{"$f":"INDEX($S:$S,MATCH(\"HrsEarned\",$R:$R,0))","v":13},null,"General",null,null,null,null,null,null,"Task","Where to find info / What to check",null,null,"Deleted",{"$f":"INDEX('My Students'!$2:$16,MATCH($S$1,'My Students'!$B$2:$B$16,0),MATCH(R2,'My Students'!$2:$2,0))","v":"This is sample data. The purple button will paste over it. Just ignore it for now!"}]
["M#",{"$f":"S1","v":"M00000002"},null,"HS GPA",{"$f":"INDEX($S:$S,MATCH(\"HighSchoolGPA\",$R:$R,0))","v":3.8},null,null,null,"Make stu folder in Z drive",null,null,null,"General","Make stu folder in Z drive","Naming scheme: <major> <conc> <last>, <first> <M#>",null,null,"SAcad",{"$f":"INDEX('My Students'!$2:$16,MATCH($S$1,'My Students'!$B$2:$B$16,0),MATCH(R3,'My Students'!$2:$2,0))","v":""}]
["MTSUEmail",{"$f":"INDEX($S:$S,MATCH(A4,$R:$R,0))","v":"3@mtmail.mtsu.edu"},null,"Inclusive GPA",{"$f":"INDEX($S:$S,MATCH(\"InclusiveGPA\",$R:$R,0))","v":4},null,null,null,"Check admit term",null,null,null,null,null,"e.g., CRJU LAEN Smith, John M01234567",null,null,"VetOrDep",{"$f":"INDEX('My Students'!$2:$16,MATCH($S$1,'My Students'!$B$2:$B$16,0),MATCH(R4,'My Students'!$2:$2,0))","v":""}]
["PersonalEmail",{"$f":"INDEX($S:$S,MATCH(A5,$R:$R,0))","v":"3@gmail.com"},null,"ACT Math",{"$f":"INDEX($S:$S,MATCH(\"ACTMathScre\",$R:$R,0))","v":29},null,null,null,"Major",null,null,null,null,null,null,null,null,"PREN",{"$f":"INDEX('My Students'!$2:$16,MATCH($S$1,'My Students'!$B$2:$B$16,0),MATCH(R5,'My Students'!$2:$2,0))","v":""}]
["PermPhone",{"$f":"INDEX($S:$S,MATCH(A6,$R:$R,0))","v":"(423) 618-0000"},null,"ACT Science",{"$f":"INDEX($S:$S,MATCH(\"ACTScienceScre\",$R:$R,0))","v":34},null,null,null,"Acad standing (TRs only)",null,null,null,null,"Check admit term","SAAADMS, Customs chart--\"Flags\"",null,null,"1stGen",{"$f":"INDEX('My Students'!$2:$16,MATCH($S$1,'My Students'!$B$2:$B$16,0),MATCH(R6,'My Students'!$2:$2,0))","v":"N"}]
["MailingPhone",{"$f":"INDEX($S:$S,MATCH(A7,$R:$R,0))","v":"(423) 618-0000"},null,"CustomsPOS",{"$f":"INDEX($S:$S,MATCH(D7,$R:$R,0))","v":"BSW_SOWO"},null,null,null,null,null,null,null,null,null,"If summer: Verify w/ stu before Customs",null,null,"ReverseTransfer",{"$f":"INDEX('My Students'!$2:$16,MATCH($S$1,'My Students'!$B$2:$B$16,0),MATCH(R7,'My Students'!$2:$2,0))","v":""}]
[null,null,null,null,{"$f":"INDEX($S:$S,MATCH(\"Major\",$R:$R,0))","v":"Pre-Social Work"},null,null,null,null,null,null,null,null,null,null,null,null,"FR/TR",{"$f":"INDEX('My Students'!$2:$16,MATCH($S$1,'My Students'!$B$2:$B$16,0),MATCH(R8,'My Students'!$2:$2,0))","v":"F"}]
["Customs Info",null,null,"BannerPOS",{"$f":"INDEX($S:$S,MATCH(D9,$R:$R,0))","v":"BS_PSYPGSC"},null,"Special Pops",null,null,null,null,null,null,"Major","SGASTDN, Customs chart--\"Academic\" (& updates from stu)",null,null,"StudentName",{"$f":"INDEX('My Students'!$2:$16,MATCH($S$1,'My Students'!$B$2:$B$16,0),MATCH(R9,'My Students'!$2:$2,0))","v":"Cook, Alan"}]
["CountrySlot",{"$f":"INDEX(S:S,MATCH(A10,R:R,0))","v":"FR - France (s756)"},null,"Majors match?",{"$f":"IF(AND(E11=\"\",E7=E9),\"Y\",\"N, Submit change of major\")","v":"N, Submit change of major"},null,null,null,"Vet benefits",null,null,null,null,null,null,null,null,"Major",{"$f":"INDEX('My Students'!$2:$16,MATCH($S$1,'My Students'!$B$2:$B$16,0),MATCH(R10,'My Students'!$2:$2,0))","v":"Pre-Social Work"}]
["Order/Time",{"$f":"CONCATENATE(INDEX(S:S,MATCH(A11,R:R,0)),\" (\",LEFT(S23,2),\")\")","v":"4/11:30 AM (PS)"},null,"Override major",null,null,null,null,"Student athlete",null,null,null,null,null,null,null,null,"Order/Time",{"$f":"INDEX('My Students'!$2:$16,MATCH($S$1,'My Students'!$B$2:$B$16,0),MATCH(R11,'My Students'!$2:$2,0))","v":"4/11:30 AM"}]
["Acad Advisor",{"$f":"INDEX($S:$S,MATCH(\"Assigned Advisor\",$R:$R,0))","v":"Chloe"},null,null,null,null,null,null,"Pre-Professional",null,null,null,null,"Acad standing (TRs only)","SHATERM, SAAADMS, Transcript",null,null,"PrescribedCrsMath",{"$f":"INDEX('My Students'!$2:$16,MATCH($S$1,'My Students'!$B$2:$B$16,0),MATCH(R12,'My Students'!$2:$2,0))","v":"College level"},{"$f":"IF(S12=\"college level\",\"n\",IF(S12=0,\"blank--check\",\"y\"))","v":"n"}]
["Customs Advisor",{"$f":"INDEX($S:$S,MATCH(\"Customs Advisor\",$R:$R,0))","v":"Amy"},null,"Factors in Choosing Classes",null,null,null,null,null,null,null,null,null,null,"Probation on SHATERM? Must take U2020, meet GPA reqs 1st sem.",null,null,"PrescribedCrsWriting",{"$f":"INDEX('My Students'!$2:$16,MATCH($S$1,'My Students'!$B$2:$B$16,0),MATCH(R13,'My Students'!$2:$2,0))","v":"College level"},{"$f":"IF(S13=\"college level\",\"n\",IF(S13=0,\"blank--check\",\"y\"))","v":"n"}]
[null,null,null,"Honors",{"$f":"INDEX($S:$S,MATCH(\"HonorsElig\",$R:$R,0))","v":"UH: elig"},null,null,null,null,null,null,null,null,null,null,null,null,"PrescribedCrsReading",{"$f":"INDEX('My Students'!$2:$16,MATCH($S$1,'My Students'!$B$2:$B$16,0),MATCH(R14,'My Students'!$2:$2,0))","v":"College level"},{"$f":"IF(S14=\"college level\",\"n\",IF(S14=0,\"blank--check\",\"y\"))","v":"n"}]
["Emily's Notes",{"$f":"INDEX($S:$S,MATCH(\"Notes\",$R:$R,0))","v":""},null,"Prescribeds",{"$f":"IF(AND(T12=\"n\",T13=\"n\",T14=\"n\"),\"\",\nCONCATENATE(\"Ks: \"&IF(T12=\"y\",S12,\"\")&IF(T13=\"y\",\", \",\"\")&IF(T12=\"blank--check\",\"Math--check; \",\"\")&\nIF(T13=\"y\",\"ENGL\",\"\")&IF(T14=\"y\",\", \",\"\")&IF(T13=\"blank--check\",\"Engl--check; \",\"\")&\nIF(T14=\"y\",\"READ\",\"\")&IF(T15=\"y\",\", \",\"\")&IF(T14=\"blank--check\",\"Read--check; \",\"\")&\nIF(T15=\"y\",\"U1010\",\"\")))","v":""},null,null,null,null,null,null,null,null,null,null,null,null,"PrescribedCrsStudySkills",{"$f":"INDEX('My Students'!$2:$16,MATCH($S$1,'My Students'!$B$2:$B$16,0),MATCH(R15,'My Students'!$2:$2,0))","v":0},{"$f":"IF((T12<>\"n\")+(T13=\"y\")+(T14=\"y\")>=2,\"y\",\"n\")","v":"n"}]
[null,null,null,null,null,null,"Reg Issues",null,null,null,null,null,"Special Pops","Task","Where to find info / What to check",null,null,"HonorsElig",{"$f":"INDEX('My Students'!$2:$16,MATCH($S$1,'My Students'!$B$2:$B$16,0),MATCH(R16,'My Students'!$2:$2,0))","v":"UH: elig"}]
[null,null,null,"Scholars Acad",{"$f":"INDEX($S:$S,MATCH(\"Sacad\",$R:$R,0))","v":""},null,null,null,"Immunization issues?",null,null,null,null,"Vet benefits","SAAQUAN, SGASTDN, SPAIDEN, Customs chart--\"Flags\", ask student",null,null,"ACTEngl",{"$f":"INDEX('My Students'!$2:$16,MATCH($S$1,'My Students'!$B$2:$B$16,0),MATCH(R17,'My Students'!$2:$2,0))","v":"Waiver"}]
["Copy-Pastes & Folder Links",null,null,"Pre-Nursing",{"$f":"INDEX($S:$S,MATCH(\"PREN\",$R:$R,0))","v":""},null,null,null,"Holds",null,null,null,null,null,"Need a BUAF form?  (FYI: Flag on Customs list doesn't always mean getting vet benefits!!)",null,null,"HighSchoolGPA",{"$f":"INDEX('My Students'!$2:$16,MATCH($S$1,'My Students'!$B$2:$B$16,0),MATCH(R18,'My Students'!$2:$2,0))","v":3.8}]
[{"$f":"INDEX(S:S,MATCH(\"StudentName\",R:R,0))","v":"Cook, Alan"},{"$f":"S1","v":"M00000002"},null,"ACTEngl",{"$f":"INDEX($S:$S,MATCH(\"ACTEngl\",$R:$R,0))","v":"Waiver"},null,null,null,null,null,null,null,null,null,null,null,null,"ACTCompositeScore",{"$f":"INDEX('My Students'!$2:$16,MATCH($S$1,'My Students'!$B$2:$B$16,0),MATCH(R19,'My Students'!$2:$2,0))","v":33}]
[{"$f":"IFERROR(MID(A19,SEARCH(\" \",A19,1)+1,SEARCH(\" \",A19,SEARCH(\" \",A19,1)+1)-SEARCH(\" \",A19,1)-1),MID(A19,FIND(\" \",A19)+1,256))","v":"Alan"},{"$f":"CONCATENATE(LEFT(A19,FIND(\", \",A19,1)-1))","v":"Cook"},null,null,null,null,null,null,null,null,null,null,null,"Student athlete","SGASPRT (Also on main Customs spreadsheet but not sure if accurate)",null,null,"InclusiveGPA",{"$f":"INDEX('My Students'!$2:$16,MATCH($S$1,'My Students'!$B$2:$B$16,0),MATCH(R20,'My Students'!$2:$2,0))","v":4}]
["Major name",{"$f":"CONCATENATE(IF(E11=\"\",INDEX('Data Lists'!$B:$B,MATCH($E$7,'Data Lists'!$A:$A,0)),INDEX('Data Lists'!$B:$B,MATCH($E$11,'Data Lists'!$B:$B,0)))&IF(E18=\"Y\",\" (PREN)\",\"\"))","v":"Social Work"},null,"Flags",null,null,null,null,null,null,null,null,null,null,"Stu meet with SAEC advisor; Scheduling challenges; Major changes approved through SAEC",null,null,"HrsEarned",{"$f":"INDEX('My Students'!$2:$16,MATCH($S$1,'My Students'!$B$2:$B$16,0),MATCH(R21,'My Students'!$2:$2,0))","v":13}]
["Folder name",{"$f":"IF(E11=\"\",CONCATENATE(INDEX('Data Lists'!$E:$E,MATCH($E$7,'Data Lists'!$A:$A,0)),\" \",B20,\", \",A20,\" \",B3),CONCATENATE(INDEX('Data Lists'!$E:$E,MATCH($E$11,'Data Lists'!$B:$B,0)),\" \",B20,\", \",A20,\" \",B3))","v":"SOWO Cook, Alan M00000002"},null,"Holds",{"$f":"INDEX($S:$S,MATCH(D22,$R:$R,0))","v":"None"},null,null,null,null,null,null,null,null,null,null,null,null,"CountrySlot",{"$f":"INDEX('My Students'!$2:$16,MATCH($S$1,'My Students'!$B$2:$B$16,0),MATCH(R22,'My Students'!$2:$2,0))","v":"FR - France (s756)"}]
["Dept folders",{"$f":"HYPERLINK(CONCATENATE(\"Z:\\CoBHS Advising\\Departments\\\",IF(E11=\"\",INDEX('Data Lists'!D:D,MATCH(E7,'Data Lists'!A:A,0)),INDEX('Data Lists'!D:D,MATCH(E11,'Data Lists'!B:B,0))),\"\\Student Forms\\\"))","v":"Z:\\CoBHS Advising\\Departments\\Social Work\\Student Forms\\"},null,"Reg Restrictions",{"$f":"INDEX($S:$S,MATCH(\"RegistrationRestrictions\",$R:$R,0))","v":0},null,"Transcripts",null,null,null,null,null,null,"Pre-Professional","May not know until stu or CBAS reports to us; ask in welcome email!",null,null,"CUSTOMSGrp",{"$f":"INDEX('My Students'!$2:$16,MATCH($S$1,'My Students'!$B$2:$B$16,0),MATCH(R23,'My Students'!$2:$2,0))","v":"PSY"}]
["Stu folder",{"$f":"HYPERLINK(CONCATENATE(\"Z:\\CoBHS Advising\\Departments\\\",IF(E11=\"\",INDEX('Data Lists'!D:D,MATCH(E7,'Data Lists'!A:A,0)),INDEX('Data Lists'!D:D,MATCH(E11,'Data Lists'!B:B,0))),\"\\Student Forms\\\",B22))","v":"Z:\\CoBHS Advising\\Departments\\Social Work\\Student Forms\\SOWO Cook, Alan M00000002"},null,"Immunizations",{"$f":"INDEX($S:$S,MATCH(\"RegistrationRestrictions\",$R:$R,0))","v":0},null,null,null,"Prior schools",null,null,null,null,null,"Provide Pre-Prof info packet and info session flyer",null,null,"CustomsPOS",{"$f":"INDEX('My Students'!$2:$16,MATCH($S$1,'My Students'!$B$2:$B$16,0),MATCH(R24,'My Students'!$2:$2,0))","v":"BSW_SOWO"}]
[null,null,{"$f":"YEARFRAC(S33,NOW())","v":19.083333333333332},"Under 18 & Imm",{"$f":"IF(C25>=18,\"OK--over 18\",\"If need imms, will need parent sig\")","v":"OK--over 18"},null,null,null,"Missing classes/transcripts",null,null,null,null,null,null,null,null,"BannerPOS",{"$f":"INDEX('My Students'!$2:$16,MATCH($S$1,'My Students'!$B$2:$B$16,0),MATCH(R25,'My Students'!$2:$2,0))","v":"BS_PSYPGSC"}]
[null,null,null,"Missing Items",{"$f":"INDEX($S:$S,MATCH(\"MissingChecklistItems\",$R:$R,0))","v":"Final HS Tran upon Graduation"},null,null,null,"Subs needed",null,null,null,null,null,null,null,null,"Assigned Advisor",{"$f":"INDEX('My Students'!$2:$16,MATCH($S$1,'My Students'!$B$2:$B$16,0),MATCH(R26,'My Students'!$2:$2,0))","v":"Chloe"}]
[null,null,null,"Term",{"$f":"INDEX($S:$S,MATCH(\"TermDesc\",$R:$R,0))","v":"Fall 2019"},null,null,null,null,null,null,null,"Reg Issues","Task","Where to find info / What to check",null,null,"Customs Advisor",{"$f":"INDEX('My Students'!$2:$16,MATCH($S$1,'My Students'!$B$2:$B$16,0),MATCH(R27,'My Students'!$2:$2,0))","v":"Amy"}]
[null,null,null,"Might need BUAF",{"$f":"INDEX($S:$S,MATCH(\"VetOrDep\",$R:$R,0))","v":""},null,null,null,null,null,null,null,null,"Immunization issues?","Banner: SZAITRK",null,null,"Holds",{"$f":"INDEX('My Students'!$2:$16,MATCH($S$1,'My Students'!$B$2:$B$16,0),MATCH(R28,'My Students'!$2:$2,0))","v":"None"}]
[null,null,null,"Reverse Transfer",{"$f":"INDEX($S:$S,MATCH(\"ReverseTransfer\",$R:$R,0))","v":""},null,null,null,null,null,null,null,null,null,"Missing imm docs, under 18--need parent form",null,null,"RegistrationRestrictions",{"$f":"INDEX('My Students'!$2:$16,MATCH($S$1,'My Students'!$B$2:$B$16,0),MATCH(R29,'My Students'!$2:$2,0))","v":0}]
[null,null,null,"First Generation",{"$f":"INDEX($S:$S,MATCH(\"1stGen\",$R:$R,0))","v":"N"},null,"Course Types",null,null,null,null,null,null,null,null,null,null,"MissingChecklistItems",{"$f":"INDEX('My Students'!$2:$16,MATCH($S$1,'My Students'!$B$2:$B$16,0),MATCH(R30,'My Students'!$2:$2,0))","v":"Final HS Tran upon Graduation"}]
["Want to add a link to the student's folder? ",null,null,null,null,null,null,null,"Prescribeds",null,null,null,null,"Holds","SOAHOLD, Customs chart--\"Factors\"",null,null,"AdmissionDecision",{"$f":"INDEX('My Students'!$2:$16,MATCH($S$1,'My Students'!$B$2:$B$16,0),MATCH(R31,'My Students'!$2:$2,0))","v":"FC-Freshman Tentative Accept"}]
["--Click on the \"Stu folder\" field above (B21).",null,null,null,null,null,null,null,"Check RLC options",null,null,null,null,null,null,null,null,"TermDesc",{"$f":"INDEX('My Students'!$2:$16,MATCH($S$1,'My Students'!$B$2:$B$16,0),MATCH(R32,'My Students'!$2:$2,0))","v":"Fall 2019"}]
["--Control-K to start the process of creating a link.",null,null,null,null,null,null,null,"Honors",null,null,null,null,null,null,null,null,"DateofBirth",{"$f":"INDEX('My Students'!$2:$16,MATCH($S$1,'My Students'!$B$2:$B$16,0),MATCH(R33,'My Students'!$2:$2,0))","v":"2000-12-31"}]
["--Browse to the student's folder.",null,null,null,null,null,null,null,"Pre-Nursing",null,null,null,null,null,null,null,null,"Notes",{"$f":"INDEX('My Students'!$2:$16,MATCH($S$1,'My Students'!$B$2:$B$16,0),MATCH(R34,'My Students'!$2:$2,0))","v":""}]
["--Choose any file in the folder and double-click on it.",null,null,null,null,null,null,null,null,null,null,null,"Check Transcripts","Task","Where to find info / What to check",null,null,"MTSUEmail",{"$f":"INDEX('My Students'!$2:$16,MATCH($S$1,'My Students'!$B$2:$B$16,0),MATCH(R35,'My Students'!$2:$2,0))","v":"3@mtmail.mtsu.edu"}]
["--In the Address box, delete the file name (back to the \\ after the folder name).",null,null,null,null,null,null,null,null,null,null,null,null,"Prior schools","Banner: SOAPCOL / Pipeline: Prior College Info",null,null,"PersonalEmail",{"$f":"INDEX('My Students'!$2:$16,MATCH($S$1,'My Students'!$B$2:$B$16,0),MATCH(R36,'My Students'!$2:$2,0))","v":"3@gmail.com"}]
["--Click OK.",null,null,null,null,null,"Major-Specific",null,null,null,null,null,null,null,null,null,null,"PermPhone",{"$f":"INDEX('My Students'!$2:$16,MATCH($S$1,'My Students'!$B$2:$B$16,0),MATCH(R37,'My Students'!$2:$2,0))","v":"(423) 618-0000"}]
["--Now you should see the path to the folder, underlined as a link.",null,null,null,null,null,null,null,null,null,null,null,null,null,null,null,null,"MailingPhone",{"$f":"INDEX('My Students'!$2:$16,MATCH($S$1,'My Students'!$B$2:$B$16,0),MATCH(R38,'My Students'!$2:$2,0))","v":"(423) 618-0000"}]
["--When you click on your link, the folder should open in a separate window.",null,null,null,null,null,null,null,null,null,null,null,null,"Missing classes/ transcripts","BDMS (Banner: SAAADMS, click search icon) / Pline: Transfer Eval / Ask stu in welcome email",null,null,"NursElig",{"$f":"INDEX('My Students'!$2:$16,MATCH($S$1,'My Students'!$B$2:$B$16,0),MATCH(R39,'My Students'!$2:$2,0))","v":""}]
[null,null,null,null,null,null,null,null,null,null,null,null,null,null,"FRs: AP, IB, DE, Dual Credit, Cambridge  /  TRs: Sems in progress or missing from MT transcript",null,null,"ACTMathScre",{"$f":"INDEX('My Students'!$2:$16,MATCH($S$1,'My Students'!$B$2:$B$16,0),MATCH(R40,'My Students'!$2:$2,0))","v":29}]
[null,null,null,null,null,null,null,null,null,null,null,null,null,null,null,null,null,"ACTScienceScre",{"$f":"INDEX('My Students'!$2:$16,MATCH($S$1,'My Students'!$B$2:$B$16,0),MATCH(R41,'My Students'!$2:$2,0))","v":34}]
[null,null,null,null,null,null,null,null,null,null,null,null,null,"Subs needed","By comparing transcript, transfer eval, & UD form.  Use TES for course descriptions.",null,null,"A&P?",{"$f":"IF(S1<>\"\",IF(OR(AND(S40=21,S41>21),AND(S40>21,S41=21)),\"maybe\",IF(AND(S31>=21,S41>=21),\"Y\",\"N\")),\"\")","v":"Y"}]
[null,null,null,null,null,null,null,null,null,null,null,null,null,null,"Any classes that might/should count but aren't?",null,null,"Major by Look-up",{"$f":"INDEX('Data Lists'!B:B,MATCH(S24,'Data Lists'!A:A,0))","v":"Social Work"}]
[null,null,null,null,null,null,"Notes:",null,null,null,null,null,null,null,null,null,null,"NameM#",{"$f":"CONCATENATE(S47,\", \",S46,\" \",S45)","v":"Cook, Alan M00000002"}]
[null,null,null,null,null,null,null,null,null,null,null,null,"Pre-Customs Task Guide--Page 2",null,null,null,null,"M# copy",{"$f":"S1","v":"M00000002"}]
[null,null,null,null,null,null,null,null,null,null,null,null,"Specific Course Types","Task","Where to find info / What to check",null,null,"Fname",{"$f":"IF(1<>\"\",IFERROR(MID(S9,SEARCH(\" \",S9,1)+1,SEARCH(\" \",S9,SEARCH(\" \",S9,1)+1)-SEARCH(\" \",S9,1)-1),MID(S9,FIND(\" \",S9)+1,256)),\"\")","v":"Alan"}]
[null,null,null,null,null,null,null,null,null,null,null,null,null,"Prescribeds","Compare SZAADEF and SOATEST scores",null,null,"Lname",{"$f":"IF(S1<>\"\",CONCATENATE(LEFT(S9,FIND(\", \",S9,1)-1)),\"\")","v":"Cook"}]
[null,null,null,null,null,null,null,null,null,null,null,null,null,null,"Do they match? What K classes are required?  (\"SAILS Math\"=1010 or 1530 non-K or 1710K)"]
[null,null,null,null,null,null,"Post-Customs To-Do List",null,null,{"$f":"CONCATENATE($B$2,\" (\",$B$3,\")\")","v":"Alan Cook (M00000002)"}]
[null,null,null,null,null,null,"General",null,null,null,null,null,null,"Check RLC options","Based on class list"]
[null,null,null,null,null,null,null,null,"Assign advisor in Banner",null,null,null,null,null,"Must use for students who need READ 1000K/HIST 2020. May recommend for other students."]
[null,null,null,null,null,null,null,null,"Submit appointment report"]
[null,null,null,null,null,null,null,null,null,null,null,null,null,"Honors","Customs chart--\"Factors\" box"]
[null,null,null,null,null,null,null,null,null,null,null,null,null,null,"Is the student eligible to take honors classes? If TR, email Judy Albakry to add honors code."]
[]
[null,null,null,null,null,null,null,null,null,null,null,null,null,"Pre-Nursing","Customs chart--\"Factors\" box"]
[null,null,null,null,null,null,"Special Pops",null,null,null,null,null,null,null,"Do they need different gen eds for PREN vs major?"]
[null,null,null,null,null,null,null,null,"Vet benefits"]
[null,null,null,null,null,null,null,null,"Submit change of major form"]
[null,null,null,null,null,null,null,null,"Send follow-up emails, if needed",null,null,null,"Major-Specific Checks","Task","Where to find info / What to check"]
[null,null,null,null,null,null,null,null,null,null,null,null,null,"Check advising folder","Should have UD form, Reg checklist, anything else specific to major"]
[]
[]
[null,null,null,null,null,null,"Notes:"]
[]
[]
["Copy-Pastes & Folder Links",null,null,"MTSUEmail",{"$f":"B4","v":"3@mtmail.mtsu.edu"}]
[{"$f":"A19","v":"Cook, Alan"},{"$f":"$S$1","v":"M00000002"},null,"PersonalEmail",{"$f":"B5","v":"3@gmail.com"}]
[{"$f":"A20","v":"Alan"},{"$f":"B20","v":"Cook"},null,"CustomsPOS",{"$f":"E7","v":"BSW_SOWO"}]
["Major name",{"$f":"B21","v":"Social Work"},null,null,{"$f":"E8","v":"Pre-Social Work"}]
["Folder name","SOWO Cook, Alan M00000002",null,"BannerPOS",{"$f":"E9","v":"BS_PSYPGSC"}]
["Dept folders",{"$f":"HYPERLINK(B24)","v":"Z:\\CoBHS Advising\\Departments\\Social Work\\Student Forms\\SOWO Cook, Alan M00000002"},null,"Majors match?",{"$f":"E10","v":"N, Submit change of major"}]
["Stu folder",{"$f":"HYPERLINK(B25)","v":""},null,"Override major",{"$f":"E11","v":0}]
[null,null,null,"Might need BUAF",{"$f":"E28","v":""},null,null,null,null,null,null,null,"Post-Customs Task Guide"]
[null,null,null,null,null,null,null,null,null,null,null,null,"General","Task","Where to find info / What to check"]
["Start",null,null,"Change major",null,null,null,null,null,null,null,null,null,"Assign advisor in Banner","SGAADVR"]
["Stop",null,null,"Notes for advisor",null,null,null,null,null,null,null,null,null,null,"Our type is COLL; We generally are the primary advisor."]
[]
[null,"Report Builder",null,null,"Student Message Builder",null,null,null,null,null,null,null,null,"Submit appointment report","Navigate (SSC)"]
["Registered",null,"see below","Docs attached",null,"x (to say that you've attached docs for the student)"]
["Attaching Scan",null,"x","Drop/Add info",null,"x (to give info on switching classes & steps to do so)"]
["Submitted COM",null,"x","Acad success tips",null,"x (to give acad tips, tutoring & SI websites, & \"ask for help\")"]
["Supp Instructn",null,"x","NURS Info Session",null,"x (to refer student to nursing info webpage and session)",null,null,null,null,null,null,"Special Pops","Task","Where to find info / What to check"]
["RTTP",null,"x","Check phone #",null,"x (to tell stu their listed ph #s are wrong, & how to fix)",null,null,null,null,null,null,null,"Vet benefits","Submit BUAF"]
["Note 1",null,"x","Advisor info",{"$f":"INDEX('Data Lists'!$J:$J,MATCH($B$12,'Data Lists'!$H:$H,0))","v":"your advisor, Chloe (Chloe.Calhoun@mtsu.edu)"},"(leave formula, or type \"me <email>\")",null,null,null,null,null,null,null,null,"Form: Z:> Advising> Advising Forms> \"VA Benefit User Adv Form\"; Submit: V drive along w/ UD form"]
["Other",null,"[notes]","Other",null,"[type any notes to student]"]
["Paste in advising report:",{"$f":"CONCATENATE(\"Student came for advising during Customs.\",IF(B81<>\"\",\"  Attaching scanned copy of notes.\",\"\"),IF(B80=\"a\",Messages!$C$2,IF(B80=\"b\",Messages!$C$3,IF(B80<>\"\",CONCATENATE(\"  Registered student for classes for upcoming semester: \",B80),\"\"))),IF(B86<>\"\",CONCATENATE(\"\n\n\",B86),\"\"),IF(B82<>\"\",\"\n\nSubmitted change of major form. \",\"\"),IF(B83<>\"\",Messages!$C$4,\"\"),IF(B84<>\"\",Messages!$C$5,\"\"),IF(B85<>\"\",Messages!$C$6,\"\"))","v":"Student came for advising during Customs."},null,"Paste in stu msg:",{"$f":"CONCATENATE(\"We enjoyed seeing you at the CBHS Advising Center Customs session today, \",$A$21,\"!  \",IF(E80=\"x\",\"I've attached your Registration Checklist, for your records.\",\"\"),IF(E86<>\"\",CONCATENATE(\"\n\n\",E86),\"\"),IF(E81=\"x\",CONCATENATE(Messages!$C$7&E85&\", before making changes.\"),\"\"),IF(E84=\"x\",Messages!$C$10,\"\"),IF(E82=\"x\",Messages!$C$8,\"\"),IF(E83<>\"\",Messages!$C$9,\"\"),CONCATENATE(\"\n\nIf you have any questions or concerns, please contact \"&E85&\".  You'll also want to plan to come in for an advising appointment around mid-terms each semester, to talk about your classes for the upcoming term.  You can find Instructions and Schedule links at mtsu.edu/cbhsadv. \"),\"\n\nWe look forward to seeing you at MTSU this semester!\n\n\",$B$2,\"\n\",$B$3)","v":"We enjoyed seeing you at the CBHS Advising Center Customs session today, Major name!  \n\nIf you have any questions or concerns, please contact your advisor, Chloe (Chloe.Calhoun@mtsu.edu).  You'll also want to plan to come in for an advising appointment around mid-terms each semester, to talk about your classes for the upcoming term.  You can find Instructions and Schedule links at mtsu.edu/cbhsadv. \n\nWe look forward to seeing you at MTSU this semester!\n\nAlan Cook\nM00000002"},null,null,null,null,null,null,null,null,"Submit change of major form","(If applicable)  Pipeline > Bottom of Advisor menu"]
["\"Registered\" choices: \"a\" to get message re stu registering in lab, \"b\" to get message re helping stu register in office, or type list of classes to be inserted."]
[]
["This is what it will say:",null,null,"This is what it will say:",null,null,null,null,null,null,null,null,null,"Send follow-up emails","(if needed)"]
[{"$f":"B87","v":"Student came for advising during Customs."},null,null,{"$f":"E87","v":"We enjoyed seeing you at the CBHS Advising Center Customs session today, Major name!  \n\nIf you have any questions or concerns, please contact your advisor, Chloe (Chloe.Calhoun@mtsu.edu).  You'll also want to plan to come in for an advising appointment around mid-terms each semester, to talk about your classes for the upcoming term.  You can find Instructions and Schedule links at mtsu.edu/cbhsadv. \n\nWe look forward to seeing you at MTSU this semester!\n\nAlan Cook\nM00000002"},null,null,null,null,null,null,null,null,null,null,"e.g., To new advisor if student changed major during advising session"]

{"sheet":"3","index":4,"n_rows":91,"n_cols":20,"rows_kept":91,"cut":false,"hidden":false,"merged":[[90,0,114,1],[90,3,114,4],[82,12,91,12],[83,13,84,13],[86,13,87,13],[89,13,90,13],[66,13,67,13],[69,13,70,13],[74,12,80,12],[75,13,76,13],[78,13,79,13],[38,13,39,13],[41,13,42,13],[44,6,47,10],[45,12,57,12],[46,13,47,13],[49,6,54,6],[49,13,50,13],[50,9,53,9],[52,13,53,13],[55,13,56,13],[56,6,61,6],[57,9,60,9],[59,12,71,12],[60,13,61,13],[63,13,64,13],[64,6,68,10],[15,12,24,12],[16,9,19,9],[16,13,17,13],[19,13,20,13],[22,6,27,6],[22,13,23,13],[23,9,26,9],[26,12,32,12],[27,13,28,13],[29,6,34,6],[30,9,33,9],[30,13,31,13],[34,12,43,12],[35,13,36,13],[36,6,41,6],[37,9,40,9],[1,6,6,6],[2,9,5,9],[2,12,12,12],[2,13,3,13],[5,13,6,13],[8,6,13,6],[8,13,9,13],[9,9,12,9],[11,13,12,13],[14,0,15,0],[14,1,15,1],[14,3,15,3],[14,4,15,4],[15,6,20,6]]}
["Contact & Demographic Info",null,null,"Academic Info",null,null,"Pre-Customs To-Do List",null,null,{"$f":"CONCATENATE($B$2,\" (\",$B$3,\")\"&\", \"&B21)","v":{"$error":"#N/A"}},null,null,"Pre-Customs Task Guide",null,null,null,null,"M#",{"$f":"'My Students'!B5","v":"M00000003"}]
["Name",{"$f":"CONCATENATE(A20,\" \",B20)","v":"Abigail Jones"},null,"Transferred hours",{"$f":"INDEX($S:$S,MATCH(\"HrsEarned\",$R:$R,0))","v":6},null,"General",null,null,null,null,null,null,"Task","Where to find info / What to check",null,null,"Deleted",{"$f":"INDEX('My Students'!$2:$16,MATCH($S$1,'My Students'!$B$2:$B$16,0),MATCH(R2,'My Students'!$2:$2,0))","v":"This is sample data. The purple button will paste over it. Just ignore it for now!"}]
["M#",{"$f":"S1","v":"M00000003"},null,"HS GPA",{"$f":"INDEX($S:$S,MATCH(\"HighSchoolGPA\",$R:$R,0))","v":4},null,null,null,"Make stu folder in Z drive",null,null,null,"General","Make stu folder in Z drive","Naming scheme: <major> <conc> <last>, <first> <M#>",null,null,"SAcad",{"$f":"INDEX('My Students'!$2:$16,MATCH($S$1,'My Students'!$B$2:$B$16,0),MATCH(R3,'My Students'!$2:$2,0))","v":""}]
["MTSUEmail",{"$f":"INDEX($S:$S,MATCH(A4,$R:$R,0))","v":"4@mtmail.mtsu.edu"},null,"Inclusive GPA",{"$f":"INDEX($S:$S,MATCH(\"InclusiveGPA\",$R:$R,0))","v":3.33},null,null,null,"Check admit term",null,null,null,null,null,"e.g., CRJU LAEN Smith, John M01234567",null,null,"VetOrDep",{"$f":"INDEX('My Students'!$2:$16,MATCH($S$1,'My Students'!$B$2:$B$16,0),MATCH(R4,'My Students'!$2:$2,0))","v":""}]
["PersonalEmail",{"$f":"INDEX($S:$S,MATCH(A5,$R:$R,0))","v":"4@gmail.com"},null,"ACT Math",{"$f":"INDEX($S:$S,MATCH(\"ACTMathScre\",$R:$R,0))","v":17},null,null,null,"Major",null,null,null,null,null,null,null,null,"PREN",{"$f":"INDEX('My Students'!$2:$16,MATCH($S$1,'My Students'!$B$2:$B$16,0),MATCH(R5,'My Students'!$2:$2,0))","v":"Y"}]
["PermPhone",{"$f":"INDEX($S:$S,MATCH(A6,$R:$R,0))","v":"(615) 822-0000"},null,"ACT Science",{"$f":"INDEX($S:$S,MATCH(\"ACTScienceScre\",$R:$R,0))","v":22},null,null,null,"Acad standing (TRs only)",null,null,null,null,"Check admit term","SAAADMS, Customs chart--\"Flags\"",null,null,"1stGen",{"$f":"INDEX('My Students'!$2:$16,MATCH($S$1,'My Students'!$B$2:$B$16,0),MATCH(R6,'My Students'!$2:$2,0))","v":"N"}]
["MailingPhone",{"$f":"INDEX($S:$S,MATCH(A7,$R:$R,0))","v":0},null,"CustomsPOS",{"$f":"INDEX($S:$S,MATCH(D7,$R:$R,0))","v":" "},null,null,null,null,null,null,null,null,null,"If summer: Verify w/ stu before Customs",null,null,"ReverseTransfer",{"$f":"INDEX('My Students'!$2:$16,MATCH($S$1,'My Students'!$B$2:$B$16,0),MATCH(R7,'My Students'!$2:$2,0))","v":""}]
[null,null,null,null,{"$f":"INDEX($S:$S,MATCH(\"Major\",$R:$R,0))","v":"Nursing Candidate"},null,null,null,null,null,null,null,null,null,null,null,null,"FR/TR",{"$f":"INDEX('My Students'!$2:$16,MATCH($S$1,'My Students'!$B$2:$B$16,0),MATCH(R8,'My Students'!$2:$2,0))","v":"F"}]
["Customs Info",null,null,"BannerPOS",{"$f":"INDEX($S:$S,MATCH(D9,$R:$R,0))","v":"BSN_NURSPREN"},null,"Special Pops",null,null,null,null,null,null,"Major","SGASTDN, Customs chart--\"Academic\" (& updates from stu)",null,null,"StudentName",{"$f":"INDEX('My Students'!$2:$16,MATCH($S$1,'My Students'!$B$2:$B$16,0),MATCH(R9,'My Students'!$2:$2,0))","v":"Jones, Abigail"}]
["CountrySlot",{"$f":"INDEX(S:S,MATCH(A10,R:R,0))","v":"PO - Portugal (s751)"},null,"Majors match?",{"$f":"IF(AND(E11=\"\",E7=E9),\"Y\",\"N, Submit change of major\")","v":"N, Submit change of major"},null,null,null,"Vet benefits",null,null,null,null,null,null,null,null,"Major",{"$f":"INDEX('My Students'!$2:$16,MATCH($S$1,'My Students'!$B$2:$B$16,0),MATCH(R10,'My Students'!$2:$2,0))","v":"Nursing Candidate"}]
["Order/Time",{"$f":"CONCATENATE(INDEX(S:S,MATCH(A11,R:R,0)),\" (\",LEFT(S23,2),\")\")","v":"2/10:30 AM (SO)"},null,"Override major",null,null,null,null,"Student athlete",null,null,null,null,null,null,null,null,"Order/Time",{"$f":"INDEX('My Students'!$2:$16,MATCH($S$1,'My Students'!$B$2:$B$16,0),MATCH(R11,'My Students'!$2:$2,0))","v":"2/10:30 AM"}]
["Acad Advisor",{"$f":"INDEX($S:$S,MATCH(\"Assigned Advisor\",$R:$R,0))","v":"Eileen"},null,null,null,null,null,null,"Pre-Professional",null,null,null,null,"Acad standing (TRs only)","SHATERM, SAAADMS, Transcript",null,null,"PrescribedCrsMath",{"$f":"INDEX('My Students'!$2:$16,MATCH($S$1,'My Students'!$B$2:$B$16,0),MATCH(R12,'My Students'!$2:$2,0))","v":"MATH 1010K/1530K/1710K"},{"$f":"IF(S12=\"college level\",\"n\",IF(S12=0,\"blank--check\",\"y\"))","v":"y"}]
["Customs Advisor",{"$f":"INDEX($S:$S,MATCH(\"Customs Advisor\",$R:$R,0))","v":"Chloe"},null,"Factors in Choosing Classes",null,null,null,null,null,null,null,null,null,null,"Probation on SHATERM? Must take U2020, meet GPA reqs 1st sem.",null,null,"PrescribedCrsWriting",{"$f":"INDEX('My Students'!$2:$16,MATCH($S$1,'My Students'!$B$2:$B$16,0),MATCH(R13,'My Students'!$2:$2,0))","v":"College level"},{"$f":"IF(S13=\"college level\",\"n\",IF(S13=0,\"blank--check\",\"y\"))","v":"n"}]
[null,null,null,"Honors",{"$f":"INDEX($S:$S,MATCH(\"HonorsElig\",$R:$R,0))","v":"Formula: N"},null,null,null,null,null,null,null,null,null,null,null,null,"PrescribedCrsReading",{"$f":"INDEX('My Students'!$2:$16,MATCH($S$1,'My Students'!$B$2:$B$16,0),MATCH(R14,'My Students'!$2:$2,0))","v":"College level"},{"$f":"IF(S14=\"college level\",\"n\",IF(S14=0,\"blank--check\",\"y\"))","v":"n"}]
["Emily's Notes",{"$f":"INDEX($S:$S,MATCH(\"Notes\",$R:$R,0))","v":"Assigned advisor based on primary major"},null,"Prescribeds",{"$f":"IF(AND(T12=\"n\",T13=\"n\",T14=\"n\"),\"\",\nCONCATENATE(\"Ks: \"&IF(T12=\"y\",S12,\"\")&IF(T13=\"y\",\", \",\"\")&IF(T12=\"blank--check\",\"Math--check; \",\"\")&\nIF(T13=\"y\",\"ENGL\",\"\")&IF(T14=\"y\",\", \",\"\")&IF(T13=\"blank--check\",\"Engl--check; \",\"\")&\nIF(T14=\"y\",\"READ\",\"\")&IF(T15=\"y\",\", \",\"\")&IF(T14=\"blank--check\",\"Read--check; \",\"\")&\nIF(T15=\"y\",\"U1010\",\"\")))","v":"Ks: MATH 1010K/1530K/1710K"},null,null,null,null,null,null,null,null,null,null,null,null,"PrescribedCrsStudySkills",{"$f":"INDEX('My Students'!$2:$16,MATCH($S$1,'My Students'!$B$2:$B$16,0),MATCH(R15,'My Students'!$2:$2,0))","v":0},{"$f":"IF((T12<>\"n\")+(T13=\"y\")+(T14=\"y\")>=2,\"y\",\"n\")","v":"n"}]
[null,null,null,null,null,null,"Reg Issues",null,null,null,null,null,"Special Pops","Task","Where to find info / What to check",null,null,"HonorsElig",{"$f":"INDEX('My Students'!$2:$16,MATCH($S$1,'My Students'!$B$2:$B$16,0),MATCH(R16,'My Students'!$2:$2,0))","v":"Formula: N"}]
[null,null,null,"Scholars Acad",{"$f":"INDEX($S:$S,MATCH(\"Sacad\",$R:$R,0))","v":""},null,null,null,"Immunization issues?",null,null,null,null,"Vet benefits","SAAQUAN, SGASTDN, SPAIDEN, Customs chart--\"Flags\", ask student",null,null,"ACTEngl",{"$f":"INDEX('My Students'!$2:$16,MATCH($S$1,'My Students'!$B$2:$B$16,0),MATCH(R17,'My Students'!$2:$2,0))","v":""}]
["Copy-Pastes & Folder Links",null,null,"Pre-Nursing",{"$f":"INDEX($S:$S,MATCH(\"PREN\",$R:$R,0))","v":"Y"},null,null,null,"Holds",null,null,null,null,null,"Need a BUAF form?  (FYI: Flag on Customs list doesn't always mean getting vet benefits!!)",null,null,"HighSchoolGPA",{"$f":"INDEX('My Students'!$2:$16,MATCH($S$1,'My Students'!$B$2:$B$16,0),MATCH(R18,'My Students'!$2:$2,0))","v":4}]
[{"$f":"INDEX(S:S,MATCH(\"StudentName\",R:R,0))","v":"Jones, Abigail"},{"$f":"S1","v":"M00000003"},null,"ACTEngl",{"$f":"INDEX($S:$S,MATCH(\"ACTEngl\",$R:$R,0))","v":""},null,null,null,null,null,null,null,null,null,null,null,null,"ACTCompositeScore",{"$f":"INDEX('My Students'!$2:$16,MATCH($S$1,'My Students'!$B$2:$B$16,0),MATCH(R19,'My Students'!$2:$2,0))","v":21}]
[{"$f":"IFERROR(MID(A19,SEARCH(\" \",A19,1)+1,SEARCH(\" \",A19,SEARCH(\" \",A19,1)+1)-SEARCH(\" \",A19,1)-1),MID(A19,FIND(\" \",A19)+1,256))","v":"Abigail"},{"$f":"CONCATENATE(LEFT(A19,FIND(\", \",A19,1)-1))","v":"Jones"},null,null,null,null,null,null,null,null,null,null,null,"Student athlete","SGASPRT (Also on main Customs spreadsheet but not sure if accurate)",null,null,"InclusiveGPA",{"$f":"INDEX('My Students'!$2:$16,MATCH($S$1,'My Students'!$B$2:$B$16,0),MATCH(R20,'My Students'!$2:$2,0))","v":3.33}]
["Major name",{"$f":"CONCATENATE(IF(E11=\"\",INDEX('Data Lists'!$B:$B,MATCH($E$7,'Data Lists'!$A:$A,0)),INDEX('Data Lists'!$B:$B,MATCH($E$11,'Data Lists'!$B:$B,0)))&IF(E18=\"Y\",\" (PREN)\",\"\"))","v":{"$error":"#N/A"}},null,"Flags",null,null,null,null,null,null,null,null,null,null,"Stu meet with SAEC advisor; Scheduling challenges; Major changes approved through SAEC",null,null,"HrsEarned",{"$f":"INDEX('My Students'!$2:$16,MATCH($S$1,'My Students'!$B$2:$B$16,0),MATCH(R21,'My Students'!$2:$2,0))","v":6}]
["Folder name",{"$f":"IF(E11=\"\",CONCATENATE(INDEX('Data Lists'!$E:$E,MATCH($E$7,'Data Lists'!$A:$A,0)),\" \",B20,\", \",A20,\" \",B3),CONCATENATE(INDEX('Data Lists'!$E:$E,MATCH($E$11,'Data Lists'!$B:$B,0)),\" \",B20,\", \",A20,\" \",B3))","v":{"$error":"#N/A"}},null,"Holds",{"$f":"INDEX($S:$S,MATCH(D22,$R:$R,0))","v":"None"},null,null,null,null,null,null,null,null,null,null,null,null,"CountrySlot",{"$f":"INDEX('My Students'!$2:$16,MATCH($S$1,'My Students'!$B$2:$B$16,0),MATCH(R22,'My Students'!$2:$2,0))","v":"PO - Portugal (s751)"}]
["Dept folders",{"$f":"HYPERLINK(CONCATENATE(\"Z:\\CoBHS Advising\\Departments\\\",IF(E11=\"\",INDEX('Data Lists'!D:D,MATCH(E7,'Data Lists'!A:A,0)),INDEX('Data Lists'!D:D,MATCH(E11,'Data Lists'!B:B,0))),\"\\Student Forms\\\"))","v":{"$error":"#N/A"}},null,"Reg Restrictions",{"$f":"INDEX($S:$S,MATCH(\"RegistrationRestrictions\",$R:$R,0))","v":0},null,"Transcripts",null,null,null,null,null,null,"Pre-Professional","May not know until stu or CBAS reports to us; ask in welcome email!",null,null,"CUSTOMSGrp",{"$f":"INDEX('My Students'!$2:$16,MATCH($S$1,'My Students'!$B$2:$B$16,0),MATCH(R23,'My Students'!$2:$2,0))","v":"SOWO"}]
["Stu folder",{"$f":"HYPERLINK(CONCATENATE(\"Z:\\CoBHS Advising\\Departments\\\",IF(E11=\"\",INDEX('Data Lists'!D:D,MATCH(E7,'Data Lists'!A:A,0)),INDEX('Data Lists'!D:D,MATCH(E11,'Data Lists'!B:B,0))),\"\\Student Forms\\\",B22))","v":{"$error":"#N/A"}},null,"Immunizations",{"$f":"INDEX($S:$S,MATCH(\"RegistrationRestrictions\",$R:$R,0))","v":0},null,null,null,"Prior schools",null,null,null,null,null,"Provide Pre-Prof info packet and info session flyer",null,null,"CustomsPOS",{"$f":"INDEX('My Students'!$2:$16,MATCH($S$1,'My Students'!$B$2:$B$16,0),MATCH(R24,'My Students'!$2:$2,0))","v":" "}]
[null,null,{"$f":"YEARFRAC(S33,NOW())","v":18.427777777777777},"Under 18 & Imm",{"$f":"IF(C25>=18,\"OK--over 18\",\"If need imms, will need parent sig\")","v":"OK--over 18"},null,null,null,"Missing classes/transcripts",null,null,null,null,null,null,null,null,"BannerPOS",{"$f":"INDEX('My Students'!$2:$16,MATCH($S$1,'My Students'!$B$2:$B$16,0),MATCH(R25,'My Students'!$2:$2,0))","v":"BSN_NURSPREN"}]
[null,null,null,"Missing Items",{"$f":"INDEX($S:$S,MATCH(\"MissingChecklistItems\",$R:$R,0))","v":"Final HS Tran upon Graduation"},null,null,null,"Subs needed",null,null,null,null,null,null,null,null,"Assigned Advisor",{"$f":"INDEX('My Students'!$2:$16,MATCH($S$1,'My Students'!$B$2:$B$16,0),MATCH(R26,'My Students'!$2:$2,0))","v":"Eileen"}]
[null,null,null,"Term",{"$f":"INDEX($S:$S,MATCH(\"TermDesc\",$R:$R,0))","v":"Fall 2019"},null,null,null,null,null,null,null,"Reg Issues","Task","Where to find info / What to check",null,null,"Customs Advisor",{"$f":"INDEX('My Students'!$2:$16,MATCH($S$1,'My Students'!$B$2:$B$16,0),MATCH(R27,'My Students'!$2:$2,0))","v":"Chloe"}]
[null,null,null,"Might need BUAF",{"$f":"INDEX($S:$S,MATCH(\"VetOrDep\",$R:$R,0))","v":""},null,null,null,null,null,null,null,null,"Immunization issues?","Banner: SZAITRK",null,null,"Holds",{"$f":"INDEX('My Students'!$2:$16,MATCH($S$1,'My Students'!$B$2:$B$16,0),MATCH(R28,'My Students'!$2:$2,0))","v":"None"}]
[null,null,null,"Reverse Transfer",{"$f":"INDEX($S:$S,MATCH(\"ReverseTransfer\",$R:$R,0))","v":""},null,null,null,null,null,null,null,null,null,"Missing imm docs, under 18--need parent form",null,null,"RegistrationRestrictions",{"$f":"INDEX('My Students'!$2:$16,MATCH($S$1,'My Students'!$B$2:$B$16,0),MATCH(R29,'My Students'!$2:$2,0))","v":0}]
[null,null,null,"First Generation",{"$f":"INDEX($S:$S,MATCH(\"1stGen\",$R:$R,0))","v":"N"},null,"Course Types",null,null,null,null,null,null,null,null,null,null,"MissingChecklistItems",{"$f":"INDEX('My Students'!$2:$16,MATCH($S$1,'My Students'!$B$2:$B$16,0),MATCH(R30,'My Students'!$2:$2,0))","v":"Final HS Tran upon Graduation"}]
["Want to add a link to the student's folder? ",null,null,null,null,null,null,null,"Prescribeds",null,null,null,null,"Holds","SOAHOLD, Customs chart--\"Factors\"",null,null,"AdmissionDecision",{"$f":"INDEX('My Students'!$2:$16,MATCH($S$1,'My Students'!$B$2:$B$16,0),MATCH(R31,'My Students'!$2:$2,0))","v":"FC-Freshman Tentative Accept"}]
["--Click on the \"Stu folder\" field above (B21).",null,null,null,null,null,null,null,"Check RLC options",null,null,null,null,null,null,null,null,"TermDesc",{"$f":"INDEX('My Students'!$2:$16,MATCH($S$1,'My Students'!$B$2:$B$16,0),MATCH(R32,'My Students'!$2:$2,0))","v":"Fall 2019"}]
["--Control-K to start the process of creating a link.",null,null,null,null,null,null,null,"Honors",null,null,null,null,null,null,null,null,"DateofBirth",{"$f":"INDEX('My Students'!$2:$16,MATCH($S$1,'My Students'!$B$2:$B$16,0),MATCH(R33,'My Students'!$2:$2,0))","v":"2001-08-26"}]
["--Browse to the student's folder.",null,null,null,null,null,null,null,"Pre-Nursing",null,null,null,null,null,null,null,null,"Notes",{"$f":"INDEX('My Students'!$2:$16,MATCH($S$1,'My Students'!$B$2:$B$16,0),MATCH(R34,'My Students'!$2:$2,0))","v":"Assigned advisor based on primary major"}]
["--Choose any file in the folder and double-click on it.",null,null,null,null,null,null,null,null,null,null,null,"Check Transcripts","Task","Where to find info / What to check",null,null,"MTSUEmail",{"$f":"INDEX('My Students'!$2:$16,MATCH($S$1,'My Students'!$B$2:$B$16,0),MATCH(R35,'My Students'!$2:$2,0))","v":"4@mtmail.mtsu.edu"}]
["--In the Address box, delete the file name (back to the \\ after the folder name).",null,null,null,null,null,null,null,null,null,null,null,null,"Prior schools","Banner: SOAPCOL / Pipeline: Prior College Info",null,null,"PersonalEmail",{"$f":"INDEX('My Students'!$2:$16,MATCH($S$1,'My Students'!$B$2:$B$16,0),MATCH(R36,'My Students'!$2:$2,0))","v":"4@gmail.com"}]
["--Click OK.",null,null,null,null,null,"Major-Specific",null,null,null,null,null,null,null,null,null,null,"PermPhone",{"$f":"INDEX('My Students'!$2:$16,MATCH($S$1,'My Students'!$B$2:$B$16,0),MATCH(R37,'My Students'!$2:$2,0))","v":"(615) 822-0000"}]
["--Now you should see the path to the folder, underlined as a link.",null,null,null,null,null,null,null,null,null,null,null,null,null,null,null,null,"MailingPhone",{"$f":"INDEX('My Students'!$2:$16,MATCH($S$1,'My Students'!$B$2:$B$16,0),MATCH(R38,'My Students'!$2:$2,0))","v":0}]
["--When you click on your link, the folder should open in a separate window.",null,null,null,null,null,null,null,null,null,null,null,null,"Missing classes/ transcripts","BDMS (Banner: SAAADMS, click search icon) / Pline: Transfer Eval / Ask stu in welcome email",null,null,"NursElig",{"$f":"INDEX('My Students'!$2:$16,MATCH($S$1,'My Students'!$B$2:$B$16,0),MATCH(R39,'My Students'!$2:$2,0))","v":"N"}]
[null,null,null,null,null,null,null,null,null,null,null,null,null,null,"FRs: AP, IB, DE, Dual Credit, Cambridge  /  TRs: Sems in progress or missing from MT transcript",null,null,"ACTMathScre",{"$f":"INDEX('My Students'!$2:$16,MATCH($S$1,'My Students'!$B$2:$B$16,0),MATCH(R40,'My Students'!$2:$2,0))","v":17}]
[null,null,null,null,null,null,null,null,null,null,null,null,null,null,null,null,null,"ACTScienceScre",{"$f":"INDEX('My Students'!$2:$16,MATCH($S$1,'My Students'!$B$2:$B$16,0),MATCH(R41,'My Students'!$2:$2,0))","v":22}]
[null,null,null,null,null,null,null,null,null,null,null,null,null,"Subs needed","By comparing transcript, transfer eval, & UD form.  Use TES for course descriptions.",null,null,"A&P?",{"$f":"IF(S1<>\"\",IF(OR(AND(S40=21,S41>21),AND(S40>21,S41=21)),\"maybe\",IF(AND(S31>=21,S41>=21),\"Y\",\"N\")),\"\")","v":"Y"}]
[null,null,null,null,null,null,null,null,null,null,null,null,null,null,"Any classes that might/should count but aren't?",null,null,"Major by Look-up",{"$f":"INDEX('Data Lists'!B:B,MATCH(S24,'Data Lists'!A:A,0))","v":{"$error":"#N/A"}}]
[null,null,null,null,null,null,"Notes:",null,null,null,null,null,null,null,null,null,null,"NameM#",{"$f":"CONCATENATE(S47,\", \",S46,\" \",S45)","v":"Jones, Abigail M00000003"}]
[null,null,null,null,null,null,null,null,null,null,null,null,"Pre-Customs Task Guide--Page 2",null,null,null,null,"M# copy",{"$f":"S1","v":"M00000003"}]
[null,null,null,null,null,null,null,null,null,null,null,null,"Specific Course Types","Task","Where to find info / What to check",null,null,"Fname",{"$f":"IF(1<>\"\",IFERROR(MID(S9,SEARCH(\" \",S9,1)+1,SEARCH(\" \",S9,SEARCH(\" \",S9,1)+1)-SEARCH(\" \",S9,1)-1),MID(S9,FIND(\" \",S9)+1,256)),\"\")","v":"Abigail"}]
[null,null,null,null,null,null,null,null,null,null,null,null,null,"Prescribeds","Compare SZAADEF and SOATEST scores",null,null,"Lname",{"$f":"IF(S1<>\"\",CONCATENATE(LEFT(S9,FIND(\", \",S9,1)-1)),\"\")","v":"Jones"}]
[null,null,null,null,null,null,null,null,null,null,null,null,null,null,"Do they match? What K classes are required?  (\"SAILS Math\"=1010 or 1530 non-K or 1710K)"]
[null,null,null,null,null,null,"Post-Customs To-Do List",null,null,{"$f":"CONCATENATE($B$2,\" (\",$B$3,\")\")","v":"Abigail Jones (M00000003)"}]
[null,null,null,null,null,null,"General",null,null,null,null,null,null,"Check RLC options","Based on class list"]
[null,null,null,null,null,null,null,null,"Assign advisor in Banner",null,null,null,null,null,"Must use for students who need READ 1000K/HIST 2020. May recommend for other students."]
[null,null,null,null,null,null,null,null,"Submit appointment report"]
[null,null,null,null,null,null,null,null,null,null,null,null,null,"Honors","Customs chart--\"Factors\" box"]
[null,null,null,null,null,null,null,null,null,null,null,null,null,null,"Is the student eligible to take honors classes? If TR, email Judy Albakry to add honors code."]
[]
[null,null,null,null,null,null,null,null,null,null,null,null,null,"Pre-Nursing","Customs chart--\"Factors\" box"]
[null,null,null,null,null,null,"Special Pops",null,null,null,null,null,null,null,"Do they need different gen eds for PREN vs major?"]
[null,null,null,null,null,null,null,null,"Vet benefits"]
[null,null,null,null,null,null,null,null,"Submit change of major form"]
[null,null,null,null,null,null,null,null,"Send follow-up emails, if needed",null,null,null,"Major-Specific Checks","Task","Where to find info / What to check"]
[null,null,null,null,null,null,null,null,null,null,null,null,null,"Check advising folder","Should have UD form, Reg checklist, anything else specific to major"]
[]
[]
[null,null,null,null,null,null,"Notes:"]
[]
[]
["Copy-Pastes & Folder Links",null,null,"MTSUEmail",{"$f":"B4","v":"4@mtmail.mtsu.edu"}]
[{"$f":"A19","v":"Jones, Abigail"},{"$f":"$S$1","v":"M00000003"},null,"PersonalEmail",{"$f":"B5","v":"4@gmail.com"}]
[{"$f":"A20","v":"Abigail"},{"$f":"B20","v":"Jones"},null,"CustomsPOS",{"$f":"E7","v":" "}]
["Major name",{"$f":"B21","v":{"$error":"#N/A"}},null,null,{"$f":"E8","v":"Nursing Candidate"}]
["Folder name",{"$error":"#N/A"},null,"BannerPOS",{"$f":"E9","v":"BSN_NURSPREN"}]
["Dept folders",{"$f":"HYPERLINK(B24)","v":{"$error":"#N/A"}},null,"Majors match?",{"$f":"E10","v":"N, Submit change of major"}]
["Stu folder",{"$f":"HYPERLINK(B25)","v":""},null,"Override major",{"$f":"E11","v":0}]
[null,null,null,"Might need BUAF",{"$f":"E28","v":""},null,null,null,null,null,null,null,"Post-Customs Task Guide"]
[null,null,null,null,null,null,null,null,null,null,null,null,"General","Task","Where to find info / What to check"]
["Start",null,null,"Change major",null,null,null,null,null,null,null,null,null,"Assign advisor in Banner","SGAADVR"]
["Stop",null,null,"Notes for advisor",null,null,null,null,null,null,null,null,null,null,"Our type is COLL; We generally are the primary advisor."]
[]
[null,"Report Builder",null,null,"Student Message Builder",null,null,null,null,null,null,null,null,"Submit appointment report","Navigate (SSC)"]
["Registered",null,"see below","Docs attached",null,"x (to say that you've attached docs for the student)"]
["Attaching Scan",null,"x","Drop/Add info",null,"x (to give info on switching classes & steps to do so)"]
["Submitted COM",null,"x","Acad success tips",null,"x (to give acad tips, tutoring & SI websites, & \"ask for help\")"]
["Supp Instructn",null,"x","NURS Info Session",null,"x (to refer student to nursing info webpage and session)",null,null,null,null,null,null,"Special Pops","Task","Where to find info / What to check"]
["RTTP",null,"x","Check phone #",null,"x (to tell stu their listed ph #s are wrong, & how to fix)",null,null,null,null,null,null,null,"Vet benefits","Submit BUAF"]
["Note 1",null,"x","Advisor info",{"$f":"INDEX('Data Lists'!$J:$J,MATCH($B$12,'Data Lists'!$H:$H,0))","v":"your advisor, Eileen (Eileen.Chalmers@mtsu.edu)"},"(leave formula, or type \"me <email>\")",null,null,null,null,null,null,null,null,"Form: Z:> Advising> Advising Forms> \"VA Benefit User Adv Form\"; Submit: V drive along w/ UD form"]
["Other",null,"[notes]","Other",null,"[type any notes to student]"]
["Paste in advising report:",{"$f":"CONCATENATE(\"Student came for advising during Customs.\",IF(B81<>\"\",\"  Attaching scanned copy of notes.\",\"\"),IF(B80=\"a\",Messages!$C$2,IF(B80=\"b\",Messages!$C$3,IF(B80<>\"\",CONCATENATE(\"  Registered student for classes for upcoming semester: \",B80),\"\"))),IF(B86<>\"\",CONCATENATE(\"\n\n\",B86),\"\"),IF(B82<>\"\",\"\n\nSubmitted change of major form. \",\"\"),IF(B83<>\"\",Messages!$C$4,\"\"),IF(B84<>\"\",Messages!$C$5,\"\"),IF(B85<>\"\",Messages!$C$6,\"\"))","v":"Student came for advising during Customs."},null,"Paste in stu msg:",{"$f":"CONCATENATE(\"We enjoyed seeing you at the CBHS Advising Center Customs session today, \",$A$21,\"!  \",IF(E80=\"x\",\"I've attached your Registration Checklist, for your records.\",\"\"),IF(E86<>\"\",CONCATENATE(\"\n\n\",E86),\"\"),IF(E81=\"x\",CONCATENATE(Messages!$C$7&E85&\", before making changes.\"),\"\"),IF(E84=\"x\",Messages!$C$10,\"\"),IF(E82=\"x\",Messages!$C$8,\"\"),IF(E83<>\"\",Messages!$C$9,\"\"),CONCATENATE(\"\n\nIf you have any questions or concerns, please contact \"&E85&\".  You'll also want to plan to come in for an advising appointment around mid-terms each semester, to talk about your classes for the upcoming term.  You can find Instructions and Schedule links at mtsu.edu/cbhsadv. \"),\"\n\nWe look forward to seeing you at MTSU this semester!\n\n\",$B$2,\"\n\",$B$3)","v":"We enjoyed seeing you at the CBHS Advising Center Customs session today, Major name!  \n\nIf you have any questions or concerns, please contact your advisor, Eileen (Eileen.Chalmers@mtsu.edu).  You'll also want to plan to come in for an advising appointment around mid-terms each semester, to talk about your classes for the upcoming term.  You can find Instructions and Schedule links at mtsu.edu/cbhsadv. \n\nWe look forward to seeing you at MTSU this semester!\n\nAbigail Jones\nM00000003"},null,null,null,null,null,null,null,null,"Submit change of major form","(If applicable)  Pipeline > Bottom of Advisor menu"]
["\"Registered\" choices: \"a\" to get message re stu registering in lab, \"b\" to get message re helping stu register in office, or type list of classes to be inserted."]
[]
["This is what it will say:",null,null,"This is what it will say:",null,null,null,null,null,null,null,null,null,"Send follow-up emails","(if needed)"]
[{"$f":"B87","v":"Student came for advising during Customs."},null,null,{"$f":"E87","v":"We enjoyed seeing you at the CBHS Advising Center Customs session today, Major name!  \n\nIf you have any questions or concerns, please contact your advisor, Eileen (Eileen.Chalmers@mtsu.edu).  You'll also want to plan to come in for an advising appointment around mid-terms each semester, to talk about your classes for the upcoming term.  You can find Instructions and Schedule links at mtsu.edu/cbhsadv. \n\nWe look forward to seeing you at MTSU this semester!\n\nAbigail Jones\nM00000003"},null,null,null,null,null,null,null,null,null,null,"e.g., To new advisor if student changed major during advising session"]

{"sheet":"4","index":5,"n_rows":91,"n_cols":20,"rows_kept":91,"cut":false,"hidden":false,"merged":[[90,0,114,1],[90,3,114,4],[82,12,91,12],[83,13,84,13],[86,13,87,13],[89,13,90,13],[66,13,67,13],[69,13,70,13],[74,12,80,12],[75,13,76,13],[78,13,79,13],[38,13,39,13],[41,13,42,13],[44,6,47,10],[45,12,57,12],[46,13,47,13],[49,6,54,6],[49,13,50,13],[50,9,53,9],[52,13,53,13],[55,13,56,13],[56,6,61,6],[57,9,60,9],[59,12,71,12],[60,13,61,13],[63,13,64,13],[64,6,68,10],[15,12,24,12],[16,9,19,9],[16,13,17,13],[19,13,20,13],[22,6,27,6],[22,13,23,13],[23,9,26,9],[26,12,32,12],[27,13,28,13],[29,6,34,6],[30,9,33,9],[30,13,31,13],[34,12,43,12],[35,13,36,13],[36,6,41,6],[37,9,40,9],[1,6,6,6],[2,9,5,9],[2,12,12,12],[2,13,3,13],[5,13,6,13],[8,6,13,6],[8,13,9,13],[9,9,12,9],[11,13,12,13],[14,0,15,0],[14,1,15,1],[14,3,15,3],[14,4,15,4],[15,6,20,6]]}
["Contact & Demographic Info",null,null,"Academic Info",null,null,"Pre-Customs To-Do List",null,null,{"$f":"CONCATENATE($B$2,\" (\",$B$3,\")\"&\", \"&B21)","v":"Briana Jones (M00000004), Psychology"},null,null,"Pre-Customs Task Guide",null,null,null,null,"M#",{"$f":"'My Students'!B6","v":"M00000004"}]
["Name",{"$f":"CONCATENATE(A20,\" \",B20)","v":"Briana Jones"},null,"Transferred hours",{"$f":"INDEX($S:$S,MATCH(\"HrsEarned\",$R:$R,0))","v":""},null,"General",null,null,null,null,null,null,"Task","Where to find info / What to check",null,null,"Deleted",{"$f":"INDEX('My Students'!$2:$16,MATCH($S$1,'My Students'!$B$2:$B$16,0),MATCH(R2,'My Students'!$2:$2,0))","v":"This is sample data. The purple button will paste over it. Just ignore it for now!"}]
["M#",{"$f":"S1","v":"M00000004"},null,"HS GPA",{"$f":"INDEX($S:$S,MATCH(\"HighSchoolGPA\",$R:$R,0))","v":3.29},null,null,null,"Make stu folder in Z drive",null,null,null,"General","Make stu folder in Z drive","Naming scheme: <major> <conc> <last>, <first> <M#>",null,null,"SAcad",{"$f":"INDEX('My Students'!$2:$16,MATCH($S$1,'My Students'!$B$2:$B$16,0),MATCH(R3,'My Students'!$2:$2,0))","v":""}]
["MTSUEmail",{"$f":"INDEX($S:$S,MATCH(A4,$R:$R,0))","v":"5@mtmail.mtsu.edu"},null,"Inclusive GPA",{"$f":"INDEX($S:$S,MATCH(\"InclusiveGPA\",$R:$R,0))","v":""},null,null,null,"Check admit term",null,null,null,null,null,"e.g., CRJU LAEN Smith, John M01234567",null,null,"VetOrDep",{"$f":"INDEX('My Students'!$2:$16,MATCH($S$1,'My Students'!$B$2:$B$16,0),MATCH(R4,'My Students'!$2:$2,0))","v":""}]
["PersonalEmail",{"$f":"INDEX($S:$S,MATCH(A5,$R:$R,0))","v":"5@gmail.com"},null,"ACT Math",{"$f":"INDEX($S:$S,MATCH(\"ACTMathScre\",$R:$R,0))","v":21},null,null,null,"Major",null,null,null,null,null,null,null,null,"PREN",{"$f":"INDEX('My Students'!$2:$16,MATCH($S$1,'My Students'!$B$2:$B$16,0),MATCH(R5,'My Students'!$2:$2,0))","v":""}]
["PermPhone",{"$f":"INDEX($S:$S,MATCH(A6,$R:$R,0))","v":"(615) 319-0000"},null,"ACT Science",{"$f":"INDEX($S:$S,MATCH(\"ACTScienceScre\",$R:$R,0))","v":19},null,null,null,"Acad standing (TRs only)",null,null,null,null,"Check admit term","SAAADMS, Customs chart--\"Flags\"",null,null,"1stGen",{"$f":"INDEX('My Students'!$2:$16,MATCH($S$1,'My Students'!$B$2:$B$16,0),MATCH(R6,'My Students'!$2:$2,0))","v":"N"}]
["MailingPhone",{"$f":"INDEX($S:$S,MATCH(A7,$R:$R,0))","v":"(615) 594-0000"},null,"CustomsPOS",{"$f":"INDEX($S:$S,MATCH(D7,$R:$R,0))","v":"BS_PSY"},null,null,null,null,null,null,null,null,null,"If summer: Verify w/ stu before Customs",null,null,"ReverseTransfer",{"$f":"INDEX('My Students'!$2:$16,MATCH($S$1,'My Students'!$B$2:$B$16,0),MATCH(R7,'My Students'!$2:$2,0))","v":""}]
[null,null,null,null,{"$f":"INDEX($S:$S,MATCH(\"Major\",$R:$R,0))","v":"PREN--Psychology"},null,null,null,null,null,null,null,null,null,null,null,null,"FR/TR",{"$f":"INDEX('My Students'!$2:$16,MATCH($S$1,'My Students'!$B$2:$B$16,0),MATCH(R8,'My Students'!$2:$2,0))","v":"F"}]
["Customs Info",null,null,"BannerPOS",{"$f":"INDEX($S:$S,MATCH(D9,$R:$R,0))","v":"BS_PSY"},null,"Special Pops",null,null,null,null,null,null,"Major","SGASTDN, Customs chart--\"Academic\" (& updates from stu)",null,null,"StudentName",{"$f":"INDEX('My Students'!$2:$16,MATCH($S$1,'My Students'!$B$2:$B$16,0),MATCH(R9,'My Students'!$2:$2,0))","v":"Jones, Briana"}]
["CountrySlot",{"$f":"INDEX(S:S,MATCH(A10,R:R,0))","v":"VE - Venezuela (s759)"},null,"Majors match?",{"$f":"IF(AND(E11=\"\",E7=E9),\"Y\",\"N, Submit change of major\")","v":"Y"},null,null,null,"Vet benefits",null,null,null,null,null,null,null,null,"Major",{"$f":"INDEX('My Students'!$2:$16,MATCH($S$1,'My Students'!$B$2:$B$16,0),MATCH(R10,'My Students'!$2:$2,0))","v":"PREN--Psychology"}]
["Order/Time",{"$f":"CONCATENATE(INDEX(S:S,MATCH(A11,R:R,0)),\" (\",LEFT(S23,2),\")\")","v":"3/11:00 AM (PS)"},null,"Override major",null,null,null,null,"Student athlete",null,null,null,null,null,null,null,null,"Order/Time",{"$f":"INDEX('My Students'!$2:$16,MATCH($S$1,'My Students'!$B$2:$B$16,0),MATCH(R11,'My Students'!$2:$2,0))","v":"3/11:00 AM"}]
["Acad Advisor",{"$f":"INDEX($S:$S,MATCH(\"Assigned Advisor\",$R:$R,0))","v":"Chloe"},null,null,null,null,null,null,"Pre-Professional",null,null,null,null,"Acad standing (TRs only)","SHATERM, SAAADMS, Transcript",null,null,"PrescribedCrsMath",{"$f":"INDEX('My Students'!$2:$16,MATCH($S$1,'My Students'!$B$2:$B$16,0),MATCH(R12,'My Students'!$2:$2,0))","v":0},{"$f":"IF(S12=\"college level\",\"n\",IF(S12=0,\"blank--check\",\"y\"))","v":"blank--check"}]
["Customs Advisor",{"$f":"INDEX($S:$S,MATCH(\"Customs Advisor\",$R:$R,0))","v":"Stacey"},null,"Factors in Choosing Classes",null,null,null,null,null,null,null,null,null,null,"Probation on SHATERM? Must take U2020, meet GPA reqs 1st sem.",null,null,"PrescribedCrsWriting",{"$f":"INDEX('My Students'!$2:$16,MATCH($S$1,'My Students'!$B$2:$B$16,0),MATCH(R13,'My Students'!$2:$2,0))","v":0},{"$f":"IF(S13=\"college level\",\"n\",IF(S13=0,\"blank--check\",\"y\"))","v":"blank--check"}]
[null,null,null,"Honors",{"$f":"INDEX($S:$S,MATCH(\"HonorsElig\",$R:$R,0))","v":"Formula: N"},null,null,null,null,null,null,null,null,null,null,null,null,"PrescribedCrsReading",{"$f":"INDEX('My Students'!$2:$16,MATCH($S$1,'My Students'!$B$2:$B$16,0),MATCH(R14,'My Students'!$2:$2,0))","v":0},{"$f":"IF(S14=\"college level\",\"n\",IF(S14=0,\"blank--check\",\"y\"))","v":"blank--check"}]
["Emily's Notes",{"$f":"INDEX($S:$S,MATCH(\"Notes\",$R:$R,0))","v":""},null,"Prescribeds",{"$f":"IF(AND(T12=\"n\",T13=\"n\",T14=\"n\"),\"\",\nCONCATENATE(\"Ks: \"&IF(T12=\"y\",S12,\"\")&IF(T13=\"y\",\", \",\"\")&IF(T12=\"blank--check\",\"Math--check; \",\"\")&\nIF(T13=\"y\",\"ENGL\",\"\")&IF(T14=\"y\",\", \",\"\")&IF(T13=\"blank--check\",\"Engl--check; \",\"\")&\nIF(T14=\"y\",\"READ\",\"\")&IF(T15=\"y\",\", \",\"\")&IF(T14=\"blank--check\",\"Read--check; \",\"\")&\nIF(T15=\"y\",\"U1010\",\"\")))","v":"Ks: Math--check; Engl--check; Read--check; "},null,null,null,null,null,null,null,null,null,null,null,null,"PrescribedCrsStudySkills",{"$f":"INDEX('My Students'!$2:$16,MATCH($S$1,'My Students'!$B$2:$B$16,0),MATCH(R15,'My Students'!$2:$2,0))","v":0},{"$f":"IF((T12<>\"n\")+(T13=\"y\")+(T14=\"y\")>=2,\"y\",\"n\")","v":"n"}]
[null,null,null,null,null,null,"Reg Issues",null,null,null,null,null,"Special Pops","Task","Where to find info / What to check",null,null,"HonorsElig",{"$f":"INDEX('My Students'!$2:$16,MATCH($S$1,'My Students'!$B$2:$B$16,0),MATCH(R16,'My Students'!$2:$2,0))","v":"Formula: N"}]
[null,null,null,"Scholars Acad",{"$f":"INDEX($S:$S,MATCH(\"Sacad\",$R:$R,0))","v":""},null,null,null,"Immunization issues?",null,null,null,null,"Vet benefits","SAAQUAN, SGASTDN, SPAIDEN, Customs chart--\"Flags\", ask student",null,null,"ACTEngl",{"$f":"INDEX('My Students'!$2:$16,MATCH($S$1,'My Students'!$B$2:$B$16,0),MATCH(R17,'My Students'!$2:$2,0))","v":""}]
["Copy-Pastes & Folder Links",null,null,"Pre-Nursing",{"$f":"INDEX($S:$S,MATCH(\"PREN\",$R:$R,0))","v":""},null,null,null,"Holds",null,null,null,null,null,"Need a BUAF form?  (FYI: Flag on Customs list doesn't always mean getting vet benefits!!)",null,null,"HighSchoolGPA",{"$f":"INDEX('My Students'!$2:$16,MATCH($S$1,'My Students'!$B$2:$B$16,0),MATCH(R18,'My Students'!$2:$2,0))","v":3.29}]
[{"$f":"INDEX(S:S,MATCH(\"StudentName\",R:R,0))","v":"Jones, Briana"},{"$f":"S1","v":"M00000004"},null,"ACTEngl",{"$f":"INDEX($S:$S,MATCH(\"ACTEngl\",$R:$R,0))","v":""},null,null,null,null,null,null,null,null,null,null,null,null,"ACTCompositeScore",{"$f":"INDEX('My Students'!$2:$16,MATCH($S$1,'My Students'!$B$2:$B$16,0),MATCH(R19,'My Students'!$2:$2,0))","v":22}]
[{"$f":"IFERROR(MID(A19,SEARCH(\" \",A19,1)+1,SEARCH(\" \",A19,SEARCH(\" \",A19,1)+1)-SEARCH(\" \",A19,1)-1),MID(A19,FIND(\" \",A19)+1,256))","v":"Briana"},{"$f":"CONCATENATE(LEFT(A19,FIND(\", \",A19,1)-1))","v":"Jones"},null,null,null,null,null,null,null,null,null,null,null,"Student athlete","SGASPRT (Also on main Customs spreadsheet but not sure if accurate)",null,null,"InclusiveGPA",{"$f":"INDEX('My Students'!$2:$16,MATCH($S$1,'My Students'!$B$2:$B$16,0),MATCH(R20,'My Students'!$2:$2,0))","v":""}]
["Major name",{"$f":"CONCATENATE(IF(E11=\"\",INDEX('Data Lists'!$B:$B,MATCH($E$7,'Data Lists'!$A:$A,0)),INDEX('Data Lists'!$B:$B,MATCH($E$11,'Data Lists'!$B:$B,0)))&IF(E18=\"Y\",\" (PREN)\",\"\"))","v":"Psychology"},null,"Flags",null,null,null,null,null,null,null,null,null,null,"Stu meet with SAEC advisor; Scheduling challenges; Major changes approved through SAEC",null,null,"HrsEarned",{"$f":"INDEX('My Students'!$2:$16,MATCH($S$1,'My Students'!$B$2:$B$16,0),MATCH(R21,'My Students'!$2:$2,0))","v":""}]
["Folder name",{"$f":"IF(E11=\"\",CONCATENATE(INDEX('Data Lists'!$E:$E,MATCH($E$7,'Data Lists'!$A:$A,0)),\" \",B20,\", \",A20,\" \",B3),CONCATENATE(INDEX('Data Lists'!$E:$E,MATCH($E$11,'Data Lists'!$B:$B,0)),\" \",B20,\", \",A20,\" \",B3))","v":"PSY Jones, Briana M00000004"},null,"Holds",{"$f":"INDEX($S:$S,MATCH(D22,$R:$R,0))","v":"None"},null,null,null,null,null,null,null,null,null,null,null,null,"CountrySlot",{"$f":"INDEX('My Students'!$2:$16,MATCH($S$1,'My Students'!$B$2:$B$16,0),MATCH(R22,'My Students'!$2:$2,0))","v":"VE - Venezuela (s759)"}]
["Dept folders",{"$f":"HYPERLINK(CONCATENATE(\"Z:\\CoBHS Advising\\Departments\\\",IF(E11=\"\",INDEX('Data Lists'!D:D,MATCH(E7,'Data Lists'!A:A,0)),INDEX('Data Lists'!D:D,MATCH(E11,'Data Lists'!B:B,0))),\"\\Student Forms\\\"))","v":"Z:\\CoBHS Advising\\Departments\\Psychology\\Student Forms\\"},null,"Reg Restrictions",{"$f":"INDEX($S:$S,MATCH(\"RegistrationRestrictions\",$R:$R,0))","v":0},null,"Transcripts",null,null,null,null,null,null,"Pre-Professional","May not know until stu or CBAS reports to us; ask in welcome email!",null,null,"CUSTOMSGrp",{"$f":"INDEX('My Students'!$2:$16,MATCH($S$1,'My Students'!$B$2:$B$16,0),MATCH(R23,'My Students'!$2:$2,0))","v":"PSY"}]
["Stu folder",{"$f":"HYPERLINK(CONCATENATE(\"Z:\\CoBHS Advising\\Departments\\\",IF(E11=\"\",INDEX('Data Lists'!D:D,MATCH(E7,'Data Lists'!A:A,0)),INDEX('Data Lists'!D:D,MATCH(E11,'Data Lists'!B:B,0))),\"\\Student Forms\\\",B22))","v":"Z:\\CoBHS Advising\\Departments\\Psychology\\Student Forms\\PSY Jones, Briana M00000004"},null,"Immunizations",{"$f":"INDEX($S:$S,MATCH(\"RegistrationRestrictions\",$R:$R,0))","v":0},null,null,null,"Prior schools",null,null,null,null,null,"Provide Pre-Prof info packet and info session flyer",null,null,"CustomsPOS",{"$f":"INDEX('My Students'!$2:$16,MATCH($S$1,'My Students'!$B$2:$B$16,0),MATCH(R24,'My Students'!$2:$2,0))","v":"BS_PSY"}]
[null,null,{"$f":"YEARFRAC(S33,NOW())","v":18.891666666666666},"Under 18 & Imm",{"$f":"IF(C25>=18,\"OK--over 18\",\"If need imms, will need parent sig\")","v":"OK--over 18"},null,null,null,"Missing classes/transcripts",null,null,null,null,null,null,null,null,"BannerPOS",{"$f":"INDEX('My Students'!$2:$16,MATCH($S$1,'My Students'!$B$2:$B$16,0),MATCH(R25,'My Students'!$2:$2,0))","v":"BS_PSY"}]
[null,null,null,"Missing Items",{"$f":"INDEX($S:$S,MATCH(\"MissingChecklistItems\",$R:$R,0))","v":"Final HS Tran upon Graduation"},null,null,null,"Subs needed",null,null,null,null,null,null,null,null,"Assigned Advisor",{"$f":"INDEX('My Students'!$2:$16,MATCH($S$1,'My Students'!$B$2:$B$16,0),MATCH(R26,'My Students'!$2:$2,0))","v":"Chloe"}]
[null,null,null,"Term",{"$f":"INDEX($S:$S,MATCH(\"TermDesc\",$R:$R,0))","v":"Fall 2019"},null,null,null,null,null,null,null,"Reg Issues","Task","Where to find info / What to check",null,null,"Customs Advisor",{"$f":"INDEX('My Students'!$2:$16,MATCH($S$1,'My Students'!$B$2:$B$16,0),MATCH(R27,'My Students'!$2:$2,0))","v":"Stacey"}]
[null,null,null,"Might need BUAF",{"$f":"INDEX($S:$S,MATCH(\"VetOrDep\",$R:$R,0))","v":""},null,null,null,null,null,null,null,null,"Immunization issues?","Banner: SZAITRK",null,null,"Holds",{"$f":"INDEX('My Students'!$2:$16,MATCH($S$1,'My Students'!$B$2:$B$16,0),MATCH(R28,'My Students'!$2:$2,0))","v":"None"}]
[null,null,null,"Reverse Transfer",{"$f":"INDEX($S:$S,MATCH(\"ReverseTransfer\",$R:$R,0))","v":""},null,null,null,null,null,null,null,null,null,"Missing imm docs, under 18--need parent form",null,null,"RegistrationRestrictions",{"$f":"INDEX('My Students'!$2:$16,MATCH($S$1,'My Students'!$B$2:$B$16,0),MATCH(R29,'My Students'!$2:$2,0))","v":0}]
[null,null,null,"First Generation",{"$f":"INDEX($S:$S,MATCH(\"1stGen\",$R:$R,0))","v":"N"},null,"Course Types",null,null,null,null,null,null,null,null,null,null,"MissingChecklistItems",{"$f":"INDEX('My Students'!$2:$16,MATCH($S$1,'My Students'!$B$2:$B$16,0),MATCH(R30,'My Students'!$2:$2,0))","v":"Final HS Tran upon Graduation"}]
["Want to add a link to the student's folder? ",null,null,null,null,null,null,null,"Prescribeds",null,null,null,null,"Holds","SOAHOLD, Customs chart--\"Factors\"",null,null,"AdmissionDecision",{"$f":"INDEX('My Students'!$2:$16,MATCH($S$1,'My Students'!$B$2:$B$16,0),MATCH(R31,'My Students'!$2:$2,0))","v":"LC-Freshman Tentative Admission"}]
["--Click on the \"Stu folder\" field above (B21).",null,null,null,null,null,null,null,"Check RLC options",null,null,null,null,null,null,null,null,"TermDesc",{"$f":"INDEX('My Students'!$2:$16,MATCH($S$1,'My Students'!$B$2:$B$16,0),MATCH(R32,'My Students'!$2:$2,0))","v":"Fall 2019"}]
["--Control-K to start the process of creating a link.",null,null,null,null,null,null,null,"Honors",null,null,null,null,null,null,null,null,"DateofBirth",{"$f":"INDEX('My Students'!$2:$16,MATCH($S$1,'My Students'!$B$2:$B$16,0),MATCH(R33,'My Students'!$2:$2,0))","v":"2001-03-09"}]
["--Browse to the student's folder.",null,null,null,null,null,null,null,"Pre-Nursing",null,null,null,null,null,null,null,null,"Notes",{"$f":"INDEX('My Students'!$2:$16,MATCH($S$1,'My Students'!$B$2:$B$16,0),MATCH(R34,'My Students'!$2:$2,0))","v":""}]
["--Choose any file in the folder and double-click on it.",null,null,null,null,null,null,null,null,null,null,null,"Check Transcripts","Task","Where to find info / What to check",null,null,"MTSUEmail",{"$f":"INDEX('My Students'!$2:$16,MATCH($S$1,'My Students'!$B$2:$B$16,0),MATCH(R35,'My Students'!$2:$2,0))","v":"5@mtmail.mtsu.edu"}]
["--In the Address box, delete the file name (back to the \\ after the folder name).",null,null,null,null,null,null,null,null,null,null,null,null,"Prior schools","Banner: SOAPCOL / Pipeline: Prior College Info",null,null,"PersonalEmail",{"$f":"INDEX('My Students'!$2:$16,MATCH($S$1,'My Students'!$B$2:$B$16,0),MATCH(R36,'My Students'!$2:$2,0))","v":"5@gmail.com"}]
["--Click OK.",null,null,null,null,null,"Major-Specific",null,null,null,null,null,null,null,null,null,null,"PermPhone",{"$f":"INDEX('My Students'!$2:$16,MATCH($S$1,'My Students'!$B$2:$B$16,0),MATCH(R37,'My Students'!$2:$2,0))","v":"(615) 319-0000"}]
["--Now you should see the path to the folder, underlined as a link.",null,null,null,null,null,null,null,null,null,null,null,null,null,null,null,null,"MailingPhone",{"$f":"INDEX('My Students'!$2:$16,MATCH($S$1,'My Students'!$B$2:$B$16,0),MATCH(R38,'My Students'!$2:$2,0))","v":"(615) 594-0000"}]
["--When you click on your link, the folder should open in a separate window.",null,null,null,null,null,null,null,null,null,null,null,null,"Missing classes/ transcripts","BDMS (Banner: SAAADMS, click search icon) / Pline: Transfer Eval / Ask stu in welcome email",null,null,"NursElig",{"$f":"INDEX('My Students'!$2:$16,MATCH($S$1,'My Students'!$B$2:$B$16,0),MATCH(R39,'My Students'!$2:$2,0))","v":""}]
[null,null,null,null,null,null,null,null,null,null,null,null,null,null,"FRs: AP, IB, DE, Dual Credit, Cambridge  /  TRs: Sems in progress or missing from MT transcript",null,null,"ACTMathScre",{"$f":"INDEX('My Students'!$2:$16,MATCH($S$1,'My Students'!$B$2:$B$16,0),MATCH(R40,'My Students'!$2:$2,0))","v":21}]
[null,null,null,null,null,null,null,null,null,null,null,null,null,null,null,null,null,"ACTScienceScre",{"$f":"INDEX('My Students'!$2:$16,MATCH($S$1,'My Students'!$B$2:$B$16,0),MATCH(R41,'My Students'!$2:$2,0))","v":19}]
[null,null,null,null,null,null,null,null,null,null,null,null,null,"Subs needed","By comparing transcript, transfer eval, & UD form.  Use TES for course descriptions.",null,null,"A&P?",{"$f":"IF(S1<>\"\",IF(OR(AND(S40=21,S41>21),AND(S40>21,S41=21)),\"maybe\",IF(AND(S31>=21,S41>=21),\"Y\",\"N\")),\"\")","v":"N"}]
[null,null,null,null,null,null,null,null,null,null,null,null,null,null,"Any classes that might/should count but aren't?",null,null,"Major by Look-up",{"$f":"INDEX('Data Lists'!B:B,MATCH(S24,'Data Lists'!A:A,0))","v":"Psychology"}]
[null,null,null,null,null,null,"Notes:",null,null,null,null,null,null,null,null,null,null,"NameM#",{"$f":"CONCATENATE(S47,\", \",S46,\" \",S45)","v":"Jones, Briana M00000004"}]
[null,null,null,null,null,null,null,null,null,null,null,null,"Pre-Customs Task Guide--Page 2",null,null,null,null,"M# copy",{"$f":"S1","v":"M00000004"}]
[null,null,null,null,null,null,null,null,null,null,null,null,"Specific Course Types","Task","Where to find info / What to check",null,null,"Fname",{"$f":"IF(1<>\"\",IFERROR(MID(S9,SEARCH(\" \",S9,1)+1,SEARCH(\" \",S9,SEARCH(\" \",S9,1)+1)-SEARCH(\" \",S9,1)-1),MID(S9,FIND(\" \",S9)+1,256)),\"\")","v":"Briana"}]
[null,null,null,null,null,null,null,null,null,null,null,null,null,"Prescribeds","Compare SZAADEF and SOATEST scores",null,null,"Lname",{"$f":"IF(S1<>\"\",CONCATENATE(LEFT(S9,FIND(\", \",S9,1)-1)),\"\")","v":"Jones"}]
[null,null,null,null,null,null,null,null,null,null,null,null,null,null,"Do they match? What K classes are required?  (\"SAILS Math\"=1010 or 1530 non-K or 1710K)"]
[null,null,null,null,null,null,"Post-Customs To-Do List",null,null,{"$f":"CONCATENATE($B$2,\" (\",$B$3,\")\")","v":"Briana Jones (M00000004)"}]
[null,null,null,null,null,null,"General",null,null,null,null,null,null,"Check RLC options","Based on class list"]
[null,null,null,null,null,null,null,null,"Assign advisor in Banner",null,null,null,null,null,"Must use for students who need READ 1000K/HIST 2020. May recommend for other students."]
[null,null,null,null,null,null,null,null,"Submit appointment report"]
[null,null,null,null,null,null,null,null,null,null,null,null,null,"Honors","Customs chart--\"Factors\" box"]
[null,null,null,null,null,null,null,null,null,null,null,null,null,null,"Is the student eligible to take honors classes? If TR, email Judy Albakry to add honors code."]
[]
[null,null,null,null,null,null,null,null,null,null,null,null,null,"Pre-Nursing","Customs chart--\"Factors\" box"]
[null,null,null,null,null,null,"Special Pops",null,null,null,null,null,null,null,"Do they need different gen eds for PREN vs major?"]
[null,null,null,null,null,null,null,null,"Vet benefits"]
[null,null,null,null,null,null,null,null,"Submit change of major form"]
[null,null,null,null,null,null,null,null,"Send follow-up emails, if needed",null,null,null,"Major-Specific Checks","Task","Where to find info / What to check"]
[null,null,null,null,null,null,null,null,null,null,null,null,null,"Check advising folder","Should have UD form, Reg checklist, anything else specific to major"]
[]
[]
[null,null,null,null,null,null,"Notes:"]
[]
[]
["Copy-Pastes & Folder Links",null,null,"MTSUEmail",{"$f":"B4","v":"5@mtmail.mtsu.edu"}]
[{"$f":"A19","v":"Jones, Briana"},{"$f":"$S$1","v":"M00000004"},null,"PersonalEmail",{"$f":"B5","v":"5@gmail.com"}]
[{"$f":"A20","v":"Briana"},{"$f":"B20","v":"Jones"},null,"CustomsPOS",{"$f":"E7","v":"BS_PSY"}]
["Major name",{"$f":"B21","v":"Psychology"},null,null,{"$f":"E8","v":"PREN--Psychology"}]
["Folder name","PSY Jones, Briana M00000004",null,"BannerPOS",{"$f":"E9","v":"BS_PSY"}]
["Dept folders",{"$f":"HYPERLINK(B24)","v":"Z:\\CoBHS Advising\\Departments\\Psychology\\Student Forms\\PSY Jones, Briana M00000004"},null,"Majors match?",{"$f":"E10","v":"Y"}]
["Stu folder",{"$f":"HYPERLINK(B25)","v":""},null,"Override major",{"$f":"E11","v":0}]
[null,null,null,"Might need BUAF",{"$f":"E28","v":""},null,null,null,null,null,null,null,"Post-Customs Task Guide"]
[null,null,null,null,null,null,null,null,null,null,null,null,"General","Task","Where to find info / What to check"]
["Start",null,null,"Change major",null,null,null,null,null,null,null,null,null,"Assign advisor in Banner","SGAADVR"]
["Stop",null,null,"Notes for advisor",null,null,null,null,null,null,null,null,null,null,"Our type is COLL; We generally are the primary advisor."]
[]
[null,"Report Builder",null,null,"Student Message Builder",null,null,null,null,null,null,null,null,"Submit appointment report","Navigate (SSC)"]
["Registered",null,"see below","Docs attached",null,"x (to say that you've attached docs for the student)"]
["Attaching Scan",null,"x","Drop/Add info",null,"x (to give info on switching classes & steps to do so)"]
["Submitted COM",null,"x","Acad success tips",null,"x (to give acad tips, tutoring & SI websites, & \"ask for help\")"]
["Supp Instructn",null,"x","NURS Info Session",null,"x (to refer student to nursing info webpage and session)",null,null,null,null,null,null,"Special Pops","Task","Where to find info / What to check"]
["RTTP",null,"x","Check phone #",null,"x (to tell stu their listed ph #s are wrong, & how to fix)",null,null,null,null,null,null,null,"Vet benefits","Submit BUAF"]
["Note 1",null,"x","Advisor info",{"$f":"INDEX('Data Lists'!$J:$J,MATCH($B$12,'Data Lists'!$H:$H,0))","v":"your advisor, Chloe (Chloe.Calhoun@mtsu.edu)"},"(leave formula, or type \"me <email>\")",null,null,null,null,null,null,null,null,"Form: Z:> Advising> Advising Forms> \"VA Benefit User Adv Form\"; Submit: V drive along w/ UD form"]
["Other",null,"[notes]","Other",null,"[type any notes to student]"]
["Paste in advising report:",{"$f":"CONCATENATE(\"Student came for advising during Customs.\",IF(B81<>\"\",\"  Attaching scanned copy of notes.\",\"\"),IF(B80=\"a\",Messages!$C$2,IF(B80=\"b\",Messages!$C$3,IF(B80<>\"\",CONCATENATE(\"  Registered student for classes for upcoming semester: \",B80),\"\"))),IF(B86<>\"\",CONCATENATE(\"\n\n\",B86),\"\"),IF(B82<>\"\",\"\n\nSubmitted change of major form. \",\"\"),IF(B83<>\"\",Messages!$C$4,\"\"),IF(B84<>\"\",Messages!$C$5,\"\"),IF(B85<>\"\",Messages!$C$6,\"\"))","v":"Student came for advising during Customs."},null,"Paste in stu msg:",{"$f":"CONCATENATE(\"We enjoyed seeing you at the CBHS Advising Center Customs session today, \",$A$21,\"!  \",IF(E80=\"x\",\"I've attached your Registration Checklist, for your records.\",\"\"),IF(E86<>\"\",CONCATENATE(\"\n\n\",E86),\"\"),IF(E81=\"x\",CONCATENATE(Messages!$C$7&E85&\", before making changes.\"),\"\"),IF(E84=\"x\",Messages!$C$10,\"\"),IF(E82=\"x\",Messages!$C$8,\"\"),IF(E83<>\"\",Messages!$C$9,\"\"),CONCATENATE(\"\n\nIf you have any questions or concerns, please contact \"&E85&\".  You'll also want to plan to come in for an advising appointment around mid-terms each semester, to talk about your classes for the upcoming term.  You can find Instructions and Schedule links at mtsu.edu/cbhsadv. \"),\"\n\nWe look forward to seeing you at MTSU this semester!\n\n\",$B$2,\"\n\",$B$3)","v":"We enjoyed seeing you at the CBHS Advising Center Customs session today, Major name!  \n\nIf you have any questions or concerns, please contact your advisor, Chloe (Chloe.Calhoun@mtsu.edu).  You'll also want to plan to come in for an advising appointment around mid-terms each semester, to talk about your classes for the upcoming term.  You can find Instructions and Schedule links at mtsu.edu/cbhsadv. \n\nWe look forward to seeing you at MTSU this semester!\n\nBriana Jones\nM00000004"},null,null,null,null,null,null,null,null,"Submit change of major form","(If applicable)  Pipeline > Bottom of Advisor menu"]
["\"Registered\" choices: \"a\" to get message re stu registering in lab, \"b\" to get message re helping stu register in office, or type list of classes to be inserted."]
[]
["This is what it will say:",null,null,"This is what it will say:",null,null,null,null,null,null,null,null,null,"Send follow-up emails","(if needed)"]
[{"$f":"B87","v":"Student came for advising during Customs."},null,null,{"$f":"E87","v":"We enjoyed seeing you at the CBHS Advising Center Customs session today, Major name!  \n\nIf you have any questions or concerns, please contact your advisor, Chloe (Chloe.Calhoun@mtsu.edu).  You'll also want to plan to come in for an advising appointment around mid-terms each semester, to talk about your classes for the upcoming term.  You can find Instructions and Schedule links at mtsu.edu/cbhsadv. \n\nWe look forward to seeing you at MTSU this semester!\n\nBriana Jones\nM00000004"},null,null,null,null,null,null,null,null,null,null,"e.g., To new advisor if student changed major during advising session"]

{"sheet":"5","index":6,"n_rows":91,"n_cols":20,"rows_kept":91,"cut":false,"hidden":false,"merged":[[90,0,114,1],[90,3,114,4],[82,12,91,12],[83,13,84,13],[86,13,87,13],[89,13,90,13],[66,13,67,13],[69,13,70,13],[74,12,80,12],[75,13,76,13],[78,13,79,13],[38,13,39,13],[41,13,42,13],[44,6,47,10],[45,12,57,12],[46,13,47,13],[49,6,54,6],[49,13,50,13],[50,9,53,9],[52,13,53,13],[55,13,56,13],[56,6,61,6],[57,9,60,9],[59,12,71,12],[60,13,61,13],[63,13,64,13],[64,6,68,10],[15,12,24,12],[16,9,19,9],[16,13,17,13],[19,13,20,13],[22,6,27,6],[22,13,23,13],[23,9,26,9],[26,12,32,12],[27,13,28,13],[29,6,34,6],[30,9,33,9],[30,13,31,13],[34,12,43,12],[35,13,36,13],[36,6,41,6],[37,9,40,9],[1,6,6,6],[2,9,5,9],[2,12,12,12],[2,13,3,13],[5,13,6,13],[8,6,13,6],[8,13,9,13],[9,9,12,9],[11,13,12,13],[14,0,15,0],[14,1,15,1],[14,3,15,3],[14,4,15,4],[15,6,20,6]]}
["Contact & Demographic Info",null,null,"Academic Info",null,null,"Pre-Customs To-Do List",null,null,{"$f":"CONCATENATE($B$2,\" (\",$B$3,\")\"&\", \"&B21)","v":"Christina Jones (M00000005), Leisure, Sport, & Tourism Studies"},null,null,"Pre-Customs Task Guide",null,null,null,null,"M#",{"$f":"'My Students'!B7","v":"M00000005"}]
["Name",{"$f":"CONCATENATE(A20,\" \",B20)","v":"Christina Jones"},null,"Transferred hours",{"$f":"INDEX($S:$S,MATCH(\"HrsEarned\",$R:$R,0))","v":""},null,"General",null,null,null,null,null,null,"Task","Where to find info / What to check",null,null,"Deleted",{"$f":"INDEX('My Students'!$2:$16,MATCH($S$1,'My Students'!$B$2:$B$16,0),MATCH(R2,'My Students'!$2:$2,0))","v":"This is sample data. The purple button will paste over it. Just ignore it for now!"}]
["M#",{"$f":"S1","v":"M00000005"},null,"HS GPA",{"$f":"INDEX($S:$S,MATCH(\"HighSchoolGPA\",$R:$R,0))","v":3.22},null,null,null,"Make stu folder in Z drive",null,null,null,"General","Make stu folder in Z drive","Naming scheme: <major> <conc> <last>, <first> <M#>",null,null,"SAcad",{"$f":"INDEX('My Students'!$2:$16,MATCH($S$1,'My Students'!$B$2:$B$16,0),MATCH(R3,'My Students'!$2:$2,0))","v":""}]
["MTSUEmail",{"$f":"INDEX($S:$S,MATCH(A4,$R:$R,0))","v":"6@mtmail.mtsu.edu"},null,"Inclusive GPA",{"$f":"INDEX($S:$S,MATCH(\"InclusiveGPA\",$R:$R,0))","v":""},null,null,null,"Check admit term",null,null,null,null,null,"e.g., CRJU LAEN Smith, John M01234567",null,null,"VetOrDep",{"$f":"INDEX('My Students'!$2:$16,MATCH($S$1,'My Students'!$B$2:$B$16,0),MATCH(R4,'My Students'!$2:$2,0))","v":""}]
["PersonalEmail",{"$f":"INDEX($S:$S,MATCH(A5,$R:$R,0))","v":"6@gmail.com"},null,"ACT Math",{"$f":"INDEX($S:$S,MATCH(\"ACTMathScre\",$R:$R,0))","v":20},null,null,null,"Major",null,null,null,null,null,null,null,null,"PREN",{"$f":"INDEX('My Students'!$2:$16,MATCH($S$1,'My Students'!$B$2:$B$16,0),MATCH(R5,'My Students'!$2:$2,0))","v":""}]
["PermPhone",{"$f":"INDEX($S:$S,MATCH(A6,$R:$R,0))","v":"(330) 531-0000"},null,"ACT Science",{"$f":"INDEX($S:$S,MATCH(\"ACTScienceScre\",$R:$R,0))","v":20},null,null,null,"Acad standing (TRs only)",null,null,null,null,"Check admit term","SAAADMS, Customs chart--\"Flags\"",null,null,"1stGen",{"$f":"INDEX('My Students'!$2:$16,MATCH($S$1,'My Students'!$B$2:$B$16,0),MATCH(R6,'My Students'!$2:$2,0))","v":"N"}]
["MailingPhone",{"$f":"INDEX($S:$S,MATCH(A7,$R:$R,0))","v":"(330) 531-0000"},null,"CustomsPOS",{"$f":"INDEX($S:$S,MATCH(D7,$R:$R,0))","v":"BS-LSTS"},null,null,null,null,null,null,null,null,null,"If summer: Verify w/ stu before Customs",null,null,"ReverseTransfer",{"$f":"INDEX('My Students'!$2:$16,MATCH($S$1,'My Students'!$B$2:$B$16,0),MATCH(R7,'My Students'!$2:$2,0))","v":""}]
[null,null,null,null,{"$f":"INDEX($S:$S,MATCH(\"Major\",$R:$R,0))","v":"LSTS"},null,null,null,null,null,null,null,null,null,null,null,null,"FR/TR",{"$f":"INDEX('My Students'!$2:$16,MATCH($S$1,'My Students'!$B$2:$B$16,0),MATCH(R8,'My Students'!$2:$2,0))","v":"F"}]
["Customs Info",null,null,"BannerPOS",{"$f":"INDEX($S:$S,MATCH(D9,$R:$R,0))","v":"AFC-YAFCYGEC"},null,"Special Pops",null,null,null,null,null,null,"Major","SGASTDN, Customs chart--\"Academic\" (& updates from stu)",null,null,"StudentName",{"$f":"INDEX('My Students'!$2:$16,MATCH($S$1,'My Students'!$B$2:$B$16,0),MATCH(R9,'My Students'!$2:$2,0))","v":"Jones, Christina"}]
["CountrySlot",{"$f":"INDEX(S:S,MATCH(A10,R:R,0))","v":"BZ - Belize (s139)"},null,"Majors match?",{"$f":"IF(AND(E11=\"\",E7=E9),\"Y\",\"N, Submit change of major\")","v":"N, Submit change of major"},null,null,null,"Vet benefits",null,null,null,null,null,null,null,null,"Major",{"$f":"INDEX('My Students'!$2:$16,MATCH($S$1,'My Students'!$B$2:$B$16,0),MATCH(R10,'My Students'!$2:$2,0))","v":"LSTS"}]
["Order/Time",{"$f":"CONCATENATE(INDEX(S:S,MATCH(A11,R:R,0)),\" (\",LEFT(S23,2),\")\")","v":"1/10:00 AM (HH)"},null,"Override major",null,null,null,null,"Student athlete",null,null,null,null,null,null,null,null,"Order/Time",{"$f":"INDEX('My Students'!$2:$16,MATCH($S$1,'My Students'!$B$2:$B$16,0),MATCH(R11,'My Students'!$2:$2,0))","v":"1/10:00 AM"}]
["Acad Advisor",{"$f":"INDEX($S:$S,MATCH(\"Assigned Advisor\",$R:$R,0))","v":"Dauthan"},null,null,null,null,null,null,"Pre-Professional",null,null,null,null,"Acad standing (TRs only)","SHATERM, SAAADMS, Transcript",null,null,"PrescribedCrsMath",{"$f":"INDEX('My Students'!$2:$16,MATCH($S$1,'My Students'!$B$2:$B$16,0),MATCH(R12,'My Students'!$2:$2,0))","v":"SAILS"},{"$f":"IF(S12=\"college level\",\"n\",IF(S12=0,\"blank--check\",\"y\"))","v":"y"}]
["Customs Advisor",{"$f":"INDEX($S:$S,MATCH(\"Customs Advisor\",$R:$R,0))","v":"Amy"},null,"Factors in Choosing Classes",null,null,null,null,null,null,null,null,null,null,"Probation on SHATERM? Must take U2020, meet GPA reqs 1st sem.",null,null,"PrescribedCrsWriting",{"$f":"INDEX('My Students'!$2:$16,MATCH($S$1,'My Students'!$B$2:$B$16,0),MATCH(R13,'My Students'!$2:$2,0))","v":"College level"},{"$f":"IF(S13=\"college level\",\"n\",IF(S13=0,\"blank--check\",\"y\"))","v":"n"}]
[null,null,null,"Honors",{"$f":"INDEX($S:$S,MATCH(\"HonorsElig\",$R:$R,0))","v":"Formula: N"},null,null,null,null,null,null,null,null,null,null,null,null,"PrescribedCrsReading",{"$f":"INDEX('My Students'!$2:$16,MATCH($S$1,'My Students'!$B$2:$B$16,0),MATCH(R14,'My Students'!$2:$2,0))","v":"College level"},{"$f":"IF(S14=\"college level\",\"n\",IF(S14=0,\"blank--check\",\"y\"))","v":"n"}]
["Emily's Notes",{"$f":"INDEX($S:$S,MATCH(\"Notes\",$R:$R,0))","v":""},null,"Prescribeds",{"$f":"IF(AND(T12=\"n\",T13=\"n\",T14=\"n\"),\"\",\nCONCATENATE(\"Ks: \"&IF(T12=\"y\",S12,\"\")&IF(T13=\"y\",\", \",\"\")&IF(T12=\"blank--check\",\"Math--check; \",\"\")&\nIF(T13=\"y\",\"ENGL\",\"\")&IF(T14=\"y\",\", \",\"\")&IF(T13=\"blank--check\",\"Engl--check; \",\"\")&\nIF(T14=\"y\",\"READ\",\"\")&IF(T15=\"y\",\", \",\"\")&IF(T14=\"blank--check\",\"Read--check; \",\"\")&\nIF(T15=\"y\",\"U1010\",\"\")))","v":"Ks: SAILS"},null,null,null,null,null,null,null,null,null,null,null,null,"PrescribedCrsStudySkills",{"$f":"INDEX('My Students'!$2:$16,MATCH($S$1,'My Students'!$B$2:$B$16,0),MATCH(R15,'My Students'!$2:$2,0))","v":"College level"},{"$f":"IF((T12<>\"n\")+(T13=\"y\")+(T14=\"y\")>=2,\"y\",\"n\")","v":"n"}]
[null,null,null,null,null,null,"Reg Issues",null,null,null,null,null,"Special Pops","Task","Where to find info / What to check",null,null,"HonorsElig",{"$f":"INDEX('My Students'!$2:$16,MATCH($S$1,'My Students'!$B$2:$B$16,0),MATCH(R16,'My Students'!$2:$2,0))","v":"Formula: N"}]
[null,null,null,"Scholars Acad",{"$f":"INDEX($S:$S,MATCH(\"Sacad\",$R:$R,0))","v":""},null,null,null,"Immunization issues?",null,null,null,null,"Vet benefits","SAAQUAN, SGASTDN, SPAIDEN, Customs chart--\"Flags\", ask student",null,null,"ACTEngl",{"$f":"INDEX('My Students'!$2:$16,MATCH($S$1,'My Students'!$B$2:$B$16,0),MATCH(R17,'My Students'!$2:$2,0))","v":""}]
["Copy-Pastes & Folder Links",null,null,"Pre-Nursing",{"$f":"INDEX($S:$S,MATCH(\"PREN\",$R:$R,0))","v":""},null,null,null,"Holds",null,null,null,null,null,"Need a BUAF form?  (FYI: Flag on Customs list doesn't always mean getting vet benefits!!)",null,null,"HighSchoolGPA",{"$f":"INDEX('My Students'!$2:$16,MATCH($S$1,'My Students'!$B$2:$B$16,0),MATCH(R18,'My Students'!$2:$2,0))","v":3.22}]
[{"$f":"INDEX(S:S,MATCH(\"StudentName\",R:R,0))","v":"Jones, Christina"},{"$f":"S1","v":"M00000005"},null,"ACTEngl",{"$f":"INDEX($S:$S,MATCH(\"ACTEngl\",$R:$R,0))","v":""},null,null,null,null,null,null,null,null,null,null,null,null,"ACTCompositeScore",{"$f":"INDEX('My Students'!$2:$16,MATCH($S$1,'My Students'!$B$2:$B$16,0),MATCH(R19,'My Students'!$2:$2,0))","v":20}]
[{"$f":"IFERROR(MID(A19,SEARCH(\" \",A19,1)+1,SEARCH(\" \",A19,SEARCH(\" \",A19,1)+1)-SEARCH(\" \",A19,1)-1),MID(A19,FIND(\" \",A19)+1,256))","v":"Christina"},{"$f":"CONCATENATE(LEFT(A19,FIND(\", \",A19,1)-1))","v":"Jones"},null,null,null,null,null,null,null,null,null,null,null,"Student athlete","SGASPRT (Also on main Customs spreadsheet but not sure if accurate)",null,null,"InclusiveGPA",{"$f":"INDEX('My Students'!$2:$16,MATCH($S$1,'My Students'!$B$2:$B$16,0),MATCH(R20,'My Students'!$2:$2,0))","v":""}]
["Major name",{"$f":"CONCATENATE(IF(E11=\"\",INDEX('Data Lists'!$B:$B,MATCH($E$7,'Data Lists'!$A:$A,0)),INDEX('Data Lists'!$B:$B,MATCH($E$11,'Data Lists'!$B:$B,0)))&IF(E18=\"Y\",\" (PREN)\",\"\"))","v":"Leisure, Sport, & Tourism Studies"},null,"Flags",null,null,null,null,null,null,null,null,null,null,"Stu meet with SAEC advisor; Scheduling challenges; Major changes approved through SAEC",null,null,"HrsEarned",{"$f":"INDEX('My Students'!$2:$16,MATCH($S$1,'My Students'!$B$2:$B$16,0),MATCH(R21,'My Students'!$2:$2,0))","v":""}]
["Folder name",{"$f":"IF(E11=\"\",CONCATENATE(INDEX('Data Lists'!$E:$E,MATCH($E$7,'Data Lists'!$A:$A,0)),\" \",B20,\", \",A20,\" \",B3),CONCATENATE(INDEX('Data Lists'!$E:$E,MATCH($E$11,'Data Lists'!$B:$B,0)),\" \",B20,\", \",A20,\" \",B3))","v":"LSTS Jones, Christina M00000005"},null,"Holds",{"$f":"INDEX($S:$S,MATCH(D22,$R:$R,0))","v":"None"},null,null,null,null,null,null,null,null,null,null,null,null,"CountrySlot",{"$f":"INDEX('My Students'!$2:$16,MATCH($S$1,'My Students'!$B$2:$B$16,0),MATCH(R22,'My Students'!$2:$2,0))","v":"BZ - Belize (s139)"}]
["Dept folders",{"$f":"HYPERLINK(CONCATENATE(\"Z:\\CoBHS Advising\\Departments\\\",IF(E11=\"\",INDEX('Data Lists'!D:D,MATCH(E7,'Data Lists'!A:A,0)),INDEX('Data Lists'!D:D,MATCH(E11,'Data Lists'!B:B,0))),\"\\Student Forms\\\"))","v":"Z:\\CoBHS Advising\\Departments\\Health & Human Performance\\Student Forms\\"},null,"Reg Restrictions",{"$f":"INDEX($S:$S,MATCH(\"RegistrationRestrictions\",$R:$R,0))","v":0},null,"Transcripts",null,null,null,null,null,null,"Pre-Professional","May not know until stu or CBAS reports to us; ask in welcome email!",null,null,"CUSTOMSGrp",{"$f":"INDEX('My Students'!$2:$16,MATCH($S$1,'My Students'!$B$2:$B$16,0),MATCH(R23,'My Students'!$2:$2,0))","v":"HHP"}]
["Stu folder",{"$f":"HYPERLINK(CONCATENATE(\"Z:\\CoBHS Advising\\Departments\\\",IF(E11=\"\",INDEX('Data Lists'!D:D,MATCH(E7,'Data Lists'!A:A,0)),INDEX('Data Lists'!D:D,MATCH(E11,'Data Lists'!B:B,0))),\"\\Student Forms\\\",B22))","v":"Z:\\CoBHS Advising\\Departments\\Health & Human Performance\\Student Forms\\LSTS Jones, Christina M00000005"},null,"Immunizations",{"$f":"INDEX($S:$S,MATCH(\"RegistrationRestrictions\",$R:$R,0))","v":0},null,null,null,"Prior schools",null,null,null,null,null,"Provide Pre-Prof info packet and info session flyer",null,null,"CustomsPOS",{"$f":"INDEX('My Students'!$2:$16,MATCH($S$1,'My Students'!$B$2:$B$16,0),MATCH(R24,'My Students'!$2:$2,0))","v":"BS-LSTS"}]
[null,null,{"$f":"YEARFRAC(S33,NOW())","v":18.844444444444445},"Under 18 & Imm",{"$f":"IF(C25>=18,\"OK--over 18\",\"If need imms, will need parent sig\")","v":"OK--over 18"},null,null,null,"Missing classes/transcripts",null,null,null,null,null,null,null,null,"BannerPOS",{"$f":"INDEX('My Students'!$2:$16,MATCH($S$1,'My Students'!$B$2:$B$16,0),MATCH(R25,'My Students'!$2:$2,0))","v":"AFC-YAFCYGEC"}]
[null,null,null,"Missing Items",{"$f":"INDEX($S:$S,MATCH(\"MissingChecklistItems\",$R:$R,0))","v":"Final HS Tran upon Graduation"},null,null,null,"Subs needed",null,null,null,null,null,null,null,null,"Assigned Advisor",{"$f":"INDEX('My Students'!$2:$16,MATCH($S$1,'My Students'!$B$2:$B$16,0),MATCH(R26,'My Students'!$2:$2,0))","v":"Dauthan"}]
[null,null,null,"Term",{"$f":"INDEX($S:$S,MATCH(\"TermDesc\",$R:$R,0))","v":"Fall 2019"},null,null,null,null,null,null,null,"Reg Issues","Task","Where to find info / What to check",null,null,"Customs Advisor",{"$f":"INDEX('My Students'!$2:$16,MATCH($S$1,'My Students'!$B$2:$B$16,0),MATCH(R27,'My Students'!$2:$2,0))","v":"Amy"}]
[null,null,null,"Might need BUAF",{"$f":"INDEX($S:$S,MATCH(\"VetOrDep\",$R:$R,0))","v":""},null,null,null,null,null,null,null,null,"Immunization issues?","Banner: SZAITRK",null,null,"Holds",{"$f":"INDEX('My Students'!$2:$16,MATCH($S$1,'My Students'!$B$2:$B$16,0),MATCH(R28,'My Students'!$2:$2,0))","v":"None"}]
[null,null,null,"Reverse Transfer",{"$f":"INDEX($S:$S,MATCH(\"ReverseTransfer\",$R:$R,0))","v":""},null,null,null,null,null,null,null,null,null,"Missing imm docs, under 18--need parent form",null,null,"RegistrationRestrictions",{"$f":"INDEX('My Students'!$2:$16,MATCH($S$1,'My Students'!$B$2:$B$16,0),MATCH(R29,'My Students'!$2:$2,0))","v":0}]
[null,null,null,"First Generation",{"$f":"INDEX($S:$S,MATCH(\"1stGen\",$R:$R,0))","v":"N"},null,"Course Types",null,null,null,null,null,null,null,null,null,null,"MissingChecklistItems",{"$f":"INDEX('My Students'!$2:$16,MATCH($S$1,'My Students'!$B$2:$B$16,0),MATCH(R30,'My Students'!$2:$2,0))","v":"Final HS Tran upon Graduation"}]
["Want to add a link to the student's folder? ",null,null,null,null,null,null,null,"Prescribeds",null,null,null,null,"Holds","SOAHOLD, Customs chart--\"Factors\"",null,null,"AdmissionDecision",{"$f":"INDEX('My Students'!$2:$16,MATCH($S$1,'My Students'!$B$2:$B$16,0),MATCH(R31,'My Students'!$2:$2,0))","v":"FC-Freshman Tentative Accept"}]
["--Click on the \"Stu folder\" field above (B21).",null,null,null,null,null,null,null,"Check RLC options",null,null,null,null,null,null,null,null,"TermDesc",{"$f":"INDEX('My Students'!$2:$16,MATCH($S$1,'My Students'!$B$2:$B$16,0),MATCH(R32,'My Students'!$2:$2,0))","v":"Fall 2019"}]
["--Control-K to start the process of creating a link.",null,null,null,null,null,null,null,"Honors",null,null,null,null,null,null,null,null,"DateofBirth",{"$f":"INDEX('My Students'!$2:$16,MATCH($S$1,'My Students'!$B$2:$B$16,0),MATCH(R33,'My Students'!$2:$2,0))","v":"2001-03-26"}]
["--Browse to the student's folder.",null,null,null,null,null,null,null,"Pre-Nursing",null,null,null,null,null,null,null,null,"Notes",{"$f":"INDEX('My Students'!$2:$16,MATCH($S$1,'My Students'!$B$2:$B$16,0),MATCH(R34,'My Students'!$2:$2,0))","v":""}]
["--Choose any file in the folder and double-click on it.",null,null,null,null,null,null,null,null,null,null,null,"Check Transcripts","Task","Where to find info / What to check",null,null,"MTSUEmail",{"$f":"INDEX('My Students'!$2:$16,MATCH($S$1,'My Students'!$B$2:$B$16,0),MATCH(R35,'My Students'!$2:$2,0))","v":"6@mtmail.mtsu.edu"}]
["--In the Address box, delete the file name (back to the \\ after the folder name).",null,null,null,null,null,null,null,null,null,null,null,null,"Prior schools","Banner: SOAPCOL / Pipeline: Prior College Info",null,null,"PersonalEmail",{"$f":"INDEX('My Students'!$2:$16,MATCH($S$1,'My Students'!$B$2:$B$16,0),MATCH(R36,'My Students'!$2:$2,0))","v":"6@gmail.com"}]
["--Click OK.",null,null,null,null,null,"Major-Specific",null,null,null,null,null,null,null,null,null,null,"PermPhone",{"$f":"INDEX('My Students'!$2:$16,MATCH($S$1,'My Students'!$B$2:$B$16,0),MATCH(R37,'My Students'!$2:$2,0))","v":"(330) 531-0000"}]
["--Now you should see the path to the folder, underlined as a link.",null,null,null,null,null,null,null,null,null,null,null,null,null,null,null,null,"MailingPhone",{"$f":"INDEX('My Students'!$2:$16,MATCH($S$1,'My Students'!$B$2:$B$16,0),MATCH(R38,'My Students'!$2:$2,0))","v":"(330) 531-0000"}]
["--When you click on your link, the folder should open in a separate window.",null,null,null,null,null,null,null,null,null,null,null,null,"Missing classes/ transcripts","BDMS (Banner: SAAADMS, click search icon) / Pline: Transfer Eval / Ask stu in welcome email",null,null,"NursElig",{"$f":"INDEX('My Students'!$2:$16,MATCH($S$1,'My Students'!$B$2:$B$16,0),MATCH(R39,'My Students'!$2:$2,0))","v":""}]
[null,null,null,null,null,null,null,null,null,null,null,null,null,null,"FRs: AP, IB, DE, Dual Credit, Cambridge  /  TRs: Sems in progress or missing from MT transcript",null,null,"ACTMathScre",{"$f":"INDEX('My Students'!$2:$16,MATCH($S$1,'My Students'!$B$2:$B$16,0),MATCH(R40,'My Students'!$2:$2,0))","v":20}]
[null,null,null,null,null,null,null,null,null,null,null,null,null,null,null,null,null,"ACTScienceScre",{"$f":"INDEX('My Students'!$2:$16,MATCH($S$1,'My Students'!$B$2:$B$16,0),MATCH(R41,'My Students'!$2:$2,0))","v":20}]
[null,null,null,null,null,null,null,null,null,null,null,null,null,"Subs needed","By comparing transcript, transfer eval, & UD form.  Use TES for course descriptions.",null,null,"A&P?",{"$f":"IF(S1<>\"\",IF(OR(AND(S40=21,S41>21),AND(S40>21,S41=21)),\"maybe\",IF(AND(S31>=21,S41>=21),\"Y\",\"N\")),\"\")","v":"N"}]
[null,null,null,null,null,null,null,null,null,null,null,null,null,null,"Any classes that might/should count but aren't?",null,null,"Major by Look-up",{"$f":"INDEX('Data Lists'!B:B,MATCH(S24,'Data Lists'!A:A,0))","v":"Leisure, Sport, & Tourism Studies"}]
[null,null,null,null,null,null,"Notes:",null,null,null,null,null,null,null,null,null,null,"NameM#",{"$f":"CONCATENATE(S47,\", \",S46,\" \",S45)","v":"Jones, Christina M00000005"}]
[null,null,null,null,null,null,null,null,null,null,null,null,"Pre-Customs Task Guide--Page 2",null,null,null,null,"M# copy",{"$f":"S1","v":"M00000005"}]
[null,null,null,null,null,null,null,null,null,null,null,null,"Specific Course Types","Task","Where to find info / What to check",null,null,"Fname",{"$f":"IF(1<>\"\",IFERROR(MID(S9,SEARCH(\" \",S9,1)+1,SEARCH(\" \",S9,SEARCH(\" \",S9,1)+1)-SEARCH(\" \",S9,1)-1),MID(S9,FIND(\" \",S9)+1,256)),\"\")","v":"Christina"}]
[null,null,null,null,null,null,null,null,null,null,null,null,null,"Prescribeds","Compare SZAADEF and SOATEST scores",null,null,"Lname",{"$f":"IF(S1<>\"\",CONCATENATE(LEFT(S9,FIND(\", \",S9,1)-1)),\"\")","v":"Jones"}]
[null,null,null,null,null,null,null,null,null,null,null,null,null,null,"Do they match? What K classes are required?  (\"SAILS Math\"=1010 or 1530 non-K or 1710K)"]
[null,null,null,null,null,null,"Post-Customs To-Do List",null,null,{"$f":"CONCATENATE($B$2,\" (\",$B$3,\")\")","v":"Christina Jones (M00000005)"}]
[null,null,null,null,null,null,"General",null,null,null,null,null,null,"Check RLC options","Based on class list"]
[null,null,null,null,null,null,null,null,"Assign advisor in Banner",null,null,null,null,null,"Must use for students who need READ 1000K/HIST 2020. May recommend for other students."]
[null,null,null,null,null,null,null,null,"Submit appointment report"]
[null,null,null,null,null,null,null,null,null,null,null,null,null,"Honors","Customs chart--\"Factors\" box"]
[null,null,null,null,null,null,null,null,null,null,null,null,null,null,"Is the student eligible to take honors classes? If TR, email Judy Albakry to add honors code."]
[]
[null,null,null,null,null,null,null,null,null,null,null,null,null,"Pre-Nursing","Customs chart--\"Factors\" box"]
[null,null,null,null,null,null,"Special Pops",null,null,null,null,null,null,null,"Do they need different gen eds for PREN vs major?"]
[null,null,null,null,null,null,null,null,"Vet benefits"]
[null,null,null,null,null,null,null,null,"Submit change of major form"]
[null,null,null,null,null,null,null,null,"Send follow-up emails, if needed",null,null,null,"Major-Specific Checks","Task","Where to find info / What to check"]
[null,null,null,null,null,null,null,null,null,null,null,null,null,"Check advising folder","Should have UD form, Reg checklist, anything else specific to major"]
[]
[]
[null,null,null,null,null,null,"Notes:"]
[]
[]
["Copy-Pastes & Folder Links",null,null,"MTSUEmail",{"$f":"B4","v":"6@mtmail.mtsu.edu"}]
[{"$f":"A19","v":"Jones, Christina"},{"$f":"$S$1","v":"M00000005"},null,"PersonalEmail",{"$f":"B5","v":"6@gmail.com"}]
[{"$f":"A20","v":"Christina"},{"$f":"B20","v":"Jones"},null,"CustomsPOS",{"$f":"E7","v":"BS-LSTS"}]
["Major name",{"$f":"B21","v":"Leisure, Sport, & Tourism Studies"},null,null,{"$f":"E8","v":"LSTS"}]
["Folder name","LSTS Jones, Christina M00000005",null,"BannerPOS",{"$f":"E9","v":"AFC-YAFCYGEC"}]
["Dept folders",{"$f":"HYPERLINK(B24)","v":"Z:\\CoBHS Advising\\Departments\\Health & Human Performance\\Student Forms\\LSTS Jones, Christina M00000005"},null,"Majors match?",{"$f":"E10","v":"N, Submit change of major"}]
["Stu folder",{"$f":"HYPERLINK(B25)","v":""},null,"Override major",{"$f":"E11","v":0}]
[null,null,null,"Might need BUAF",{"$f":"E28","v":""},null,null,null,null,null,null,null,"Post-Customs Task Guide"]
[null,null,null,null,null,null,null,null,null,null,null,null,"General","Task","Where to find info / What to check"]
["Start",null,null,"Change major",null,null,null,null,null,null,null,null,null,"Assign advisor in Banner","SGAADVR"]
["Stop",null,null,"Notes for advisor",null,null,null,null,null,null,null,null,null,null,"Our type is COLL; We generally are the primary advisor."]
[]
[null,"Report Builder",null,null,"Student Message Builder",null,null,null,null,null,null,null,null,"Submit appointment report","Navigate (SSC)"]
["Registered",null,"see below","Docs attached",null,"x (to say that you've attached docs for the student)"]
["Attaching Scan",null,"x","Drop/Add info",null,"x (to give info on switching classes & steps to do so)"]
["Submitted COM",null,"x","Acad success tips",null,"x (to give acad tips, tutoring & SI websites, & \"ask for help\")"]
["Supp Instructn",null,"x","NURS Info Session",null,"x (to refer student to nursing info webpage and session)",null,null,null,null,null,null,"Special Pops","Task","Where to find info / What to check"]
["RTTP",null,"x","Check phone #",null,"x (to tell stu their listed ph #s are wrong, & how to fix)",null,null,null,null,null,null,null,"Vet benefits","Submit BUAF"]
["Note 1",null,"x","Advisor info",{"$f":"INDEX('Data Lists'!$J:$J,MATCH($B$12,'Data Lists'!$H:$H,0))","v":"your advisor, Dauthan (Dauthan.Keener@mtsu.edu)"},"(leave formula, or type \"me <email>\")",null,null,null,null,null,null,null,null,"Form: Z:> Advising> Advising Forms> \"VA Benefit User Adv Form\"; Submit: V drive along w/ UD form"]
["Other",null,"[notes]","Other",null,"[type any notes to student]"]
["Paste in advising report:",{"$f":"CONCATENATE(\"Student came for advising during Customs.\",IF(B81<>\"\",\"  Attaching scanned copy of notes.\",\"\"),IF(B80=\"a\",Messages!$C$2,IF(B80=\"b\",Messages!$C$3,IF(B80<>\"\",CONCATENATE(\"  Registered student for classes for upcoming semester: \",B80),\"\"))),IF(B86<>\"\",CONCATENATE(\"\n\n\",B86),\"\"),IF(B82<>\"\",\"\n\nSubmitted change of major form. \",\"\"),IF(B83<>\"\",Messages!$C$4,\"\"),IF(B84<>\"\",Messages!$C$5,\"\"),IF(B85<>\"\",Messages!$C$6,\"\"))","v":"Student came for advising during Customs."},null,"Paste in stu msg:",{"$f":"CONCATENATE(\"We enjoyed seeing you at the CBHS Advising Center Customs session today, \",$A$21,\"!  \",IF(E80=\"x\",\"I've attached your Registration Checklist, for your records.\",\"\"),IF(E86<>\"\",CONCATENATE(\"\n\n\",E86),\"\"),IF(E81=\"x\",CONCATENATE(Messages!$C$7&E85&\", before making changes.\"),\"\"),IF(E84=\"x\",Messages!$C$10,\"\"),IF(E82=\"x\",Messages!$C$8,\"\"),IF(E83<>\"\",Messages!$C$9,\"\"),CONCATENATE(\"\n\nIf you have any questions or concerns, please contact \"&E85&\".  You'll also want to plan to come in for an advising appointment around mid-terms each semester, to talk about your classes for the upcoming term.  You can find Instructions and Schedule links at mtsu.edu/cbhsadv. \"),\"\n\nWe look forward to seeing you at MTSU this semester!\n\n\",$B$2,\"\n\",$B$3)","v":"We enjoyed seeing you at the CBHS Advising Center Customs session today, Major name!  \n\nIf you have any questions or concerns, please contact your advisor, Dauthan (Dauthan.Keener@mtsu.edu).  You'll also want to plan to come in for an advising appointment around mid-terms each semester, to talk about your classes for the upcoming term.  You can find Instructions and Schedule links at mtsu.edu/cbhsadv. \n\nWe look forward to seeing you at MTSU this semester!\n\nChristina Jones\nM00000005"},null,null,null,null,null,null,null,null,"Submit change of major form","(If applicable)  Pipeline > Bottom of Advisor menu"]
["\"Registered\" choices: \"a\" to get message re stu registering in lab, \"b\" to get message re helping stu register in office, or type list of classes to be inserted."]
[]
["This is what it will say:",null,null,"This is what it will say:",null,null,null,null,null,null,null,null,null,"Send follow-up emails","(if needed)"]
[{"$f":"B87","v":"Student came for advising during Customs."},null,null,{"$f":"E87","v":"We enjoyed seeing you at the CBHS Advising Center Customs session today, Major name!  \n\nIf you have any questions or concerns, please contact your advisor, Dauthan (Dauthan.Keener@mtsu.edu).  You'll also want to plan to come in for an advising appointment around mid-terms each semester, to talk about your classes for the upcoming term.  You can find Instructions and Schedule links at mtsu.edu/cbhsadv. \n\nWe look forward to seeing you at MTSU this semester!\n\nChristina Jones\nM00000005"},null,null,null,null,null,null,null,null,null,null,"e.g., To new advisor if student changed major during advising session"]

{"sheet":"6","index":7,"n_rows":91,"n_cols":20,"rows_kept":91,"cut":false,"hidden":false,"merged":[[90,0,114,1],[90,3,114,4],[82,12,91,12],[83,13,84,13],[86,13,87,13],[89,13,90,13],[66,13,67,13],[69,13,70,13],[74,12,80,12],[75,13,76,13],[78,13,79,13],[38,13,39,13],[41,13,42,13],[44,6,47,10],[45,12,57,12],[46,13,47,13],[49,6,54,6],[49,13,50,13],[50,9,53,9],[52,13,53,13],[55,13,56,13],[56,6,61,6],[57,9,60,9],[59,12,71,12],[60,13,61,13],[63,13,64,13],[64,6,68,10],[15,12,24,12],[16,9,19,9],[16,13,17,13],[19,13,20,13],[22,6,27,6],[22,13,23,13],[23,9,26,9],[26,12,32,12],[27,13,28,13],[29,6,34,6],[30,9,33,9],[30,13,31,13],[34,12,43,12],[35,13,36,13],[36,6,41,6],[37,9,40,9],[1,6,6,6],[2,9,5,9],[2,12,12,12],[2,13,3,13],[5,13,6,13],[8,6,13,6],[8,13,9,13],[9,9,12,9],[11,13,12,13],[14,0,15,0],[14,1,15,1],[14,3,15,3],[14,4,15,4],[15,6,20,6]]}
["Contact & Demographic Info",null,null,"Academic Info",null,null,"Pre-Customs To-Do List",null,null,{"$f":"CONCATENATE($B$2,\" (\",$B$3,\")\"&\", \"&B21)","v":{"$error":"#N/A"}},null,null,"Pre-Customs Task Guide",null,null,null,null,"M#",{"$f":"'My Students'!B8","v":0}]
["Name",{"$f":"CONCATENATE(A20,\" \",B20)","v":{"$error":"#N/A"}},null,"Transferred hours",{"$f":"INDEX($S:$S,MATCH(\"HrsEarned\",$R:$R,0))","v":{"$error":"#N/A"}},null,"General",null,null,null,null,null,null,"Task","Where to find info / What to check",null,null,"Deleted",{"$f":"INDEX('My Students'!$2:$16,MATCH($S$1,'My Students'!$B$2:$B$16,0),MATCH(R2,'My Students'!$2:$2,0))","v":{"$error":"#N/A"}}]
["M#",{"$f":"S1","v":0},null,"HS GPA",{"$f":"INDEX($S:$S,MATCH(\"HighSchoolGPA\",$R:$R,0))","v":{"$error":"#N/A"}},null,null,null,"Make stu folder in Z drive",null,null,null,"General","Make stu folder in Z drive","Naming scheme: <major> <conc> <last>, <first> <M#>",null,null,"SAcad",{"$f":"INDEX('My Students'!$2:$16,MATCH($S$1,'My Students'!$B$2:$B$16,0),MATCH(R3,'My Students'!$2:$2,0))","v":{"$error":"#N/A"}}]
["MTSUEmail",{"$f":"INDEX($S:$S,MATCH(A4,$R:$R,0))","v":{"$error":"#N/A"}},null,"Inclusive GPA",{"$f":"INDEX($S:$S,MATCH(\"InclusiveGPA\",$R:$R,0))","v":{"$error":"#N/A"}},null,null,null,"Check admit term",null,null,null,null,null,"e.g., CRJU LAEN Smith, John M01234567",null,null,"VetOrDep",{"$f":"INDEX('My Students'!$2:$16,MATCH($S$1,'My Students'!$B$2:$B$16,0),MATCH(R4,'My Students'!$2:$2,0))","v":{"$error":"#N/A"}}]
["PersonalEmail",{"$f":"INDEX($S:$S,MATCH(A5,$R:$R,0))","v":{"$error":"#N/A"}},null,"ACT Math",{"$f":"INDEX($S:$S,MATCH(\"ACTMathScre\",$R:$R,0))","v":{"$error":"#N/A"}},null,null,null,"Major",null,null,null,null,null,null,null,null,"PREN",{"$f":"INDEX('My Students'!$2:$16,MATCH($S$1,'My Students'!$B$2:$B$16,0),MATCH(R5,'My Students'!$2:$2,0))","v":{"$error":"#N/A"}}]
["PermPhone",{"$f":"INDEX($S:$S,MATCH(A6,$R:$R,0))","v":{"$error":"#N/A"}},null,"ACT Science",{"$f":"INDEX($S:$S,MATCH(\"ACTScienceScre\",$R:$R,0))","v":{"$error":"#N/A"}},null,null,null,"Acad standing (TRs only)",null,null,null,null,"Check admit term","SAAADMS, Customs chart--\"Flags\"",null,null,"1stGen",{"$f":"INDEX('My Students'!$2:$16,MATCH($S$1,'My Students'!$B$2:$B$16,0),MATCH(R6,'My Students'!$2:$2,0))","v":{"$error":"#N/A"}}]
["MailingPhone",{"$f":"INDEX($S:$S,MATCH(A7,$R:$R,0))","v":{"$error":"#N/A"}},null,"CustomsPOS",{"$f":"INDEX($S:$S,MATCH(D7,$R:$R,0))","v":{"$error":"#N/A"}},null,null,null,null,null,null,null,null,null,"If summer: Verify w/ stu before Customs",null,null,"ReverseTransfer",{"$f":"INDEX('My Students'!$2:$16,MATCH($S$1,'My Students'!$B$2:$B$16,0),MATCH(R7,'My Students'!$2:$2,0))","v":{"$error":"#N/A"}}]
[null,null,null,null,{"$f":"INDEX($S:$S,MATCH(\"Major\",$R:$R,0))","v":{"$error":"#N/A"}},null,null,null,null,null,null,null,null,null,null,null,null,"FR/TR",{"$f":"INDEX('My Students'!$2:$16,MATCH($S$1,'My Students'!$B$2:$B$16,0),MATCH(R8,'My Students'!$2:$2,0))","v":{"$error":"#N/A"}}]
["Customs Info",null,null,"BannerPOS",{"$f":"INDEX($S:$S,MATCH(D9,$R:$R,0))","v":{"$error":"#N/A"}},null,"Special Pops",null,null,null,null,null,null,"Major","SGASTDN, Customs chart--\"Academic\" (& updates from stu)",null,null,"StudentName",{"$f":"INDEX('My Students'!$2:$16,MATCH($S$1,'My Students'!$B$2:$B$16,0),MATCH(R9,'My Students'!$2:$2,0))","v":{"$error":"#N/A"}}]
["CountrySlot",{"$f":"INDEX(S:S,MATCH(A10,R:R,0))","v":{"$error":"#N/A"}},null,"Majors match?",{"$f":"IF(AND(E11=\"\",E7=E9),\"Y\",\"N, Submit change of major\")","v":{"$error":"#N/A"}},null,null,null,"Vet benefits",null,null,null,null,null,null,null,null,"Major",{"$f":"INDEX('My Students'!$2:$16,MATCH($S$1,'My Students'!$B$2:$B$16,0),MATCH(R10,'My Students'!$2:$2,0))","v":{"$error":"#N/A"}}]
["Order/Time",{"$f":"CONCATENATE(INDEX(S:S,MATCH(A11,R:R,0)),\" (\",LEFT(S23,2),\")\")","v":{"$error":"#N/A"}},null,"Override major",null,null,null,null,"Student athlete",null,null,null,null,null,null,null,null,"Order/Time",{"$f":"INDEX('My Students'!$2:$16,MATCH($S$1,'My Students'!$B$2:$B$16,0),MATCH(R11,'My Students'!$2:$2,0))","v":{"$error":"#N/A"}}]
["Acad Advisor",{"$f":"INDEX($S:$S,MATCH(\"Assigned Advisor\",$R:$R,0))","v":{"$error":"#N/A"}},null,null,null,null,null,null,"Pre-Professional",null,null,null,null,"Acad standing (TRs only)","SHATERM, SAAADMS, Transcript",null,null,"PrescribedCrsMath",{"$f":"INDEX('My Students'!$2:$16,MATCH($S$1,'My Students'!$B$2:$B$16,0),MATCH(R12,'My Students'!$2:$2,0))","v":{"$error":"#N/A"}},{"$f":"IF(S12=\"college level\",\"n\",IF(S12=0,\"blank--check\",\"y\"))","v":{"$error":"#N/A"}}]
["Customs Advisor",{"$f":"INDEX($S:$S,MATCH(\"Customs Advisor\",$R:$R,0))","v":{"$error":"#N/A"}},null,"Factors in Choosing Classes",null,null,null,null,null,null,null,null,null,null,"Probation on SHATERM? Must take U2020, meet GPA reqs 1st sem.",null,null,"PrescribedCrsWriting",{"$f":"INDEX('My Students'!$2:$16,MATCH($S$1,'My Students'!$B$2:$B$16,0),MATCH(R13,'My Students'!$2:$2,0))","v":{"$error":"#N/A"}},{"$f":"IF(S13=\"college level\",\"n\",IF(S13=0,\"blank--check\",\"y\"))","v":{"$error":"#N/A"}}]
[null,null,null,"Honors",{"$f":"INDEX($S:$S,MATCH(\"HonorsElig\",$R:$R,0))","v":{"$error":"#N/A"}},null,null,null,null,null,null,null,null,null,null,null,null,"PrescribedCrsReading",{"$f":"INDEX('My Students'!$2:$16,MATCH($S$1,'My Students'!$B$2:$B$16,0),MATCH(R14,'My Students'!$2:$2,0))","v":{"$error":"#N/A"}},{"$f":"IF(S14=\"college level\",\"n\",IF(S14=0,\"blank--check\",\"y\"))","v":{"$error":"#N/A"}}]
["Emily's Notes",{"$f":"INDEX($S:$S,MATCH(\"Notes\",$R:$R,0))","v":{"$error":"#N/A"}},null,"Prescribeds",{"$f":"IF(AND(T12=\"n\",T13=\"n\",T14=\"n\"),\"\",\nCONCATENATE(\"Ks: \"&IF(T12=\"y\",S12,\"\")&IF(T13=\"y\",\", \",\"\")&IF(T12=\"blank--check\",\"Math--check; \",\"\")&\nIF(T13=\"y\",\"ENGL\",\"\")&IF(T14=\"y\",\", \",\"\")&IF(T13=\"blank--check\",\"Engl--check; \",\"\")&\nIF(T14=\"y\",\"READ\",\"\")&IF(T15=\"y\",\", \",\"\")&IF(T14=\"blank--check\",\"Read--check; \",\"\")&\nIF(T15=\"y\",\"U1010\",\"\")))","v":{"$error":"#N/A"}},null,null,null,null,null,null,null,null,null,null,null,null,"PrescribedCrsStudySkills",{"$f":"INDEX('My Students'!$2:$16,MATCH($S$1,'My Students'!$B$2:$B$16,0),MATCH(R15,'My Students'!$2:$2,0))","v":{"$error":"#N/A"}},{"$f":"IF((T12<>\"n\")+(T13=\"y\")+(T14=\"y\")>=2,\"y\",\"n\")","v":{"$error":"#N/A"}}]
[null,null,null,null,null,null,"Reg Issues",null,null,null,null,null,"Special Pops","Task","Where to find info / What to check",null,null,"HonorsElig",{"$f":"INDEX('My Students'!$2:$16,MATCH($S$1,'My Students'!$B$2:$B$16,0),MATCH(R16,'My Students'!$2:$2,0))","v":{"$error":"#N/A"}}]
[null,null,null,"Scholars Acad",{"$f":"INDEX($S:$S,MATCH(\"Sacad\",$R:$R,0))","v":{"$error":"#N/A"}},null,null,null,"Immunization issues?",null,null,null,null,"Vet benefits","SAAQUAN, SGASTDN, SPAIDEN, Customs chart--\"Flags\", ask student",null,null,"ACTEngl",{"$f":"INDEX('My Students'!$2:$16,MATCH($S$1,'My Students'!$B$2:$B$16,0),MATCH(R17,'My Students'!$2:$2,0))","v":{"$error":"#N/A"}}]
["Copy-Pastes & Folder Links",null,null,"Pre-Nursing",{"$f":"INDEX($S:$S,MATCH(\"PREN\",$R:$R,0))","v":{"$error":"#N/A"}},null,null,null,"Holds",null,null,null,null,null,"Need a BUAF form?  (FYI: Flag on Customs list doesn't always mean getting vet benefits!!)",null,null,"HighSchoolGPA",{"$f":"INDEX('My Students'!$2:$16,MATCH($S$1,'My Students'!$B$2:$B$16,0),MATCH(R18,'My Students'!$2:$2,0))","v":{"$error":"#N/A"}}]
[{"$f":"INDEX(S:S,MATCH(\"StudentName\",R:R,0))","v":{"$error":"#N/A"}},{"$f":"S1","v":0},null,"ACTEngl",{"$f":"INDEX($S:$S,MATCH(\"ACTEngl\",$R:$R,0))","v":{"$error":"#N/A"}},null,null,null,null,null,null,null,null,null,null,null,null,"ACTCompositeScore",{"$f":"INDEX('My Students'!$2:$16,MATCH($S$1,'My Students'!$B$2:$B$16,0),MATCH(R19,'My Students'!$2:$2,0))","v":{"$error":"#N/A"}}]
[{"$f":"IFERROR(MID(A19,SEARCH(\" \",A19,1)+1,SEARCH(\" \",A19,SEARCH(\" \",A19,1)+1)-SEARCH(\" \",A19,1)-1),MID(A19,FIND(\" \",A19)+1,256))","v":{"$error":"#N/A"}},{"$f":"CONCATENATE(LEFT(A19,FIND(\", \",A19,1)-1))","v":{"$error":"#N/A"}},null,null,null,null,null,null,null,null,null,null,null,"Student athlete","SGASPRT (Also on main Customs spreadsheet but not sure if accurate)",null,null,"InclusiveGPA",{"$f":"INDEX('My Students'!$2:$16,MATCH($S$1,'My Students'!$B$2:$B$16,0),MATCH(R20,'My Students'!$2:$2,0))","v":{"$error":"#N/A"}}]
["Major name",{"$f":"CONCATENATE(IF(E11=\"\",INDEX('Data Lists'!$B:$B,MATCH($E$7,'Data Lists'!$A:$A,0)),CONCATENATE(INDEX('Data Lists'!$B:$B,MATCH($E$11,'Data Lists'!$B:$B,0))&IF(E18=\"Y\",\" (PREN)\")&\"\")))","v":{"$error":"#N/A"}},null,"Flags",null,null,null,null,null,null,null,null,null,null,"Stu meet with SAEC advisor; Scheduling challenges; Major changes approved through SAEC",null,null,"HrsEarned",{"$f":"INDEX('My Students'!$2:$16,MATCH($S$1,'My Students'!$B$2:$B$16,0),MATCH(R21,'My Students'!$2:$2,0))","v":{"$error":"#N/A"}}]
["Folder name",{"$f":"IF(E11=\"\",CONCATENATE(INDEX('Data Lists'!$E:$E,MATCH($E$7,'Data Lists'!$A:$A,0)),\" \",B20,\", \",A20,\" \",B3),CONCATENATE(INDEX('Data Lists'!$E:$E,MATCH($E$11,'Data Lists'!$B:$B,0)),\" \",B20,\", \",A20,\" \",B3))","v":{"$error":"#N/A"}},null,"Holds",{"$f":"INDEX($S:$S,MATCH(D22,$R:$R,0))","v":{"$error":"#N/A"}},null,null,null,null,null,null,null,null,null,null,null,null,"CountrySlot",{"$f":"INDEX('My Students'!$2:$16,MATCH($S$1,'My Students'!$B$2:$B$16,0),MATCH(R22,'My Students'!$2:$2,0))","v":{"$error":"#N/A"}}]
["Dept folders",{"$f":"HYPERLINK(CONCATENATE(\"Z:\\CoBHS Advising\\Departments\\\",IF(E11=\"\",INDEX('Data Lists'!D:D,MATCH(E7,'Data Lists'!A:A,0)),INDEX('Data Lists'!D:D,MATCH(E11,'Data Lists'!B:B,0))),\"\\Student Forms\\\"))","v":{"$error":"#N/A"}},null,"Reg Restrictions",{"$f":"INDEX($S:$S,MATCH(\"RegistrationRestrictions\",$R:$R,0))","v":{"$error":"#N/A"}},null,"Transcripts",null,null,null,null,null,null,"Pre-Professional","May not know until stu or CBAS reports to us; ask in welcome email!",null,null,"CUSTOMSGrp",{"$f":"INDEX('My Students'!$2:$16,MATCH($S$1,'My Students'!$B$2:$B$16,0),MATCH(R23,'My Students'!$2:$2,0))","v":{"$error":"#N/A"}}]
["Stu folder",{"$f":"HYPERLINK(CONCATENATE(\"Z:\\CoBHS Advising\\Departments\\\",IF(E11=\"\",INDEX('Data Lists'!D:D,MATCH(E7,'Data Lists'!A:A,0)),INDEX('Data Lists'!D:D,MATCH(E11,'Data Lists'!B:B,0))),\"\\Student Forms\\\",B22))","v":{"$error":"#N/A"}},null,"Immunizations",{"$f":"INDEX($S:$S,MATCH(\"RegistrationRestrictions\",$R:$R,0))","v":{"$error":"#N/A"}},null,null,null,"Prior schools",null,null,null,null,null,"Provide Pre-Prof info packet and info session flyer",null,null,"CustomsPOS",{"$f":"INDEX('My Students'!$2:$16,MATCH($S$1,'My Students'!$B$2:$B$16,0),MATCH(R24,'My Students'!$2:$2,0))","v":{"$error":"#N/A"}}]
[null,null,{"$f":"YEARFRAC(S33,NOW())","v":{"$error":"#N/A"}},"Under 18 & Imm",{"$f":"IF(C25>=18,\"OK--over 18\",\"If need imms, will need parent sig\")","v":{"$error":"#N/A"}},null,null,null,"Missing classes/transcripts",null,null,null,null,null,null,null,null,"BannerPOS",{"$f":"INDEX('My Students'!$2:$16,MATCH($S$1,'My Students'!$B$2:$B$16,0),MATCH(R25,'My Students'!$2:$2,0))","v":{"$error":"#N/A"}}]
[null,null,null,"Missing Items",{"$f":"INDEX($S:$S,MATCH(\"MissingChecklistItems\",$R:$R,0))","v":{"$error":"#N/A"}},null,null,null,"Subs needed",null,null,null,null,null,null,null,null,"Assigned Advisor",{"$f":"INDEX('My Students'!$2:$16,MATCH($S$1,'My Students'!$B$2:$B$16,0),MATCH(R26,'My Students'!$2:$2,0))","v":{"$error":"#N/A"}}]
[null,null,null,"Term",{"$f":"INDEX($S:$S,MATCH(\"TermDesc\",$R:$R,0))","v":{"$error":"#N/A"}},null,null,null,null,null,null,null,"Reg Issues","Task","Where to find info / What to check",null,null,"Customs Advisor",{"$f":"INDEX('My Students'!$2:$16,MATCH($S$1,'My Students'!$B$2:$B$16,0),MATCH(R27,'My Students'!$2:$2,0))","v":{"$error":"#N/A"}}]
[null,null,null,"Might need BUAF",{"$f":"INDEX($S:$S,MATCH(\"VetOrDep\",$R:$R,0))","v":{"$error":"#N/A"}},null,null,null,null,null,null,null,null,"Immunization issues?","Banner: SZAITRK",null,null,"Holds",{"$f":"INDEX('My Students'!$2:$16,MATCH($S$1,'My Students'!$B$2:$B$16,0),MATCH(R28,'My Students'!$2:$2,0))","v":{"$error":"#N/A"}}]
[null,null,null,"Reverse Transfer",{"$f":"INDEX($S:$S,MATCH(\"ReverseTransfer\",$R:$R,0))","v":{"$error":"#N/A"}},null,null,null,null,null,null,null,null,null,"Missing imm docs, under 18--need parent form",null,null,"RegistrationRestrictions",{"$f":"INDEX('My Students'!$2:$16,MATCH($S$1,'My Students'!$B$2:$B$16,0),MATCH(R29,'My Students'!$2:$2,0))","v":{"$error":"#N/A"}}]
[null,null,null,"First Generation",{"$f":"INDEX($S:$S,MATCH(\"1stGen\",$R:$R,0))","v":{"$error":"#N/A"}},null,"Course Types",null,null,null,null,null,null,null,null,null,null,"MissingChecklistItems",{"$f":"INDEX('My Students'!$2:$16,MATCH($S$1,'My Students'!$B$2:$B$16,0),MATCH(R30,'My Students'!$2:$2,0))","v":{"$error":"#N/A"}}]
["Want to add a link to the student's folder? ",null,null,null,null,null,null,null,"Prescribeds",null,null,null,null,"Holds","SOAHOLD, Customs chart--\"Factors\"",null,null,"AdmissionDecision",{"$f":"INDEX('My Students'!$2:$16,MATCH($S$1,'My Students'!$B$2:$B$16,0),MATCH(R31,'My Students'!$2:$2,0))","v":{"$error":"#N/A"}}]
["--Click on the \"Stu folder\" field above (B21).",null,null,null,null,null,null,null,"Check RLC options",null,null,null,null,null,null,null,null,"TermDesc",{"$f":"INDEX('My Students'!$2:$16,MATCH($S$1,'My Students'!$B$2:$B$16,0),MATCH(R32,'My Students'!$2:$2,0))","v":{"$error":"#N/A"}}]
["--Control-K to start the process of creating a link.",null,null,null,null,null,null,null,"Honors",null,null,null,null,null,null,null,null,"DateofBirth",{"$f":"INDEX('My Students'!$2:$16,MATCH($S$1,'My Students'!$B$2:$B$16,0),MATCH(R33,'My Students'!$2:$2,0))","v":{"$error":"#N/A"}}]
["--Browse to the student's folder.",null,null,null,null,null,null,null,"Pre-Nursing",null,null,null,null,null,null,null,null,"Notes",{"$f":"INDEX('My Students'!$2:$16,MATCH($S$1,'My Students'!$B$2:$B$16,0),MATCH(R34,'My Students'!$2:$2,0))","v":{"$error":"#N/A"}}]
["--Choose any file in the folder and double-click on it.",null,null,null,null,null,null,null,null,null,null,null,"Check Transcripts","Task","Where to find info / What to check",null,null,"MTSUEmail",{"$f":"INDEX('My Students'!$2:$16,MATCH($S$1,'My Students'!$B$2:$B$16,0),MATCH(R35,'My Students'!$2:$2,0))","v":{"$error":"#N/A"}}]
["--In the Address box, delete the file name (back to the \\ after the folder name).",null,null,null,null,null,null,null,null,null,null,null,null,"Prior schools","Banner: SOAPCOL / Pipeline: Prior College Info",null,null,"PersonalEmail",{"$f":"INDEX('My Students'!$2:$16,MATCH($S$1,'My Students'!$B$2:$B$16,0),MATCH(R36,'My Students'!$2:$2,0))","v":{"$error":"#N/A"}}]
["--Click OK.",null,null,null,null,null,"Major-Specific",null,null,null,null,null,null,null,null,null,null,"PermPhone",{"$f":"INDEX('My Students'!$2:$16,MATCH($S$1,'My Students'!$B$2:$B$16,0),MATCH(R37,'My Students'!$2:$2,0))","v":{"$error":"#N/A"}}]
["--Now you should see the path to the folder, underlined as a link.",null,null,null,null,null,null,null,null,null,null,null,null,null,null,null,null,"MailingPhone",{"$f":"INDEX('My Students'!$2:$16,MATCH($S$1,'My Students'!$B$2:$B$16,0),MATCH(R38,'My Students'!$2:$2,0))","v":{"$error":"#N/A"}}]
["--When you click on your link, the folder should open in a separate window.",null,null,null,null,null,null,null,null,null,null,null,null,"Missing classes/ transcripts","BDMS (Banner: SAAADMS, click search icon) / Pline: Transfer Eval / Ask stu in welcome email",null,null,"NursElig",{"$f":"INDEX('My Students'!$2:$16,MATCH($S$1,'My Students'!$B$2:$B$16,0),MATCH(R39,'My Students'!$2:$2,0))","v":{"$error":"#N/A"}}]
[null,null,null,null,null,null,null,null,null,null,null,null,null,null,"FRs: AP, IB, DE, Dual Credit, Cambridge  /  TRs: Sems in progress or missing from MT transcript",null,null,"ACTMathScre",{"$f":"INDEX('My Students'!$2:$16,MATCH($S$1,'My Students'!$B$2:$B$16,0),MATCH(R40,'My Students'!$2:$2,0))","v":{"$error":"#N/A"}}]
[null,null,null,null,null,null,null,null,null,null,null,null,null,null,null,null,null,"ACTScienceScre",{"$f":"INDEX('My Students'!$2:$16,MATCH($S$1,'My Students'!$B$2:$B$16,0),MATCH(R41,'My Students'!$2:$2,0))","v":{"$error":"#N/A"}}]
[null,null,null,null,null,null,null,null,null,null,null,null,null,"Subs needed","By comparing transcript, transfer eval, & UD form.  Use TES for course descriptions.",null,null,"A&P?",{"$f":"IF(S1<>\"\",IF(OR(AND(S40=21,S41>21),AND(S40>21,S41=21)),\"maybe\",IF(AND(S31>=21,S41>=21),\"Y\",\"N\")),\"\")","v":{"$error":"#N/A"}}]
[null,null,null,null,null,null,null,null,null,null,null,null,null,null,"Any classes that might/should count but aren't?",null,null,"Major by Look-up",{"$f":"INDEX('Data Lists'!B:B,MATCH(S24,'Data Lists'!A:A,0))","v":{"$error":"#N/A"}}]
[null,null,null,null,null,null,"Notes:",null,null,null,null,null,null,null,null,null,null,"NameM#",{"$f":"CONCATENATE(S47,\", \",S46,\" \",S45)","v":{"$error":"#N/A"}}]
[null,null,null,null,null,null,null,null,null,null,null,null,"Pre-Customs Task Guide--Page 2",null,null,null,null,"M# copy",{"$f":"S1","v":0}]
[null,null,null,null,null,null,null,null,null,null,null,null,"Specific Course Types","Task","Where to find info / What to check",null,null,"Fname",{"$f":"IF(1<>\"\",IFERROR(MID(S9,SEARCH(\" \",S9,1)+1,SEARCH(\" \",S9,SEARCH(\" \",S9,1)+1)-SEARCH(\" \",S9,1)-1),MID(S9,FIND(\" \",S9)+1,256)),\"\")","v":{"$error":"#N/A"}}]
[null,null,null,null,null,null,null,null,null,null,null,null,null,"Prescribeds","Compare SZAADEF and SOATEST scores",null,null,"Lname",{"$f":"IF(S1<>\"\",CONCATENATE(LEFT(S9,FIND(\", \",S9,1)-1)),\"\")","v":{"$error":"#N/A"}}]
[null,null,null,null,null,null,null,null,null,null,null,null,null,null,"Do they match? What K classes are required?  (\"SAILS Math\"=1010 or 1530 non-K or 1710K)"]
[null,null,null,null,null,null,"Post-Customs To-Do List",null,null,{"$f":"CONCATENATE($B$2,\" (\",$B$3,\")\")","v":{"$error":"#N/A"}}]
[null,null,null,null,null,null,"General",null,null,null,null,null,null,"Check RLC options","Based on class list"]
[null,null,null,null,null,null,null,null,"Assign advisor in Banner",null,null,null,null,null,"Must use for students who need READ 1000K/HIST 2020. May recommend for other students."]
[null,null,null,null,null,null,null,null,"Submit appointment report"]
[null,null,null,null,null,null,null,null,null,null,null,null,null,"Honors","Customs chart--\"Factors\" box"]
[null,null,null,null,null,null,null,null,null,null,null,null,null,null,"Is the student eligible to take honors classes? If TR, email Judy Albakry to add honors code."]
[]
[null,null,null,null,null,null,null,null,null,null,null,null,null,"Pre-Nursing","Customs chart--\"Factors\" box"]
[null,null,null,null,null,null,"Special Pops",null,null,null,null,null,null,null,"Do they need different gen eds for PREN vs major?"]
[null,null,null,null,null,null,null,null,"Vet benefits"]
[null,null,null,null,null,null,null,null,"Submit change of major form"]
[null,null,null,null,null,null,null,null,"Send follow-up emails, if needed",null,null,null,"Major-Specific Checks","Task","Where to find info / What to check"]
[null,null,null,null,null,null,null,null,null,null,null,null,null,"Check advising folder","Should have UD form, Reg checklist, anything else specific to major"]
[]
[]
[null,null,null,null,null,null,"Notes:"]
[]
[]
["Copy-Pastes & Folder Links",null,null,"MTSUEmail",{"$f":"B4","v":{"$error":"#N/A"}}]
[{"$f":"A19","v":{"$error":"#N/A"}},{"$f":"$S$1","v":0},null,"PersonalEmail",{"$f":"B5","v":{"$error":"#N/A"}}]
[{"$f":"A20","v":{"$error":"#N/A"}},{"$f":"B20","v":{"$error":"#N/A"}},null,"CustomsPOS",{"$f":"E7","v":{"$error":"#N/A"}}]
["Major name",{"$f":"B21","v":{"$error":"#N/A"}},null,null,{"$f":"E8","v":{"$error":"#N/A"}}]
["Folder name",{"$error":"#N/A"},null,"BannerPOS",{"$f":"E9","v":{"$error":"#N/A"}}]
["Dept folders",{"$f":"HYPERLINK(B24)","v":{"$error":"#N/A"}},null,"Majors match?",{"$f":"E10","v":{"$error":"#N/A"}}]
["Stu folder",{"$f":"HYPERLINK(B25)","v":""},null,"Override major",{"$f":"E11","v":0}]
[null,null,null,"Might need BUAF",{"$f":"E28","v":{"$error":"#N/A"}},null,null,null,null,null,null,null,"Post-Customs Task Guide"]
[null,null,null,null,null,null,null,null,null,null,null,null,"General","Task","Where to find info / What to check"]
["Start",null,null,"Change major",null,null,null,null,null,null,null,null,null,"Assign advisor in Banner","SGAADVR"]
["Stop",null,null,"Notes for advisor",null,null,null,null,null,null,null,null,null,null,"Our type is COLL; We generally are the primary advisor."]
[]
[null,"Report Builder",null,null,"Student Message Builder",null,null,null,null,null,null,null,null,"Submit appointment report","Navigate (SSC)"]
["Registered",null,"see below","Docs attached",null,"x (to say that you've attached docs for the student)"]
["Attaching Scan",null,"x","Drop/Add info",null,"x (to give info on switching classes & steps to do so)"]
["Submitted COM",null,"x","Acad success tips",null,"x (to give acad tips, tutoring & SI websites, & \"ask for help\")"]
["Supp Instructn",null,"x","NURS Info Session",null,"x (to refer student to nursing info webpage and session)",null,null,null,null,null,null,"Special Pops","Task","Where to find info / What to check"]
["RTTP",null,"x","Check phone #",null,"x (to tell stu their listed ph #s are wrong, & how to fix)",null,null,null,null,null,null,null,"Vet benefits","Submit BUAF"]
["Note 1",null,"x","Advisor info",{"$f":"INDEX('Data Lists'!$J:$J,MATCH($B$12,'Data Lists'!$H:$H,0))","v":{"$error":"#N/A"}},"(leave formula, or type \"me <email>\")",null,null,null,null,null,null,null,null,"Form: Z:> Advising> Advising Forms> \"VA Benefit User Adv Form\"; Submit: V drive along w/ UD form"]
["Other",null,"[notes]","Other",null,"[type any notes to student]"]
["Paste in advising report:",{"$f":"CONCATENATE(\"Student came for advising during Customs.\",IF(B81<>\"\",\"  Attaching scanned copy of notes.\",\"\"),IF(B80=\"a\",Messages!$C$2,IF(B80=\"b\",Messages!$C$3,IF(B80<>\"\",CONCATENATE(\"  Registered student for classes for upcoming semester: \",B80),\"\"))),IF(B86<>\"\",CONCATENATE(\"\n\n\",B86),\"\"),IF(B82<>\"\",\"\n\nSubmitted change of major form. \",\"\"),IF(B83<>\"\",Messages!$C$4,\"\"),IF(B84<>\"\",Messages!$C$5,\"\"),IF(B85<>\"\",Messages!$C$6,\"\"))","v":"Student came for advising during Customs."},null,"Paste in stu msg:",{"$f":"CONCATENATE(\"We enjoyed seeing you at the CBHS Advising Center Customs session today, \",$A$21,\"!  \",IF(E80=\"x\",\"I've attached your Registration Checklist, for your records.\",\"\"),IF(E86<>\"\",CONCATENATE(\"\n\n\",E86),\"\"),IF(E81=\"x\",CONCATENATE(Messages!$C$7&E85&\", before making changes.\"),\"\"),IF(E84=\"x\",Messages!$C$10,\"\"),IF(E82=\"x\",Messages!$C$8,\"\"),IF(E83<>\"\",Messages!$C$9,\"\"),CONCATENATE(\"\n\nIf you have any questions or concerns, please contact \"&E85&\".  You'll also want to plan to come in for an advising appointment around mid-terms each semester, to talk about your classes for the upcoming term.  You can find Instructions and Schedule links at mtsu.edu/cbhsadv. \"),\"\n\nWe look forward to seeing you at MTSU this semester!\n\n\",$B$2,\"\n\",$B$3)","v":{"$error":"#N/A"}},null,null,null,null,null,null,null,null,"Submit change of major form","(If applicable)  Pipeline > Bottom of Advisor menu"]
["\"Registered\" choices: \"a\" to get message re stu registering in lab, \"b\" to get message re helping stu register in office, or type list of classes to be inserted."]
[]
["This is what it will say:",null,null,"This is what it will say:",null,null,null,null,null,null,null,null,null,"Send follow-up emails","(if needed)"]
[{"$f":"B87","v":"Student came for advising during Customs."},null,null,{"$f":"E87","v":{"$error":"#N/A"}},null,null,null,null,null,null,null,null,null,null,"e.g., To new advisor if student changed major during advising session"]

{"sheet":"7","index":8,"n_rows":91,"n_cols":20,"rows_kept":91,"cut":false,"hidden":false,"merged":[[90,0,114,1],[90,3,114,4],[1,6,6,6],[2,9,5,9],[2,12,12,12],[14,0,15,0],[14,1,15,1],[14,3,15,3],[14,4,15,4],[15,6,20,6],[82,12,91,12],[74,12,80,12],[2,13,3,13],[5,13,6,13],[8,6,13,6],[8,13,9,13],[9,9,12,9],[11,13,12,13],[16,13,17,13],[19,13,20,13],[22,6,27,6],[22,13,23,13],[23,9,26,9],[26,12,32,12],[27,13,28,13],[29,6,34,6],[30,9,33,9],[30,13,31,13],[15,12,24,12],[16,9,19,9],[34,12,43,12],[35,13,36,13],[36,6,41,6],[37,9,40,9],[38,13,39,13],[41,13,42,13],[44,6,47,10],[45,12,57,12],[46,13,47,13],[49,6,54,6],[49,13,50,13],[50,9,53,9],[52,13,53,13],[55,13,56,13],[56,6,61,6],[57,9,60,9],[59,12,71,12],[60,13,61,13],[63,13,64,13],[64,6,68,10],[83,13,84,13],[86,13,87,13],[89,13,90,13],[66,13,67,13],[69,13,70,13],[75,13,76,13],[78,13,79,13]]}
["Contact & Demographic Info",null,null,"Academic Info",null,null,"Pre-Customs To-Do List",null,null,{"$f":"CONCATENATE($B$2,\" (\",$B$3,\")\"&\", \"&B21)","v":{"$error":"#N/A"}},null,null,"Pre-Customs Task Guide",null,null,null,null,"M#",{"$f":"'My Students'!B9","v":0}]
["Name",{"$f":"CONCATENATE(A20,\" \",B20)","v":{"$error":"#N/A"}},null,"Transferred hours",{"$f":"INDEX($S:$S,MATCH(\"HrsEarned\",$R:$R,0))","v":{"$error":"#N/A"}},null,"General",null,null,null,null,null,null,"Task","Where to find info / What to check",null,null,"Deleted",{"$f":"INDEX('My Students'!$2:$16,MATCH($S$1,'My Students'!$B$2:$B$16,0),MATCH(R2,'My Students'!$2:$2,0))","v":{"$error":"#N/A"}}]
["M#",{"$f":"S1","v":0},null,"HS GPA",{"$f":"INDEX($S:$S,MATCH(\"HighSchoolGPA\",$R:$R,0))","v":{"$error":"#N/A"}},null,null,null,"Make stu folder in Z drive",null,null,null,"General","Make stu folder in Z drive","Naming scheme: <major> <conc> <last>, <first> <M#>",null,null,"SAcad",{"$f":"INDEX('My Students'!$2:$16,MATCH($S$1,'My Students'!$B$2:$B$16,0),MATCH(R3,'My Students'!$2:$2,0))","v":{"$error":"#N/A"}}]
["MTSUEmail",{"$f":"INDEX($S:$S,MATCH(A4,$R:$R,0))","v":{"$error":"#N/A"}},null,"Inclusive GPA",{"$f":"INDEX($S:$S,MATCH(\"InclusiveGPA\",$R:$R,0))","v":{"$error":"#N/A"}},null,null,null,"Check admit term",null,null,null,null,null,"e.g., CRJU LAEN Smith, John M01234567",null,null,"VetOrDep",{"$f":"INDEX('My Students'!$2:$16,MATCH($S$1,'My Students'!$B$2:$B$16,0),MATCH(R4,'My Students'!$2:$2,0))","v":{"$error":"#N/A"}}]
["PersonalEmail",{"$f":"INDEX($S:$S,MATCH(A5,$R:$R,0))","v":{"$error":"#N/A"}},null,"ACT Math",{"$f":"INDEX($S:$S,MATCH(\"ACTMathScre\",$R:$R,0))","v":{"$error":"#N/A"}},null,null,null,"Major",null,null,null,null,null,null,null,null,"PREN",{"$f":"INDEX('My Students'!$2:$16,MATCH($S$1,'My Students'!$B$2:$B$16,0),MATCH(R5,'My Students'!$2:$2,0))","v":{"$error":"#N/A"}}]
["PermPhone",{"$f":"INDEX($S:$S,MATCH(A6,$R:$R,0))","v":{"$error":"#N/A"}},null,"ACT Science",{"$f":"INDEX($S:$S,MATCH(\"ACTScienceScre\",$R:$R,0))","v":{"$error":"#N/A"}},null,null,null,"Acad standing (TRs only)",null,null,null,null,"Check admit term","SAAADMS, Customs chart--\"Flags\"",null,null,"1stGen",{"$f":"INDEX('My Students'!$2:$16,MATCH($S$1,'My Students'!$B$2:$B$16,0),MATCH(R6,'My Students'!$2:$2,0))","v":{"$error":"#N/A"}}]
["MailingPhone",{"$f":"INDEX($S:$S,MATCH(A7,$R:$R,0))","v":{"$error":"#N/A"}},null,"CustomsPOS",{"$f":"INDEX($S:$S,MATCH(D7,$R:$R,0))","v":{"$error":"#N/A"}},null,null,null,null,null,null,null,null,null,"If summer: Verify w/ stu before Customs",null,null,"ReverseTransfer",{"$f":"INDEX('My Students'!$2:$16,MATCH($S$1,'My Students'!$B$2:$B$16,0),MATCH(R7,'My Students'!$2:$2,0))","v":{"$error":"#N/A"}}]
[null,null,null,null,{"$f":"INDEX('Data Lists'!$B:$B,MATCH($E$7,'Data Lists'!$A:$A,0))","v":{"$error":"#N/A"}},null,null,null,null,null,null,null,null,null,null,null,null,"FR/TR",{"$f":"INDEX('My Students'!$2:$16,MATCH($S$1,'My Students'!$B$2:$B$16,0),MATCH(R8,'My Students'!$2:$2,0))","v":{"$error":"#N/A"}}]
["Customs Info",null,null,"BannerPOS",{"$f":"INDEX($S:$S,MATCH(D9,$R:$R,0))","v":{"$error":"#N/A"}},null,"Special Pops",null,null,null,null,null,null,"Major","SGASTDN, Customs chart--\"Academic\" (& updates from stu)",null,null,"StudentName",{"$f":"INDEX('My Students'!$2:$16,MATCH($S$1,'My Students'!$B$2:$B$16,0),MATCH(R9,'My Students'!$2:$2,0))","v":{"$error":"#N/A"}}]
["CountrySlot",{"$f":"INDEX(S:S,MATCH(A10,R:R,0))","v":{"$error":"#N/A"}},null,"Majors match?",{"$f":"IF(AND(E11=\"\",E7=E9),\"Y\",\"N, Submit change of major\")","v":{"$error":"#N/A"}},null,null,null,"Vet benefits",null,null,null,null,null,null,null,null,"Major",{"$f":"INDEX('My Students'!$2:$16,MATCH($S$1,'My Students'!$B$2:$B$16,0),MATCH(R10,'My Students'!$2:$2,0))","v":{"$error":"#N/A"}}]
["Order/Time",{"$f":"CONCATENATE(INDEX(S:S,MATCH(A11,R:R,0)),\" (\",LEFT(S23,2),\")\")","v":{"$error":"#N/A"}},null,"Override major",null,null,null,null,"Student athlete",null,null,null,null,null,null,null,null,"Order/Time",{"$f":"INDEX('My Students'!$2:$16,MATCH($S$1,'My Students'!$B$2:$B$16,0),MATCH(R11,'My Students'!$2:$2,0))","v":{"$error":"#N/A"}}]
["Acad Advisor",{"$f":"INDEX($S:$S,MATCH(\"Assigned Advisor\",$R:$R,0))","v":{"$error":"#N/A"}},null,null,null,null,null,null,"Pre-Professional",null,null,null,null,"Acad standing (TRs only)","SHATERM, SAAADMS, Transcript",null,null,"PrescribedCrsMath",{"$f":"INDEX('My Students'!$2:$16,MATCH($S$1,'My Students'!$B$2:$B$16,0),MATCH(R12,'My Students'!$2:$2,0))","v":{"$error":"#N/A"}},{"$f":"IF(S12=\"college level\",\"n\",IF(S12=0,\"blank--check\",\"y\"))","v":{"$error":"#N/A"}}]
["Customs Advisor",{"$f":"INDEX($S:$S,MATCH(\"Customs Advisor\",$R:$R,0))","v":{"$error":"#N/A"}},null,"Factors in Choosing Classes",null,null,null,null,null,null,null,null,null,null,"Probation on SHATERM? Must take U2020, meet GPA reqs 1st sem.",null,null,"PrescribedCrsWriting",{"$f":"INDEX('My Students'!$2:$16,MATCH($S$1,'My Students'!$B$2:$B$16,0),MATCH(R13,'My Students'!$2:$2,0))","v":{"$error":"#N/A"}},{"$f":"IF(S13=\"college level\",\"n\",IF(S13=0,\"blank--check\",\"y\"))","v":{"$error":"#N/A"}}]
[null,null,null,"Honors",{"$f":"INDEX($S:$S,MATCH(\"HonorsElig\",$R:$R,0))","v":{"$error":"#N/A"}},null,null,null,null,null,null,null,null,null,null,null,null,"PrescribedCrsReading",{"$f":"INDEX('My Students'!$2:$16,MATCH($S$1,'My Students'!$B$2:$B$16,0),MATCH(R14,'My Students'!$2:$2,0))","v":{"$error":"#N/A"}},{"$f":"IF(S14=\"college level\",\"n\",IF(S14=0,\"blank--check\",\"y\"))","v":{"$error":"#N/A"}}]
["Emily's Notes",{"$f":"INDEX($S:$S,MATCH(\"Notes\",$R:$R,0))","v":{"$error":"#N/A"}},null,"Prescribeds",{"$f":"IF(AND(T12=\"n\",T13=\"n\",T14=\"n\"),\"\",\nCONCATENATE(\"Ks: \"&IF(T12=\"y\",S12,\"\")&IF(T13=\"y\",\", \",\"\")&IF(T12=\"blank--check\",\"Math--check; \",\"\")&\nIF(T13=\"y\",\"ENGL\",\"\")&IF(T14=\"y\",\", \",\"\")&IF(T13=\"blank--check\",\"Engl--check; \",\"\")&\nIF(T14=\"y\",\"READ\",\"\")&IF(T15=\"y\",\", \",\"\")&IF(T14=\"blank--check\",\"Read--check; \",\"\")&\nIF(T15=\"y\",\"U1010\",\"\")))","v":{"$error":"#N/A"}},null,null,null,null,null,null,null,null,null,null,null,null,"PrescribedCrsStudySkills",{"$f":"INDEX('My Students'!$2:$16,MATCH($S$1,'My Students'!$B$2:$B$16,0),MATCH(R15,'My Students'!$2:$2,0))","v":{"$error":"#N/A"}},{"$f":"IF((T12<>\"n\")+(T13=\"y\")+(T14=\"y\")>=2,\"y\",\"n\")","v":{"$error":"#N/A"}}]
[null,null,null,null,null,null,"Reg Issues",null,null,null,null,null,"Special Pops","Task","Where to find info / What to check",null,null,"HonorsElig",{"$f":"INDEX('My Students'!$2:$16,MATCH($S$1,'My Students'!$B$2:$B$16,0),MATCH(R16,'My Students'!$2:$2,0))","v":{"$error":"#N/A"}}]
[null,null,null,"Scholars Acad",{"$f":"INDEX($S:$S,MATCH(\"Sacad\",$R:$R,0))","v":{"$error":"#N/A"}},null,null,null,"Immunization issues?",null,null,null,null,"Vet benefits","SAAQUAN, SGASTDN, SPAIDEN, Customs chart--\"Flags\", ask student",null,null,"ACTEngl",{"$f":"INDEX('My Students'!$2:$16,MATCH($S$1,'My Students'!$B$2:$B$16,0),MATCH(R17,'My Students'!$2:$2,0))","v":{"$error":"#N/A"}}]
["Copy-Pastes & Folder Links",null,null,"Pre-Nursing",{"$f":"INDEX($S:$S,MATCH(\"PREN\",$R:$R,0))","v":{"$error":"#N/A"}},null,null,null,"Holds",null,null,null,null,null,"Need a BUAF form?  (FYI: Flag on Customs list doesn't always mean getting vet benefits!!)",null,null,"HighSchoolGPA",{"$f":"INDEX('My Students'!$2:$16,MATCH($S$1,'My Students'!$B$2:$B$16,0),MATCH(R18,'My Students'!$2:$2,0))","v":{"$error":"#N/A"}}]
[{"$f":"INDEX(S:S,MATCH(\"StudentName\",R:R,0))","v":{"$error":"#N/A"}},{"$f":"S1","v":0},null,"ACTEngl",{"$f":"INDEX($S:$S,MATCH(\"ACTEngl\",$R:$R,0))","v":{"$error":"#N/A"}},null,null,null,null,null,null,null,null,null,null,null,null,"ACTCompositeScore",{"$f":"INDEX('My Students'!$2:$16,MATCH($S$1,'My Students'!$B$2:$B$16,0),MATCH(R19,'My Students'!$2:$2,0))","v":{"$error":"#N/A"}}]
[{"$f":"IFERROR(MID(A19,SEARCH(\" \",A19,1)+1,SEARCH(\" \",A19,SEARCH(\" \",A19,1)+1)-SEARCH(\" \",A19,1)-1),MID(A19,FIND(\" \",A19)+1,256))","v":{"$error":"#N/A"}},{"$f":"CONCATENATE(LEFT(A19,FIND(\", \",A19,1)-1))","v":{"$error":"#N/A"}},null,null,null,null,null,null,null,null,null,null,null,"Student athlete","SGASPRT (Also on main Customs spreadsheet but not sure if accurate)",null,null,"InclusiveGPA",{"$f":"INDEX('My Students'!$2:$16,MATCH($S$1,'My Students'!$B$2:$B$16,0),MATCH(R20,'My Students'!$2:$2,0))","v":{"$error":"#N/A"}}]
["Major name",{"$f":"CONCATENATE(IF(E11=\"\",INDEX('Data Lists'!$B:$B,MATCH($E$7,'Data Lists'!$A:$A,0)),CONCATENATE(INDEX('Data Lists'!$B:$B,MATCH($E$11,'Data Lists'!$B:$B,0))&IF(E18=\"Y\",\" (PREN)\")&\"\")))","v":{"$error":"#N/A"}},null,"Flags",null,null,null,null,null,null,null,null,null,null,"Stu meet with SAEC advisor; Scheduling challenges; Major changes approved through SAEC",null,null,"HrsEarned",{"$f":"INDEX('My Students'!$2:$16,MATCH($S$1,'My Students'!$B$2:$B$16,0),MATCH(R21,'My Students'!$2:$2,0))","v":{"$error":"#N/A"}}]
["Folder name",{"$f":"IF(E11=\"\",CONCATENATE(INDEX('Data Lists'!$E:$E,MATCH($E$7,'Data Lists'!$A:$A,0)),\" \",B20,\", \",A20,\" \",B3),CONCATENATE(INDEX('Data Lists'!$E:$E,MATCH($E$11,'Data Lists'!$B:$B,0)),\" \",B20,\", \",A20,\" \",B3))","v":{"$error":"#N/A"}},null,"Holds",{"$f":"INDEX($S:$S,MATCH(D22,$R:$R,0))","v":{"$error":"#N/A"}},null,null,null,null,null,null,null,null,null,null,null,null,"CountrySlot",{"$f":"INDEX('My Students'!$2:$16,MATCH($S$1,'My Students'!$B$2:$B$16,0),MATCH(R22,'My Students'!$2:$2,0))","v":{"$error":"#N/A"}}]
["Dept folders",{"$f":"HYPERLINK(CONCATENATE(\"Z:\\CoBHS Advising\\Departments\\\",IF(E11=\"\",INDEX('Data Lists'!D:D,MATCH(E7,'Data Lists'!A:A,0)),INDEX('Data Lists'!D:D,MATCH(E11,'Data Lists'!B:B,0))),\"\\Student Forms\\\"))","v":{"$error":"#N/A"}},null,"Reg Restrictions",{"$f":"INDEX($S:$S,MATCH(\"RegistrationRestrictions\",$R:$R,0))","v":{"$error":"#N/A"}},null,"Transcripts",null,null,null,null,null,null,"Pre-Professional","May not know until stu or CBAS reports to us; ask in welcome email!",null,null,"CUSTOMSGrp",{"$f":"INDEX('My Students'!$2:$16,MATCH($S$1,'My Students'!$B$2:$B$16,0),MATCH(R23,'My Students'!$2:$2,0))","v":{"$error":"#N/A"}}]
["Stu folder",{"$f":"HYPERLINK(CONCATENATE(\"Z:\\CoBHS Advising\\Departments\\\",IF(E11=\"\",INDEX('Data Lists'!D:D,MATCH(E7,'Data Lists'!A:A,0)),INDEX('Data Lists'!D:D,MATCH(E11,'Data Lists'!B:B,0))),\"\\Student Forms\\\",B22))","v":{"$error":"#N/A"}},null,"Immunizations",{"$f":"INDEX($S:$S,MATCH(\"RegistrationRestrictions\",$R:$R,0))","v":{"$error":"#N/A"}},null,null,null,"Prior schools",null,null,null,null,null,"Provide Pre-Prof info packet and info session flyer",null,null,"CustomsPOS",{"$f":"INDEX('My Students'!$2:$16,MATCH($S$1,'My Students'!$B$2:$B$16,0),MATCH(R24,'My Students'!$2:$2,0))","v":{"$error":"#N/A"}}]
[null,null,{"$f":"YEARFRAC(S33,NOW())","v":{"$error":"#N/A"}},"Under 18 & Imm",{"$f":"IF(C25>=18,\"OK--over 18\",\"If need imms, will need parent sig\")","v":{"$error":"#N/A"}},null,null,null,"Missing classes/transcripts",null,null,null,null,null,null,null,null,"BannerPOS",{"$f":"INDEX('My Students'!$2:$16,MATCH($S$1,'My Students'!$B$2:$B$16,0),MATCH(R25,'My Students'!$2:$2,0))","v":{"$error":"#N/A"}}]
[null,null,null,"Missing Items",{"$f":"INDEX($S:$S,MATCH(\"MissingChecklistItems\",$R:$R,0))","v":{"$error":"#N/A"}},null,null,null,"Subs needed",null,null,null,null,null,null,null,null,"Assigned Advisor",{"$f":"INDEX('My Students'!$2:$16,MATCH($S$1,'My Students'!$B$2:$B$16,0),MATCH(R26,'My Students'!$2:$2,0))","v":{"$error":"#N/A"}}]
[null,null,null,"Term",{"$f":"INDEX($S:$S,MATCH(\"TermDesc\",$R:$R,0))","v":{"$error":"#N/A"}},null,null,null,null,null,null,null,"Reg Issues","Task","Where to find info / What to check",null,null,"Customs Advisor",{"$f":"INDEX('My Students'!$2:$16,MATCH($S$1,'My Students'!$B$2:$B$16,0),MATCH(R27,'My Students'!$2:$2,0))","v":{"$error":"#N/A"}}]
[null,null,null,"Might need BUAF",{"$f":"INDEX($S:$S,MATCH(\"VetOrDep\",$R:$R,0))","v":{"$error":"#N/A"}},null,null,null,null,null,null,null,null,"Immunization issues?","Banner: SZAITRK",null,null,"Holds",{"$f":"INDEX('My Students'!$2:$16,MATCH($S$1,'My Students'!$B$2:$B$16,0),MATCH(R28,'My Students'!$2:$2,0))","v":{"$error":"#N/A"}}]
[null,null,null,"Reverse Transfer",{"$f":"INDEX($S:$S,MATCH(\"ReverseTransfer\",$R:$R,0))","v":{"$error":"#N/A"}},null,null,null,null,null,null,null,null,null,"Missing imm docs, under 18--need parent form",null,null,"RegistrationRestrictions",{"$f":"INDEX('My Students'!$2:$16,MATCH($S$1,'My Students'!$B$2:$B$16,0),MATCH(R29,'My Students'!$2:$2,0))","v":{"$error":"#N/A"}}]
[null,null,null,"First Generation",{"$f":"INDEX($S:$S,MATCH(\"1stGen\",$R:$R,0))","v":{"$error":"#N/A"}},null,"Course Types",null,null,null,null,null,null,null,null,null,null,"MissingChecklistItems",{"$f":"INDEX('My Students'!$2:$16,MATCH($S$1,'My Students'!$B$2:$B$16,0),MATCH(R30,'My Students'!$2:$2,0))","v":{"$error":"#N/A"}}]
["Want to add a link to the student's folder? ",null,null,null,null,null,null,null,"Prescribeds",null,null,null,null,"Holds","SOAHOLD, Customs chart--\"Factors\"",null,null,"AdmissionDecision",{"$f":"INDEX('My Students'!$2:$16,MATCH($S$1,'My Students'!$B$2:$B$16,0),MATCH(R31,'My Students'!$2:$2,0))","v":{"$error":"#N/A"}}]
["--Click on the \"Stu folder\" field above (B21).",null,null,null,null,null,null,null,"Check RLC options",null,null,null,null,null,null,null,null,"TermDesc",{"$f":"INDEX('My Students'!$2:$16,MATCH($S$1,'My Students'!$B$2:$B$16,0),MATCH(R32,'My Students'!$2:$2,0))","v":{"$error":"#N/A"}}]
["--Control-K to start the process of creating a link.",null,null,null,null,null,null,null,"Honors",null,null,null,null,null,null,null,null,"DateofBirth",{"$f":"INDEX('My Students'!$2:$16,MATCH($S$1,'My Students'!$B$2:$B$16,0),MATCH(R33,'My Students'!$2:$2,0))","v":{"$error":"#N/A"}}]
["--Browse to the student's folder.",null,null,null,null,null,null,null,"Pre-Nursing",null,null,null,null,null,null,null,null,"Notes",{"$f":"INDEX('My Students'!$2:$16,MATCH($S$1,'My Students'!$B$2:$B$16,0),MATCH(R34,'My Students'!$2:$2,0))","v":{"$error":"#N/A"}}]
["--Choose any file in the folder and double-click on it.",null,null,null,null,null,null,null,null,null,null,null,"Check Transcripts","Task","Where to find info / What to check",null,null,"MTSUEmail",{"$f":"INDEX('My Students'!$2:$16,MATCH($S$1,'My Students'!$B$2:$B$16,0),MATCH(R35,'My Students'!$2:$2,0))","v":{"$error":"#N/A"}}]
["--In the Address box, delete the file name (back to the \\ after the folder name).",null,null,null,null,null,null,null,null,null,null,null,null,"Prior schools","Banner: SOAPCOL / Pipeline: Prior College Info",null,null,"PersonalEmail",{"$f":"INDEX('My Students'!$2:$16,MATCH($S$1,'My Students'!$B$2:$B$16,0),MATCH(R36,'My Students'!$2:$2,0))","v":{"$error":"#N/A"}}]
["--Click OK.",null,null,null,null,null,"Major-Specific",null,null,null,null,null,null,null,null,null,null,"PermPhone",{"$f":"INDEX('My Students'!$2:$16,MATCH($S$1,'My Students'!$B$2:$B$16,0),MATCH(R37,'My Students'!$2:$2,0))","v":{"$error":"#N/A"}}]
["--Now you should see the path to the folder, underlined as a link.",null,null,null,null,null,null,null,null,null,null,null,null,null,null,null,null,"MailingPhone",{"$f":"INDEX('My Students'!$2:$16,MATCH($S$1,'My Students'!$B$2:$B$16,0),MATCH(R38,'My Students'!$2:$2,0))","v":{"$error":"#N/A"}}]
["--When you click on your link, the folder should open in a separate window.",null,null,null,null,null,null,null,null,null,null,null,null,"Missing classes/ transcripts","BDMS (Banner: SAAADMS, click search icon) / Pline: Transfer Eval / Ask stu in welcome email",null,null,"NursElig",{"$f":"INDEX('My Students'!$2:$16,MATCH($S$1,'My Students'!$B$2:$B$16,0),MATCH(R39,'My Students'!$2:$2,0))","v":{"$error":"#N/A"}}]
[null,null,null,null,null,null,null,null,null,null,null,null,null,null,"FRs: AP, IB, DE, Dual Credit, Cambridge  /  TRs: Sems in progress or missing from MT transcript",null,null,"ACTMathScre",{"$f":"INDEX('My Students'!$2:$16,MATCH($S$1,'My Students'!$B$2:$B$16,0),MATCH(R40,'My Students'!$2:$2,0))","v":{"$error":"#N/A"}}]
[null,null,null,null,null,null,null,null,null,null,null,null,null,null,null,null,null,"ACTScienceScre",{"$f":"INDEX('My Students'!$2:$16,MATCH($S$1,'My Students'!$B$2:$B$16,0),MATCH(R41,'My Students'!$2:$2,0))","v":{"$error":"#N/A"}}]
[null,null,null,null,null,null,null,null,null,null,null,null,null,"Subs needed","By comparing transcript, transfer eval, & UD form.  Use TES for course descriptions.",null,null,"A&P?",{"$f":"IF(S1<>\"\",IF(OR(AND(S40=21,S41>21),AND(S40>21,S41=21)),\"maybe\",IF(AND(S31>=21,S41>=21),\"Y\",\"N\")),\"\")","v":{"$error":"#N/A"}}]
[null,null,null,null,null,null,null,null,null,null,null,null,null,null,"Any classes that might/should count but aren't?",null,null,"Major by Look-up",{"$f":"INDEX('Data Lists'!B:B,MATCH(S24,'Data Lists'!A:A,0))","v":{"$error":"#N/A"}}]
[null,null,null,null,null,null,"Notes:",null,null,null,null,null,null,null,null,null,null,"NameM#",{"$f":"CONCATENATE(S47,\", \",S46,\" \",S45)","v":{"$error":"#N/A"}}]
[null,null,null,null,null,null,null,null,null,null,null,null,"Pre-Customs Task Guide--Page 2",null,null,null,null,"M# copy",{"$f":"S1","v":0}]
[null,null,null,null,null,null,null,null,null,null,null,null,"Specific Course Types","Task","Where to find info / What to check",null,null,"Fname",{"$f":"IF(1<>\"\",IFERROR(MID(S9,SEARCH(\" \",S9,1)+1,SEARCH(\" \",S9,SEARCH(\" \",S9,1)+1)-SEARCH(\" \",S9,1)-1),MID(S9,FIND(\" \",S9)+1,256)),\"\")","v":{"$error":"#N/A"}}]
[null,null,null,null,null,null,null,null,null,null,null,null,null,"Prescribeds","Compare SZAADEF and SOATEST scores",null,null,"Lname",{"$f":"IF(S1<>\"\",CONCATENATE(LEFT(S9,FIND(\", \",S9,1)-1)),\"\")","v":{"$error":"#N/A"}}]
[null,null,null,null,null,null,null,null,null,null,null,null,null,null,"Do they match? What K classes are required?  (\"SAILS Math\"=1010 or 1530 non-K or 1710K)"]
[null,null,null,null,null,null,"Post-Customs To-Do List",null,null,{"$f":"CONCATENATE($B$2,\" (\",$B$3,\")\")","v":{"$error":"#N/A"}}]
[null,null,null,null,null,null,"General",null,null,null,null,null,null,"Check RLC options","Based on class list"]
[null,null,null,null,null,null,null,null,"Assign advisor in Banner",null,null,null,null,null,"Must use for students who need READ 1000K/HIST 2020. May recommend for other students."]
[null,null,null,null,null,null,null,null,"Submit appointment report"]
[null,null,null,null,null,null,null,null,null,null,null,null,null,"Honors","Customs chart--\"Factors\" box"]
[null,null,null,null,null,null,null,null,null,null,null,null,null,null,"Is the student eligible to take honors classes? If TR, email Judy Albakry to add honors code."]
[]
[null,null,null,null,null,null,null,null,null,null,null,null,null,"Pre-Nursing","Customs chart--\"Factors\" box"]
[null,null,null,null,null,null,"Special Pops",null,null,null,null,null,null,null,"Do they need different gen eds for PREN vs major?"]
[null,null,null,null,null,null,null,null,"Vet benefits"]
[null,null,null,null,null,null,null,null,"Submit change of major form"]
[null,null,null,null,null,null,null,null,"Send follow-up emails, if needed",null,null,null,"Major-Specific Checks","Task","Where to find info / What to check"]
[null,null,null,null,null,null,null,null,null,null,null,null,null,"Check advising folder","Should have UD form, Reg checklist, anything else specific to major"]
[]
[]
[null,null,null,null,null,null,"Notes:"]
[]
[]
["Copy-Pastes & Folder Links",null,null,"MTSUEmail",{"$f":"B4","v":{"$error":"#N/A"}}]
[{"$f":"A19","v":{"$error":"#N/A"}},{"$f":"$S$1","v":0},null,"PersonalEmail",{"$f":"B5","v":{"$error":"#N/A"}}]
[{"$f":"A20","v":{"$error":"#N/A"}},{"$f":"B20","v":{"$error":"#N/A"}},null,"CustomsPOS",{"$f":"E7","v":{"$error":"#N/A"}}]
["Major name",{"$f":"B21","v":{"$error":"#N/A"}},null,null,{"$f":"E8","v":{"$error":"#N/A"}}]
["Folder name",{"$error":"#N/A"},null,"BannerPOS",{"$f":"E9","v":{"$error":"#N/A"}}]
["Dept folders",{"$f":"HYPERLINK(B24)","v":{"$error":"#N/A"}},null,"Majors match?",{"$f":"E10","v":{"$error":"#N/A"}}]
["Stu folder",{"$f":"HYPERLINK(B25)","v":""},null,"Override major",{"$f":"E11","v":0}]
[null,null,null,"Might need BUAF",{"$f":"E28","v":{"$error":"#N/A"}},null,null,null,null,null,null,null,"Post-Customs Task Guide"]
[null,null,null,null,null,null,null,null,null,null,null,null,"General","Task","Where to find info / What to check"]
["Start",null,null,"Change major",null,null,null,null,null,null,null,null,null,"Assign advisor in Banner","SGAADVR"]
["Stop",null,null,"Notes for advisor",null,null,null,null,null,null,null,null,null,null,"Our type is COLL; We generally are the primary advisor."]
[]
[null,"Report Builder",null,null,"Student Message Builder",null,null,null,null,null,null,null,null,"Submit appointment report","Navigate (SSC)"]
["Registered",null,"see below","Docs attached",null,"x (to say that you've attached docs for the student)"]
["Attaching Scan",null,"x","Drop/Add info",null,"x (to give info on switching classes & steps to do so)"]
["Submitted COM",null,"x","Acad success tips",null,"x (to give acad tips, tutoring & SI websites, & \"ask for help\")"]
["Supp Instructn",null,"x","NURS Info Session",null,"x (to refer student to nursing info webpage and session)",null,null,null,null,null,null,"Special Pops","Task","Where to find info / What to check"]
["RTTP",null,"x","Check phone #",null,"x (to tell stu their listed ph #s are wrong, & how to fix)",null,null,null,null,null,null,null,"Vet benefits","Submit BUAF"]
["Note 1",null,"x","Advisor info",{"$f":"INDEX('Data Lists'!$J:$J,MATCH($B$12,'Data Lists'!$H:$H,0))","v":{"$error":"#N/A"}},"(leave formula, or type \"me <email>\")",null,null,null,null,null,null,null,null,"Form: Z:> Advising> Advising Forms> \"VA Benefit User Adv Form\"; Submit: V drive along w/ UD form"]
["Other",null,"[notes]","Other",null,"[type any notes to student]"]
["Paste in advising report:",{"$f":"CONCATENATE(\"Student came for advising during Customs.\",IF(B81<>\"\",\"  Attaching scanned copy of notes.\",\"\"),IF(B80=\"a\",Messages!$C$2,IF(B80=\"b\",Messages!$C$3,IF(B80<>\"\",CONCATENATE(\"  Registered student for classes for upcoming semester: \",B80),\"\"))),IF(B86<>\"\",CONCATENATE(\"\n\n\",B86),\"\"),IF(B82<>\"\",\"\n\nSubmitted change of major form. \",\"\"),IF(B83<>\"\",Messages!$C$4,\"\"),IF(B84<>\"\",Messages!$C$5,\"\"),IF(B85<>\"\",Messages!$C$6,\"\"))","v":"Student came for advising during Customs."},null,"Paste in stu msg:",{"$f":"CONCATENATE(\"We enjoyed seeing you at the CBHS Advising Center Customs session today, \",$A$21,\"!  \",IF(E80=\"x\",\"I've attached your Registration Checklist, for your records.\",\"\"),IF(E86<>\"\",CONCATENATE(\"\n\n\",E86),\"\"),IF(E81=\"x\",CONCATENATE(Messages!$C$7&E85&\", before making changes.\"),\"\"),IF(E84=\"x\",Messages!$C$10,\"\"),IF(E82=\"x\",Messages!$C$8,\"\"),IF(E83<>\"\",Messages!$C$9,\"\"),CONCATENATE(\"\n\nIf you have any questions or concerns, please contact \"&E85&\".  You'll also want to plan to come in for an advising appointment around mid-terms each semester, to talk about your classes for the upcoming term.  You can find Instructions and Schedule links at mtsu.edu/cbhsadv. \"),\"\n\nWe look forward to seeing you at MTSU this semester!\n\n\",$B$2,\"\n\",$B$3)","v":{"$error":"#N/A"}},null,null,null,null,null,null,null,null,"Submit change of major form","(If applicable)  Pipeline > Bottom of Advisor menu"]
["\"Registered\" choices: \"a\" to get message re stu registering in lab, \"b\" to get message re helping stu register in office, or type list of classes to be inserted."]
[]
["This is what it will say:",null,null,"This is what it will say:",null,null,null,null,null,null,null,null,null,"Send follow-up emails","(if needed)"]
[{"$f":"B87","v":"Student came for advising during Customs."},null,null,{"$f":"E87","v":{"$error":"#N/A"}},null,null,null,null,null,null,null,null,null,null,"e.g., To new advisor if student changed major during advising session"]

{"sheet":"8","index":9,"n_rows":91,"n_cols":20,"rows_kept":91,"cut":false,"hidden":false,"merged":[[90,0,114,1],[90,3,114,4],[1,6,6,6],[2,9,5,9],[2,12,12,12],[14,0,15,0],[14,1,15,1],[14,3,15,3],[14,4,15,4],[15,6,20,6],[82,12,91,12],[74,12,80,12],[2,13,3,13],[5,13,6,13],[8,6,13,6],[8,13,9,13],[9,9,12,9],[11,13,12,13],[16,13,17,13],[19,13,20,13],[22,6,27,6],[22,13,23,13],[23,9,26,9],[26,12,32,12],[27,13,28,13],[29,6,34,6],[30,9,33,9],[30,13,31,13],[15,12,24,12],[16,9,19,9],[34,12,43,12],[35,13,36,13],[36,6,41,6],[37,9,40,9],[38,13,39,13],[41,13,42,13],[44,6,47,10],[45,12,57,12],[46,13,47,13],[49,6,54,6],[49,13,50,13],[50,9,53,9],[52,13,53,13],[55,13,56,13],[56,6,61,6],[57,9,60,9],[59,12,71,12],[60,13,61,13],[63,13,64,13],[64,6,68,10],[83,13,84,13],[86,13,87,13],[89,13,90,13],[66,13,67,13],[69,13,70,13],[75,13,76,13],[78,13,79,13]]}
["Contact & Demographic Info",null,null,"Academic Info",null,null,"Pre-Customs To-Do List",null,null,{"$f":"CONCATENATE($B$2,\" (\",$B$3,\")\"&\", \"&B21)","v":{"$error":"#N/A"}},null,null,"Pre-Customs Task Guide",null,null,null,null,"M#",{"$f":"'My Students'!B10","v":0}]
["Name",{"$f":"CONCATENATE(A20,\" \",B20)","v":{"$error":"#N/A"}},null,"Transferred hours",{"$f":"INDEX($S:$S,MATCH(\"HrsEarned\",$R:$R,0))","v":{"$error":"#N/A"}},null,"General",null,null,null,null,null,null,"Task","Where to find info / What to check",null,null,"Deleted",{"$f":"INDEX('My Students'!$2:$16,MATCH($S$1,'My Students'!$B$2:$B$16,0),MATCH(R2,'My Students'!$2:$2,0))","v":{"$error":"#N/A"}}]
["M#",{"$f":"S1","v":0},null,"HS GPA",{"$f":"INDEX($S:$S,MATCH(\"HighSchoolGPA\",$R:$R,0))","v":{"$error":"#N/A"}},null,null,null,"Make stu folder in Z drive",null,null,null,"General","Make stu folder in Z drive","Naming scheme: <major> <conc> <last>, <first> <M#>",null,null,"SAcad",{"$f":"INDEX('My Students'!$2:$16,MATCH($S$1,'My Students'!$B$2:$B$16,0),MATCH(R3,'My Students'!$2:$2,0))","v":{"$error":"#N/A"}}]
["MTSUEmail",{"$f":"INDEX($S:$S,MATCH(A4,$R:$R,0))","v":{"$error":"#N/A"}},null,"Inclusive GPA",{"$f":"INDEX($S:$S,MATCH(\"InclusiveGPA\",$R:$R,0))","v":{"$error":"#N/A"}},null,null,null,"Check admit term",null,null,null,null,null,"e.g., CRJU LAEN Smith, John M01234567",null,null,"VetOrDep",{"$f":"INDEX('My Students'!$2:$16,MATCH($S$1,'My Students'!$B$2:$B$16,0),MATCH(R4,'My Students'!$2:$2,0))","v":{"$error":"#N/A"}}]
["PersonalEmail",{"$f":"INDEX($S:$S,MATCH(A5,$R:$R,0))","v":{"$error":"#N/A"}},null,"ACT Math",{"$f":"INDEX($S:$S,MATCH(\"ACTMathScre\",$R:$R,0))","v":{"$error":"#N/A"}},null,null,null,"Major",null,null,null,null,null,null,null,null,"PREN",{"$f":"INDEX('My Students'!$2:$16,MATCH($S$1,'My Students'!$B$2:$B$16,0),MATCH(R5,'My Students'!$2:$2,0))","v":{"$error":"#N/A"}}]
["PermPhone",{"$f":"INDEX($S:$S,MATCH(A6,$R:$R,0))","v":{"$error":"#N/A"}},null,"ACT Science",{"$f":"INDEX($S:$S,MATCH(\"ACTScienceScre\",$R:$R,0))","v":{"$error":"#N/A"}},null,null,null,"Acad standing (TRs only)",null,null,null,null,"Check admit term","SAAADMS, Customs chart--\"Flags\"",null,null,"1stGen",{"$f":"INDEX('My Students'!$2:$16,MATCH($S$1,'My Students'!$B$2:$B$16,0),MATCH(R6,'My Students'!$2:$2,0))","v":{"$error":"#N/A"}}]
["MailingPhone",{"$f":"INDEX($S:$S,MATCH(A7,$R:$R,0))","v":{"$error":"#N/A"}},null,"CustomsPOS",{"$f":"INDEX($S:$S,MATCH(D7,$R:$R,0))","v":{"$error":"#N/A"}},null,null,null,null,null,null,null,null,null,"If summer: Verify w/ stu before Customs",null,null,"ReverseTransfer",{"$f":"INDEX('My Students'!$2:$16,MATCH($S$1,'My Students'!$B$2:$B$16,0),MATCH(R7,'My Students'!$2:$2,0))","v":{"$error":"#N/A"}}]
[null,null,null,null,{"$f":"INDEX($S:$S,MATCH(\"Major\",$R:$R,0))","v":{"$error":"#N/A"}},null,null,null,null,null,null,null,null,null,null,null,null,"FR/TR",{"$f":"INDEX('My Students'!$2:$16,MATCH($S$1,'My Students'!$B$2:$B$16,0),MATCH(R8,'My Students'!$2:$2,0))","v":{"$error":"#N/A"}}]
["Customs Info",null,null,"BannerPOS",{"$f":"INDEX($S:$S,MATCH(D9,$R:$R,0))","v":{"$error":"#N/A"}},null,"Special Pops",null,null,null,null,null,null,"Major","SGASTDN, Customs chart--\"Academic\" (& updates from stu)",null,null,"StudentName",{"$f":"INDEX('My Students'!$2:$16,MATCH($S$1,'My Students'!$B$2:$B$16,0),MATCH(R9,'My Students'!$2:$2,0))","v":{"$error":"#N/A"}}]
["CountrySlot",{"$f":"INDEX(S:S,MATCH(A10,R:R,0))","v":{"$error":"#N/A"}},null,"Majors match?",{"$f":"IF(AND(E11=\"\",E7=E9),\"Y\",\"N, Submit change of major\")","v":{"$error":"#N/A"}},null,null,null,"Vet benefits",null,null,null,null,null,null,null,null,"Major",{"$f":"INDEX('My Students'!$2:$16,MATCH($S$1,'My Students'!$B$2:$B$16,0),MATCH(R10,'My Students'!$2:$2,0))","v":{"$error":"#N/A"}}]
["Order/Time",{"$f":"CONCATENATE(INDEX(S:S,MATCH(A11,R:R,0)),\" (\",LEFT(S23,2),\")\")","v":{"$error":"#N/A"}},null,"Override major",null,null,null,null,"Student athlete",null,null,null,null,null,null,null,null,"Order/Time",{"$f":"INDEX('My Students'!$2:$16,MATCH($S$1,'My Students'!$B$2:$B$16,0),MATCH(R11,'My Students'!$2:$2,0))","v":{"$error":"#N/A"}}]
["Acad Advisor",{"$f":"INDEX($S:$S,MATCH(\"Assigned Advisor\",$R:$R,0))","v":{"$error":"#N/A"}},null,null,null,null,null,null,"Pre-Professional",null,null,null,null,"Acad standing (TRs only)","SHATERM, SAAADMS, Transcript",null,null,"PrescribedCrsMath",{"$f":"INDEX('My Students'!$2:$16,MATCH($S$1,'My Students'!$B$2:$B$16,0),MATCH(R12,'My Students'!$2:$2,0))","v":{"$error":"#N/A"}},{"$f":"IF(S12=\"college level\",\"n\",IF(S12=0,\"blank--check\",\"y\"))","v":{"$error":"#N/A"}}]
["Customs Advisor",{"$f":"INDEX($S:$S,MATCH(\"Customs Advisor\",$R:$R,0))","v":{"$error":"#N/A"}},null,"Factors in Choosing Classes",null,null,null,null,null,null,null,null,null,null,"Probation on SHATERM? Must take U2020, meet GPA reqs 1st sem.",null,null,"PrescribedCrsWriting",{"$f":"INDEX('My Students'!$2:$16,MATCH($S$1,'My Students'!$B$2:$B$16,0),MATCH(R13,'My Students'!$2:$2,0))","v":{"$error":"#N/A"}},{"$f":"IF(S13=\"college level\",\"n\",IF(S13=0,\"blank--check\",\"y\"))","v":{"$error":"#N/A"}}]
[null,null,null,"Honors",{"$f":"INDEX($S:$S,MATCH(\"HonorsElig\",$R:$R,0))","v":{"$error":"#N/A"}},null,null,null,null,null,null,null,null,null,null,null,null,"PrescribedCrsReading",{"$f":"INDEX('My Students'!$2:$16,MATCH($S$1,'My Students'!$B$2:$B$16,0),MATCH(R14,'My Students'!$2:$2,0))","v":{"$error":"#N/A"}},{"$f":"IF(S14=\"college level\",\"n\",IF(S14=0,\"blank--check\",\"y\"))","v":{"$error":"#N/A"}}]
["Emily's Notes",{"$f":"INDEX($S:$S,MATCH(\"Notes\",$R:$R,0))","v":{"$error":"#N/A"}},null,"Prescribeds",{"$f":"IF(AND(T12=\"n\",T13=\"n\",T14=\"n\"),\"\",\nCONCATENATE(\"Ks: \"&IF(T12=\"y\",S12,\"\")&IF(T13=\"y\",\", \",\"\")&IF(T12=\"blank--check\",\"Math--check; \",\"\")&\nIF(T13=\"y\",\"ENGL\",\"\")&IF(T14=\"y\",\", \",\"\")&IF(T13=\"blank--check\",\"Engl--check; \",\"\")&\nIF(T14=\"y\",\"READ\",\"\")&IF(T15=\"y\",\", \",\"\")&IF(T14=\"blank--check\",\"Read--check; \",\"\")&\nIF(T15=\"y\",\"U1010\",\"\")))","v":{"$error":"#N/A"}},null,null,null,null,null,null,null,null,null,null,null,null,"PrescribedCrsStudySkills",{"$f":"INDEX('My Students'!$2:$16,MATCH($S$1,'My Students'!$B$2:$B$16,0),MATCH(R15,'My Students'!$2:$2,0))","v":{"$error":"#N/A"}},{"$f":"IF((T12<>\"n\")+(T13=\"y\")+(T14=\"y\")>=2,\"y\",\"n\")","v":{"$error":"#N/A"}}]
[null,null,null,null,null,null,"Reg Issues",null,null,null,null,null,"Special Pops","Task","Where to find info / What to check",null,null,"HonorsElig",{"$f":"INDEX('My Students'!$2:$16,MATCH($S$1,'My Students'!$B$2:$B$16,0),MATCH(R16,'My Students'!$2:$2,0))","v":{"$error":"#N/A"}}]
[null,null,null,"Scholars Acad",{"$f":"INDEX($S:$S,MATCH(\"Sacad\",$R:$R,0))","v":{"$error":"#N/A"}},null,null,null,"Immunization issues?",null,null,null,null,"Vet benefits","SAAQUAN, SGASTDN, SPAIDEN, Customs chart--\"Flags\", ask student",null,null,"ACTEngl",{"$f":"INDEX('My Students'!$2:$16,MATCH($S$1,'My Students'!$B$2:$B$16,0),MATCH(R17,'My Students'!$2:$2,0))","v":{"$error":"#N/A"}}]
["Copy-Pastes & Folder Links",null,null,"Pre-Nursing",{"$f":"INDEX($S:$S,MATCH(\"PREN\",$R:$R,0))","v":{"$error":"#N/A"}},null,null,null,"Holds",null,null,null,null,null,"Need a BUAF form?  (FYI: Flag on Customs list doesn't always mean getting vet benefits!!)",null,null,"HighSchoolGPA",{"$f":"INDEX('My Students'!$2:$16,MATCH($S$1,'My Students'!$B$2:$B$16,0),MATCH(R18,'My Students'!$2:$2,0))","v":{"$error":"#N/A"}}]
[{"$f":"INDEX(S:S,MATCH(\"StudentName\",R:R,0))","v":{"$error":"#N/A"}},{"$f":"S1","v":0},null,"ACTEngl",{"$f":"INDEX($S:$S,MATCH(\"ACTEngl\",$R:$R,0))","v":{"$error":"#N/A"}},null,null,null,null,null,null,null,null,null,null,null,null,"ACTCompositeScore",{"$f":"INDEX('My Students'!$2:$16,MATCH($S$1,'My Students'!$B$2:$B$16,0),MATCH(R19,'My Students'!$2:$2,0))","v":{"$error":"#N/A"}}]
[{"$f":"IFERROR(MID(A19,SEARCH(\" \",A19,1)+1,SEARCH(\" \",A19,SEARCH(\" \",A19,1)+1)-SEARCH(\" \",A19,1)-1),MID(A19,FIND(\" \",A19)+1,256))","v":{"$error":"#N/A"}},{"$f":"CONCATENATE(LEFT(A19,FIND(\", \",A19,1)-1))","v":{"$error":"#N/A"}},null,null,null,null,null,null,null,null,null,null,null,"Student athlete","SGASPRT (Also on main Customs spreadsheet but not sure if accurate)",null,null,"InclusiveGPA",{"$f":"INDEX('My Students'!$2:$16,MATCH($S$1,'My Students'!$B$2:$B$16,0),MATCH(R20,'My Students'!$2:$2,0))","v":{"$error":"#N/A"}}]
["Major name",{"$f":"CONCATENATE(IF(E11=\"\",INDEX('Data Lists'!$B:$B,MATCH($E$7,'Data Lists'!$A:$A,0)),CONCATENATE(INDEX('Data Lists'!$B:$B,MATCH($E$11,'Data Lists'!$B:$B,0))&IF(E18=\"Y\",\" (PREN)\")&\"\")))","v":{"$error":"#N/A"}},null,"Flags",null,null,null,null,null,null,null,null,null,null,"Stu meet with SAEC advisor; Scheduling challenges; Major changes approved through SAEC",null,null,"HrsEarned",{"$f":"INDEX('My Students'!$2:$16,MATCH($S$1,'My Students'!$B$2:$B$16,0),MATCH(R21,'My Students'!$2:$2,0))","v":{"$error":"#N/A"}}]
["Folder name",{"$f":"IF(E11=\"\",CONCATENATE(INDEX('Data Lists'!$E:$E,MATCH($E$7,'Data Lists'!$A:$A,0)),\" \",B20,\", \",A20,\" \",B3),CONCATENATE(INDEX('Data Lists'!$E:$E,MATCH($E$11,'Data Lists'!$B:$B,0)),\" \",B20,\", \",A20,\" \",B3))","v":{"$error":"#N/A"}},null,"Holds",{"$f":"INDEX($S:$S,MATCH(D22,$R:$R,0))","v":{"$error":"#N/A"}},null,null,null,null,null,null,null,null,null,null,null,null,"CountrySlot",{"$f":"INDEX('My Students'!$2:$16,MATCH($S$1,'My Students'!$B$2:$B$16,0),MATCH(R22,'My Students'!$2:$2,0))","v":{"$error":"#N/A"}}]
["Dept folders",{"$f":"HYPERLINK(CONCATENATE(\"Z:\\CoBHS Advising\\Departments\\\",IF(E11=\"\",INDEX('Data Lists'!D:D,MATCH(E7,'Data Lists'!A:A,0)),INDEX('Data Lists'!D:D,MATCH(E11,'Data Lists'!B:B,0))),\"\\Student Forms\\\"))","v":{"$error":"#N/A"}},null,"Reg Restrictions",{"$f":"INDEX($S:$S,MATCH(\"RegistrationRestrictions\",$R:$R,0))","v":{"$error":"#N/A"}},null,"Transcripts",null,null,null,null,null,null,"Pre-Professional","May not know until stu or CBAS reports to us; ask in welcome email!",null,null,"CUSTOMSGrp",{"$f":"INDEX('My Students'!$2:$16,MATCH($S$1,'My Students'!$B$2:$B$16,0),MATCH(R23,'My Students'!$2:$2,0))","v":{"$error":"#N/A"}}]
["Stu folder",{"$f":"HYPERLINK(CONCATENATE(\"Z:\\CoBHS Advising\\Departments\\\",IF(E11=\"\",INDEX('Data Lists'!D:D,MATCH(E7,'Data Lists'!A:A,0)),INDEX('Data Lists'!D:D,MATCH(E11,'Data Lists'!B:B,0))),\"\\Student Forms\\\",B22))","v":{"$error":"#N/A"}},null,"Immunizations",{"$f":"INDEX($S:$S,MATCH(\"RegistrationRestrictions\",$R:$R,0))","v":{"$error":"#N/A"}},null,null,null,"Prior schools",null,null,null,null,null,"Provide Pre-Prof info packet and info session flyer",null,null,"CustomsPOS",{"$f":"INDEX('My Students'!$2:$16,MATCH($S$1,'My Students'!$B$2:$B$16,0),MATCH(R24,'My Students'!$2:$2,0))","v":{"$error":"#N/A"}}]
[null,null,{"$f":"YEARFRAC(S33,NOW())","v":{"$error":"#N/A"}},"Under 18 & Imm",{"$f":"IF(C25>=18,\"OK--over 18\",\"If need imms, will need parent sig\")","v":{"$error":"#N/A"}},null,null,null,"Missing classes/transcripts",null,null,null,null,null,null,null,null,"BannerPOS",{"$f":"INDEX('My Students'!$2:$16,MATCH($S$1,'My Students'!$B$2:$B$16,0),MATCH(R25,'My Students'!$2:$2,0))","v":{"$error":"#N/A"}}]
[null,null,null,"Missing Items",{"$f":"INDEX($S:$S,MATCH(\"MissingChecklistItems\",$R:$R,0))","v":{"$error":"#N/A"}},null,null,null,"Subs needed",null,null,null,null,null,null,null,null,"Assigned Advisor",{"$f":"INDEX('My Students'!$2:$16,MATCH($S$1,'My Students'!$B$2:$B$16,0),MATCH(R26,'My Students'!$2:$2,0))","v":{"$error":"#N/A"}}]
[null,null,null,"Term",{"$f":"INDEX($S:$S,MATCH(\"TermDesc\",$R:$R,0))","v":{"$error":"#N/A"}},null,null,null,null,null,null,null,"Reg Issues","Task","Where to find info / What to check",null,null,"Customs Advisor",{"$f":"INDEX('My Students'!$2:$16,MATCH($S$1,'My Students'!$B$2:$B$16,0),MATCH(R27,'My Students'!$2:$2,0))","v":{"$error":"#N/A"}}]
[null,null,null,"Might need BUAF",{"$f":"INDEX($S:$S,MATCH(\"VetOrDep\",$R:$R,0))","v":{"$error":"#N/A"}},null,null,null,null,null,null,null,null,"Immunization issues?","Banner: SZAITRK",null,null,"Holds",{"$f":"INDEX('My Students'!$2:$16,MATCH($S$1,'My Students'!$B$2:$B$16,0),MATCH(R28,'My Students'!$2:$2,0))","v":{"$error":"#N/A"}}]
[null,null,null,"Reverse Transfer",{"$f":"INDEX($S:$S,MATCH(\"ReverseTransfer\",$R:$R,0))","v":{"$error":"#N/A"}},null,null,null,null,null,null,null,null,null,"Missing imm docs, under 18--need parent form",null,null,"RegistrationRestrictions",{"$f":"INDEX('My Students'!$2:$16,MATCH($S$1,'My Students'!$B$2:$B$16,0),MATCH(R29,'My Students'!$2:$2,0))","v":{"$error":"#N/A"}}]
[null,null,null,"First Generation",{"$f":"INDEX($S:$S,MATCH(\"1stGen\",$R:$R,0))","v":{"$error":"#N/A"}},null,"Course Types",null,null,null,null,null,null,null,null,null,null,"MissingChecklistItems",{"$f":"INDEX('My Students'!$2:$16,MATCH($S$1,'My Students'!$B$2:$B$16,0),MATCH(R30,'My Students'!$2:$2,0))","v":{"$error":"#N/A"}}]
["Want to add a link to the student's folder? ",null,null,null,null,null,null,null,"Prescribeds",null,null,null,null,"Holds","SOAHOLD, Customs chart--\"Factors\"",null,null,"AdmissionDecision",{"$f":"INDEX('My Students'!$2:$16,MATCH($S$1,'My Students'!$B$2:$B$16,0),MATCH(R31,'My Students'!$2:$2,0))","v":{"$error":"#N/A"}}]
["--Click on the \"Stu folder\" field above (B21).",null,null,null,null,null,null,null,"Check RLC options",null,null,null,null,null,null,null,null,"TermDesc",{"$f":"INDEX('My Students'!$2:$16,MATCH($S$1,'My Students'!$B$2:$B$16,0),MATCH(R32,'My Students'!$2:$2,0))","v":{"$error":"#N/A"}}]
["--Control-K to start the process of creating a link.",null,null,null,null,null,null,null,"Honors",null,null,null,null,null,null,null,null,"DateofBirth",{"$f":"INDEX('My Students'!$2:$16,MATCH($S$1,'My Students'!$B$2:$B$16,0),MATCH(R33,'My Students'!$2:$2,0))","v":{"$error":"#N/A"}}]
["--Browse to the student's folder.",null,null,null,null,null,null,null,"Pre-Nursing",null,null,null,null,null,null,null,null,"Notes",{"$f":"INDEX('My Students'!$2:$16,MATCH($S$1,'My Students'!$B$2:$B$16,0),MATCH(R34,'My Students'!$2:$2,0))","v":{"$error":"#N/A"}}]
["--Choose any file in the folder and double-click on it.",null,null,null,null,null,null,null,null,null,null,null,"Check Transcripts","Task","Where to find info / What to check",null,null,"MTSUEmail",{"$f":"INDEX('My Students'!$2:$16,MATCH($S$1,'My Students'!$B$2:$B$16,0),MATCH(R35,'My Students'!$2:$2,0))","v":{"$error":"#N/A"}}]
["--In the Address box, delete the file name (back to the \\ after the folder name).",null,null,null,null,null,null,null,null,null,null,null,null,"Prior schools","Banner: SOAPCOL / Pipeline: Prior College Info",null,null,"PersonalEmail",{"$f":"INDEX('My Students'!$2:$16,MATCH($S$1,'My Students'!$B$2:$B$16,0),MATCH(R36,'My Students'!$2:$2,0))","v":{"$error":"#N/A"}}]
["--Click OK.",null,null,null,null,null,"Major-Specific",null,null,null,null,null,null,null,null,null,null,"PermPhone",{"$f":"INDEX('My Students'!$2:$16,MATCH($S$1,'My Students'!$B$2:$B$16,0),MATCH(R37,'My Students'!$2:$2,0))","v":{"$error":"#N/A"}}]
["--Now you should see the path to the folder, underlined as a link.",null,null,null,null,null,null,null,null,null,null,null,null,null,null,null,null,"MailingPhone",{"$f":"INDEX('My Students'!$2:$16,MATCH($S$1,'My Students'!$B$2:$B$16,0),MATCH(R38,'My Students'!$2:$2,0))","v":{"$error":"#N/A"}}]
["--When you click on your link, the folder should open in a separate window.",null,null,null,null,null,null,null,null,null,null,null,null,"Missing classes/ transcripts","BDMS (Banner: SAAADMS, click search icon) / Pline: Transfer Eval / Ask stu in welcome email",null,null,"NursElig",{"$f":"INDEX('My Students'!$2:$16,MATCH($S$1,'My Students'!$B$2:$B$16,0),MATCH(R39,'My Students'!$2:$2,0))","v":{"$error":"#N/A"}}]
[null,null,null,null,null,null,null,null,null,null,null,null,null,null,"FRs: AP, IB, DE, Dual Credit, Cambridge  /  TRs: Sems in progress or missing from MT transcript",null,null,"ACTMathScre",{"$f":"INDEX('My Students'!$2:$16,MATCH($S$1,'My Students'!$B$2:$B$16,0),MATCH(R40,'My Students'!$2:$2,0))","v":{"$error":"#N/A"}}]
[null,null,null,null,null,null,null,null,null,null,null,null,null,null,null,null,null,"ACTScienceScre",{"$f":"INDEX('My Students'!$2:$16,MATCH($S$1,'My Students'!$B$2:$B$16,0),MATCH(R41,'My Students'!$2:$2,0))","v":{"$error":"#N/A"}}]
[null,null,null,null,null,null,null,null,null,null,null,null,null,"Subs needed","By comparing transcript, transfer eval, & UD form.  Use TES for course descriptions.",null,null,"A&P?",{"$f":"IF(S1<>\"\",IF(OR(AND(S40=21,S41>21),AND(S40>21,S41=21)),\"maybe\",IF(AND(S31>=21,S41>=21),\"Y\",\"N\")),\"\")","v":{"$error":"#N/A"}}]
[null,null,null,null,null,null,null,null,null,null,null,null,null,null,"Any classes that might/should count but aren't?",null,null,"Major by Look-up",{"$f":"INDEX('Data Lists'!B:B,MATCH(S24,'Data Lists'!A:A,0))","v":{"$error":"#N/A"}}]
[null,null,null,null,null,null,"Notes:",null,null,null,null,null,null,null,null,null,null,"NameM#",{"$f":"CONCATENATE(S47,\", \",S46,\" \",S45)","v":{"$error":"#N/A"}}]
[null,null,null,null,null,null,null,null,null,null,null,null,"Pre-Customs Task Guide--Page 2",null,null,null,null,"M# copy",{"$f":"S1","v":0}]
[null,null,null,null,null,null,null,null,null,null,null,null,"Specific Course Types","Task","Where to find info / What to check",null,null,"Fname",{"$f":"IF(1<>\"\",IFERROR(MID(S9,SEARCH(\" \",S9,1)+1,SEARCH(\" \",S9,SEARCH(\" \",S9,1)+1)-SEARCH(\" \",S9,1)-1),MID(S9,FIND(\" \",S9)+1,256)),\"\")","v":{"$error":"#N/A"}}]
[null,null,null,null,null,null,null,null,null,null,null,null,null,"Prescribeds","Compare SZAADEF and SOATEST scores",null,null,"Lname",{"$f":"IF(S1<>\"\",CONCATENATE(LEFT(S9,FIND(\", \",S9,1)-1)),\"\")","v":{"$error":"#N/A"}}]
[null,null,null,null,null,null,null,null,null,null,null,null,null,null,"Do they match? What K classes are required?  (\"SAILS Math\"=1010 or 1530 non-K or 1710K)"]
[null,null,null,null,null,null,"Post-Customs To-Do List",null,null,{"$f":"CONCATENATE($B$2,\" (\",$B$3,\")\")","v":{"$error":"#N/A"}}]
[null,null,null,null,null,null,"General",null,null,null,null,null,null,"Check RLC options","Based on class list"]
[null,null,null,null,null,null,null,null,"Assign advisor in Banner",null,null,null,null,null,"Must use for students who need READ 1000K/HIST 2020. May recommend for other students."]
[null,null,null,null,null,null,null,null,"Submit appointment report"]
[null,null,null,null,null,null,null,null,null,null,null,null,null,"Honors","Customs chart--\"Factors\" box"]
[null,null,null,null,null,null,null,null,null,null,null,null,null,null,"Is the student eligible to take honors classes? If TR, email Judy Albakry to add honors code."]
[]
[null,null,null,null,null,null,null,null,null,null,null,null,null,"Pre-Nursing","Customs chart--\"Factors\" box"]
[null,null,null,null,null,null,"Special Pops",null,null,null,null,null,null,null,"Do they need different gen eds for PREN vs major?"]
[null,null,null,null,null,null,null,null,"Vet benefits"]
[null,null,null,null,null,null,null,null,"Submit change of major form"]
[null,null,null,null,null,null,null,null,"Send follow-up emails, if needed",null,null,null,"Major-Specific Checks","Task","Where to find info / What to check"]
[null,null,null,null,null,null,null,null,null,null,null,null,null,"Check advising folder","Should have UD form, Reg checklist, anything else specific to major"]
[]
[]
[null,null,null,null,null,null,"Notes:"]
[]
[]
["Copy-Pastes & Folder Links",null,null,"MTSUEmail",{"$f":"B4","v":{"$error":"#N/A"}}]
[{"$f":"A19","v":{"$error":"#N/A"}},{"$f":"$S$1","v":0},null,"PersonalEmail",{"$f":"B5","v":{"$error":"#N/A"}}]
[{"$f":"A20","v":{"$error":"#N/A"}},{"$f":"B20","v":{"$error":"#N/A"}},null,"CustomsPOS",{"$f":"E7","v":{"$error":"#N/A"}}]
["Major name",{"$f":"B21","v":{"$error":"#N/A"}},null,null,{"$f":"E8","v":{"$error":"#N/A"}}]
["Folder name",{"$error":"#N/A"},null,"BannerPOS",{"$f":"E9","v":{"$error":"#N/A"}}]
["Dept folders",{"$f":"HYPERLINK(B24)","v":{"$error":"#N/A"}},null,"Majors match?",{"$f":"E10","v":{"$error":"#N/A"}}]
["Stu folder",{"$f":"HYPERLINK(B25)","v":""},null,"Override major",{"$f":"E11","v":0}]
[null,null,null,"Might need BUAF",{"$f":"E28","v":{"$error":"#N/A"}},null,null,null,null,null,null,null,"Post-Customs Task Guide"]
[null,null,null,null,null,null,null,null,null,null,null,null,"General","Task","Where to find info / What to check"]
["Start",null,null,"Change major",null,null,null,null,null,null,null,null,null,"Assign advisor in Banner","SGAADVR"]
["Stop",null,null,"Notes for advisor",null,null,null,null,null,null,null,null,null,null,"Our type is COLL; We generally are the primary advisor."]
[]
[null,"Report Builder",null,null,"Student Message Builder",null,null,null,null,null,null,null,null,"Submit appointment report","Navigate (SSC)"]
["Registered",null,"see below","Docs attached",null,"x (to say that you've attached docs for the student)"]
["Attaching Scan",null,"x","Drop/Add info",null,"x (to give info on switching classes & steps to do so)"]
["Submitted COM",null,"x","Acad success tips",null,"x (to give acad tips, tutoring & SI websites, & \"ask for help\")"]
["Supp Instructn",null,"x","NURS Info Session",null,"x (to refer student to nursing info webpage and session)",null,null,null,null,null,null,"Special Pops","Task","Where to find info / What to check"]
["RTTP",null,"x","Check phone #",null,"x (to tell stu their listed ph #s are wrong, & how to fix)",null,null,null,null,null,null,null,"Vet benefits","Submit BUAF"]
["Note 1",null,"x","Advisor info",{"$f":"INDEX('Data Lists'!$J:$J,MATCH($B$12,'Data Lists'!$H:$H,0))","v":{"$error":"#N/A"}},"(leave formula, or type \"me <email>\")",null,null,null,null,null,null,null,null,"Form: Z:> Advising> Advising Forms> \"VA Benefit User Adv Form\"; Submit: V drive along w/ UD form"]
["Other",null,"[notes]","Other",null,"[type any notes to student]"]
["Paste in advising report:",{"$f":"CONCATENATE(\"Student came for advising during Customs.\",IF(B81<>\"\",\"  Attaching scanned copy of notes.\",\"\"),IF(B80=\"a\",Messages!$C$2,IF(B80=\"b\",Messages!$C$3,IF(B80<>\"\",CONCATENATE(\"  Registered student for classes for upcoming semester: \",B80),\"\"))),IF(B86<>\"\",CONCATENATE(\"\n\n\",B86),\"\"),IF(B82<>\"\",\"\n\nSubmitted change of major form. \",\"\"),IF(B83<>\"\",Messages!$C$4,\"\"),IF(B84<>\"\",Messages!$C$5,\"\"),IF(B85<>\"\",Messages!$C$6,\"\"))","v":"Student came for advising during Customs."},null,"Paste in stu msg:",{"$f":"CONCATENATE(\"We enjoyed seeing you at the CBHS Advising Center Customs session today, \",$A$21,\"!  \",IF(E80=\"x\",\"I've attached your Registration Checklist, for your records.\",\"\"),IF(E86<>\"\",CONCATENATE(\"\n\n\",E86),\"\"),IF(E81=\"x\",CONCATENATE(Messages!$C$7&E85&\", before making changes.\"),\"\"),IF(E84=\"x\",Messages!$C$10,\"\"),IF(E82=\"x\",Messages!$C$8,\"\"),IF(E83<>\"\",Messages!$C$9,\"\"),CONCATENATE(\"\n\nIf you have any questions or concerns, please contact \"&E85&\".  You'll also want to plan to come in for an advising appointment around mid-terms each semester, to talk about your classes for the upcoming term.  You can find Instructions and Schedule links at mtsu.edu/cbhsadv. \"),\"\n\nWe look forward to seeing you at MTSU this semester!\n\n\",$B$2,\"\n\",$B$3)","v":{"$error":"#N/A"}},null,null,null,null,null,null,null,null,"Submit change of major form","(If applicable)  Pipeline > Bottom of Advisor menu"]
["\"Registered\" choices: \"a\" to get message re stu registering in lab, \"b\" to get message re helping stu register in office, or type list of classes to be inserted."]
[]
["This is what it will say:",null,null,"This is what it will say:",null,null,null,null,null,null,null,null,null,"Send follow-up emails","(if needed)"]
[{"$f":"B87","v":"Student came for advising during Customs."},null,null,{"$f":"E87","v":{"$error":"#N/A"}},null,null,null,null,null,null,null,null,null,null,"e.g., To new advisor if student changed major during advising session"]

{"sheet":"9","index":10,"n_rows":91,"n_cols":20,"rows_kept":91,"cut":false,"hidden":false,"merged":[[90,0,114,1],[90,3,114,4],[1,6,6,6],[2,9,5,9],[2,12,12,12],[14,0,15,0],[14,1,15,1],[14,3,15,3],[14,4,15,4],[15,6,20,6],[82,12,91,12],[74,12,80,12],[2,13,3,13],[5,13,6,13],[8,6,13,6],[8,13,9,13],[9,9,12,9],[11,13,12,13],[16,13,17,13],[19,13,20,13],[22,6,27,6],[22,13,23,13],[23,9,26,9],[26,12,32,12],[27,13,28,13],[29,6,34,6],[30,9,33,9],[30,13,31,13],[15,12,24,12],[16,9,19,9],[34,12,43,12],[35,13,36,13],[36,6,41,6],[37,9,40,9],[38,13,39,13],[41,13,42,13],[44,6,47,10],[45,12,57,12],[46,13,47,13],[49,6,54,6],[49,13,50,13],[50,9,53,9],[52,13,53,13],[55,13,56,13],[56,6,61,6],[57,9,60,9],[59,12,71,12],[60,13,61,13],[63,13,64,13],[64,6,68,10],[83,13,84,13],[86,13,87,13],[89,13,90,13],[66,13,67,13],[69,13,70,13],[75,13,76,13],[78,13,79,13]]}
["Contact & Demographic Info",null,null,"Academic Info",null,null,"Pre-Customs To-Do List",null,null,{"$f":"CONCATENATE($B$2,\" (\",$B$3,\")\"&\", \"&B21)","v":{"$error":"#N/A"}},null,null,"Pre-Customs Task Guide",null,null,null,null,"M#",{"$f":"'My Students'!B11","v":0}]
["Name",{"$f":"CONCATENATE(A20,\" \",B20)","v":{"$error":"#N/A"}},null,"Transferred hours",{"$f":"INDEX($S:$S,MATCH(\"HrsEarned\",$R:$R,0))","v":{"$error":"#N/A"}},null,"General",null,null,null,null,null,null,"Task","Where to find info / What to check",null,null,"Deleted",{"$f":"INDEX('My Students'!$2:$16,MATCH($S$1,'My Students'!$B$2:$B$16,0),MATCH(R2,'My Students'!$2:$2,0))","v":{"$error":"#N/A"}}]
["M#",{"$f":"S1","v":0},null,"HS GPA",{"$f":"INDEX($S:$S,MATCH(\"HighSchoolGPA\",$R:$R,0))","v":{"$error":"#N/A"}},null,null,null,"Make stu folder in Z drive",null,null,null,"General","Make stu folder in Z drive","Naming scheme: <major> <conc> <last>, <first> <M#>",null,null,"SAcad",{"$f":"INDEX('My Students'!$2:$16,MATCH($S$1,'My Students'!$B$2:$B$16,0),MATCH(R3,'My Students'!$2:$2,0))","v":{"$error":"#N/A"}}]
["MTSUEmail",{"$f":"INDEX($S:$S,MATCH(A4,$R:$R,0))","v":{"$error":"#N/A"}},null,"Inclusive GPA",{"$f":"INDEX($S:$S,MATCH(\"InclusiveGPA\",$R:$R,0))","v":{"$error":"#N/A"}},null,null,null,"Check admit term",null,null,null,null,null,"e.g., CRJU LAEN Smith, John M01234567",null,null,"VetOrDep",{"$f":"INDEX('My Students'!$2:$16,MATCH($S$1,'My Students'!$B$2:$B$16,0),MATCH(R4,'My Students'!$2:$2,0))","v":{"$error":"#N/A"}}]
["PersonalEmail",{"$f":"INDEX($S:$S,MATCH(A5,$R:$R,0))","v":{"$error":"#N/A"}},null,"ACT Math",{"$f":"INDEX($S:$S,MATCH(\"ACTMathScre\",$R:$R,0))","v":{"$error":"#N/A"}},null,null,null,"Major",null,null,null,null,null,null,null,null,"PREN",{"$f":"INDEX('My Students'!$2:$16,MATCH($S$1,'My Students'!$B$2:$B$16,0),MATCH(R5,'My Students'!$2:$2,0))","v":{"$error":"#N/A"}}]
["PermPhone",{"$f":"INDEX($S:$S,MATCH(A6,$R:$R,0))","v":{"$error":"#N/A"}},null,"ACT Science",{"$f":"INDEX($S:$S,MATCH(\"ACTScienceScre\",$R:$R,0))","v":{"$error":"#N/A"}},null,null,null,"Acad standing (TRs only)",null,null,null,null,"Check admit term","SAAADMS, Customs chart--\"Flags\"",null,null,"1stGen",{"$f":"INDEX('My Students'!$2:$16,MATCH($S$1,'My Students'!$B$2:$B$16,0),MATCH(R6,'My Students'!$2:$2,0))","v":{"$error":"#N/A"}}]
["MailingPhone",{"$f":"INDEX($S:$S,MATCH(A7,$R:$R,0))","v":{"$error":"#N/A"}},null,"CustomsPOS",{"$f":"INDEX($S:$S,MATCH(D7,$R:$R,0))","v":{"$error":"#N/A"}},null,null,null,null,null,null,null,null,null,"If summer: Verify w/ stu before Customs",null,null,"ReverseTransfer",{"$f":"INDEX('My Students'!$2:$16,MATCH($S$1,'My Students'!$B$2:$B$16,0),MATCH(R7,'My Students'!$2:$2,0))","v":{"$error":"#N/A"}}]
[null,null,null,null,{"$f":"INDEX($S:$S,MATCH(\"Major\",$R:$R,0))","v":{"$error":"#N/A"}},null,null,null,null,null,null,null,null,null,null,null,null,"FR/TR",{"$f":"INDEX('My Students'!$2:$16,MATCH($S$1,'My Students'!$B$2:$B$16,0),MATCH(R8,'My Students'!$2:$2,0))","v":{"$error":"#N/A"}}]
["Customs Info",null,null,"BannerPOS",{"$f":"INDEX($S:$S,MATCH(D9,$R:$R,0))","v":{"$error":"#N/A"}},null,"Special Pops",null,null,null,null,null,null,"Major","SGASTDN, Customs chart--\"Academic\" (& updates from stu)",null,null,"StudentName",{"$f":"INDEX('My Students'!$2:$16,MATCH($S$1,'My Students'!$B$2:$B$16,0),MATCH(R9,'My Students'!$2:$2,0))","v":{"$error":"#N/A"}}]
["CountrySlot",{"$f":"INDEX(S:S,MATCH(A10,R:R,0))","v":{"$error":"#N/A"}},null,"Majors match?",{"$f":"IF(AND(E11=\"\",E7=E9),\"Y\",\"N, Submit change of major\")","v":{"$error":"#N/A"}},null,null,null,"Vet benefits",null,null,null,null,null,null,null,null,"Major",{"$f":"INDEX('My Students'!$2:$16,MATCH($S$1,'My Students'!$B$2:$B$16,0),MATCH(R10,'My Students'!$2:$2,0))","v":{"$error":"#N/A"}}]
["Order/Time",{"$f":"CONCATENATE(INDEX(S:S,MATCH(A11,R:R,0)),\" (\",LEFT(S23,2),\")\")","v":{"$error":"#N/A"}},null,"Override major",null,null,null,null,"Student athlete",null,null,null,null,null,null,null,null,"Order/Time",{"$f":"INDEX('My Students'!$2:$16,MATCH($S$1,'My Students'!$B$2:$B$16,0),MATCH(R11,'My Students'!$2:$2,0))","v":{"$error":"#N/A"}}]
["Acad Advisor",{"$f":"INDEX($S:$S,MATCH(\"Assigned Advisor\",$R:$R,0))","v":{"$error":"#N/A"}},null,null,null,null,null,null,"Pre-Professional",null,null,null,null,"Acad standing (TRs only)","SHATERM, SAAADMS, Transcript",null,null,"PrescribedCrsMath",{"$f":"INDEX('My Students'!$2:$16,MATCH($S$1,'My Students'!$B$2:$B$16,0),MATCH(R12,'My Students'!$2:$2,0))","v":{"$error":"#N/A"}},{"$f":"IF(S12=\"college level\",\"n\",IF(S12=0,\"blank--check\",\"y\"))","v":{"$error":"#N/A"}}]
["Customs Advisor",{"$f":"INDEX($S:$S,MATCH(\"Customs Advisor\",$R:$R,0))","v":{"$error":"#N/A"}},null,"Factors in Choosing Classes",null,null,null,null,null,null,null,null,null,null,"Probation on SHATERM? Must take U2020, meet GPA reqs 1st sem.",null,null,"PrescribedCrsWriting",{"$f":"INDEX('My Students'!$2:$16,MATCH($S$1,'My Students'!$B$2:$B$16,0),MATCH(R13,'My Students'!$2:$2,0))","v":{"$error":"#N/A"}},{"$f":"IF(S13=\"college level\",\"n\",IF(S13=0,\"blank--check\",\"y\"))","v":{"$error":"#N/A"}}]
[null,null,null,"Honors",{"$f":"INDEX($S:$S,MATCH(\"HonorsElig\",$R:$R,0))","v":{"$error":"#N/A"}},null,null,null,null,null,null,null,null,null,null,null,null,"PrescribedCrsReading",{"$f":"INDEX('My Students'!$2:$16,MATCH($S$1,'My Students'!$B$2:$B$16,0),MATCH(R14,'My Students'!$2:$2,0))","v":{"$error":"#N/A"}},{"$f":"IF(S14=\"college level\",\"n\",IF(S14=0,\"blank--check\",\"y\"))","v":{"$error":"#N/A"}}]
["Emily's Notes",{"$f":"INDEX($S:$S,MATCH(\"Notes\",$R:$R,0))","v":{"$error":"#N/A"}},null,"Prescribeds",{"$f":"IF(AND(T12=\"n\",T13=\"n\",T14=\"n\"),\"\",\nCONCATENATE(\"Ks: \"&IF(T12=\"y\",S12,\"\")&IF(T13=\"y\",\", \",\"\")&IF(T12=\"blank--check\",\"Math--check; \",\"\")&\nIF(T13=\"y\",\"ENGL\",\"\")&IF(T14=\"y\",\", \",\"\")&IF(T13=\"blank--check\",\"Engl--check; \",\"\")&\nIF(T14=\"y\",\"READ\",\"\")&IF(T15=\"y\",\", \",\"\")&IF(T14=\"blank--check\",\"Read--check; \",\"\")&\nIF(T15=\"y\",\"U1010\",\"\")))","v":{"$error":"#N/A"}},null,null,null,null,null,null,null,null,null,null,null,null,"PrescribedCrsStudySkills",{"$f":"INDEX('My Students'!$2:$16,MATCH($S$1,'My Students'!$B$2:$B$16,0),MATCH(R15,'My Students'!$2:$2,0))","v":{"$error":"#N/A"}},{"$f":"IF((T12<>\"n\")+(T13=\"y\")+(T14=\"y\")>=2,\"y\",\"n\")","v":{"$error":"#N/A"}}]
[null,null,null,null,null,null,"Reg Issues",null,null,null,null,null,"Special Pops","Task","Where to find info / What to check",null,null,"HonorsElig",{"$f":"INDEX('My Students'!$2:$16,MATCH($S$1,'My Students'!$B$2:$B$16,0),MATCH(R16,'My Students'!$2:$2,0))","v":{"$error":"#N/A"}}]
[null,null,null,"Scholars Acad",{"$f":"INDEX($S:$S,MATCH(\"Sacad\",$R:$R,0))","v":{"$error":"#N/A"}},null,null,null,"Immunization issues?",null,null,null,null,"Vet benefits","SAAQUAN, SGASTDN, SPAIDEN, Customs chart--\"Flags\", ask student",null,null,"ACTEngl",{"$f":"INDEX('My Students'!$2:$16,MATCH($S$1,'My Students'!$B$2:$B$16,0),MATCH(R17,'My Students'!$2:$2,0))","v":{"$error":"#N/A"}}]
["Copy-Pastes & Folder Links",null,null,"Pre-Nursing",{"$f":"INDEX($S:$S,MATCH(\"PREN\",$R:$R,0))","v":{"$error":"#N/A"}},null,null,null,"Holds",null,null,null,null,null,"Need a BUAF form?  (FYI: Flag on Customs list doesn't always mean getting vet benefits!!)",null,null,"HighSchoolGPA",{"$f":"INDEX('My Students'!$2:$16,MATCH($S$1,'My Students'!$B$2:$B$16,0),MATCH(R18,'My Students'!$2:$2,0))","v":{"$error":"#N/A"}}]
[{"$f":"INDEX(S:S,MATCH(\"StudentName\",R:R,0))","v":{"$error":"#N/A"}},{"$f":"S1","v":0},null,"ACTEngl",{"$f":"INDEX($S:$S,MATCH(\"ACTEngl\",$R:$R,0))","v":{"$error":"#N/A"}},null,null,null,null,null,null,null,null,null,null,null,null,"ACTCompositeScore",{"$f":"INDEX('My Students'!$2:$16,MATCH($S$1,'My Students'!$B$2:$B$16,0),MATCH(R19,'My Students'!$2:$2,0))","v":{"$error":"#N/A"}}]
[{"$f":"IFERROR(MID(A19,SEARCH(\" \",A19,1)+1,SEARCH(\" \",A19,SEARCH(\" \",A19,1)+1)-SEARCH(\" \",A19,1)-1),MID(A19,FIND(\" \",A19)+1,256))","v":{"$error":"#N/A"}},{"$f":"CONCATENATE(LEFT(A19,FIND(\", \",A19,1)-1))","v":{"$error":"#N/A"}},null,null,null,null,null,null,null,null,null,null,null,"Student athlete","SGASPRT (Also on main Customs spreadsheet but not sure if accurate)",null,null,"InclusiveGPA",{"$f":"INDEX('My Students'!$2:$16,MATCH($S$1,'My Students'!$B$2:$B$16,0),MATCH(R20,'My Students'!$2:$2,0))","v":{"$error":"#N/A"}}]
["Major name",{"$f":"CONCATENATE(IF(E11=\"\",INDEX('Data Lists'!$B:$B,MATCH($E$7,'Data Lists'!$A:$A,0)),CONCATENATE(INDEX('Data Lists'!$B:$B,MATCH($E$11,'Data Lists'!$B:$B,0))&IF(E18=\"Y\",\" (PREN)\")&\"\")))","v":{"$error":"#N/A"}},null,"Flags",null,null,null,null,null,null,null,null,null,null,"Stu meet with SAEC advisor; Scheduling challenges; Major changes approved through SAEC",null,null,"HrsEarned",{"$f":"INDEX('My Students'!$2:$16,MATCH($S$1,'My Students'!$B$2:$B$16,0),MATCH(R21,'My Students'!$2:$2,0))","v":{"$error":"#N/A"}}]
["Folder name",{"$f":"IF(E11=\"\",CONCATENATE(INDEX('Data Lists'!$E:$E,MATCH($E$7,'Data Lists'!$A:$A,0)),\" \",B20,\", \",A20,\" \",B3),CONCATENATE(INDEX('Data Lists'!$E:$E,MATCH($E$11,'Data Lists'!$B:$B,0)),\" \",B20,\", \",A20,\" \",B3))","v":{"$error":"#N/A"}},null,"Holds",{"$f":"INDEX($S:$S,MATCH(D22,$R:$R,0))","v":{"$error":"#N/A"}},null,null,null,null,null,null,null,null,null,null,null,null,"CountrySlot",{"$f":"INDEX('My Students'!$2:$16,MATCH($S$1,'My Students'!$B$2:$B$16,0),MATCH(R22,'My Students'!$2:$2,0))","v":{"$error":"#N/A"}}]
["Dept folders",{"$f":"HYPERLINK(CONCATENATE(\"Z:\\CoBHS Advising\\Departments\\\",IF(E11=\"\",INDEX('Data Lists'!D:D,MATCH(E7,'Data Lists'!A:A,0)),INDEX('Data Lists'!D:D,MATCH(E11,'Data Lists'!B:B,0))),\"\\Student Forms\\\"))","v":{"$error":"#N/A"}},null,"Reg Restrictions",{"$f":"INDEX($S:$S,MATCH(\"RegistrationRestrictions\",$R:$R,0))","v":{"$error":"#N/A"}},null,"Transcripts",null,null,null,null,null,null,"Pre-Professional","May not know until stu or CBAS reports to us; ask in welcome email!",null,null,"CUSTOMSGrp",{"$f":"INDEX('My Students'!$2:$16,MATCH($S$1,'My Students'!$B$2:$B$16,0),MATCH(R23,'My Students'!$2:$2,0))","v":{"$error":"#N/A"}}]
["Stu folder",{"$f":"HYPERLINK(CONCATENATE(\"Z:\\CoBHS Advising\\Departments\\\",IF(E11=\"\",INDEX('Data Lists'!D:D,MATCH(E7,'Data Lists'!A:A,0)),INDEX('Data Lists'!D:D,MATCH(E11,'Data Lists'!B:B,0))),\"\\Student Forms\\\",B22))","v":{"$error":"#N/A"}},null,"Immunizations",{"$f":"INDEX($S:$S,MATCH(\"RegistrationRestrictions\",$R:$R,0))","v":{"$error":"#N/A"}},null,null,null,"Prior schools",null,null,null,null,null,"Provide Pre-Prof info packet and info session flyer",null,null,"CustomsPOS",{"$f":"INDEX('My Students'!$2:$16,MATCH($S$1,'My Students'!$B$2:$B$16,0),MATCH(R24,'My Students'!$2:$2,0))","v":{"$error":"#N/A"}}]
[null,null,{"$f":"YEARFRAC(S33,NOW())","v":{"$error":"#N/A"}},"Under 18 & Imm",{"$f":"IF(C25>=18,\"OK--over 18\",\"If need imms, will need parent sig\")","v":{"$error":"#N/A"}},null,null,null,"Missing classes/transcripts",null,null,null,null,null,null,null,null,"BannerPOS",{"$f":"INDEX('My Students'!$2:$16,MATCH($S$1,'My Students'!$B$2:$B$16,0),MATCH(R25,'My Students'!$2:$2,0))","v":{"$error":"#N/A"}}]
[null,null,null,"Missing Items",{"$f":"INDEX($S:$S,MATCH(\"MissingChecklistItems\",$R:$R,0))","v":{"$error":"#N/A"}},null,null,null,"Subs needed",null,null,null,null,null,null,null,null,"Assigned Advisor",{"$f":"INDEX('My Students'!$2:$16,MATCH($S$1,'My Students'!$B$2:$B$16,0),MATCH(R26,'My Students'!$2:$2,0))","v":{"$error":"#N/A"}}]
[null,null,null,"Term",{"$f":"INDEX($S:$S,MATCH(\"TermDesc\",$R:$R,0))","v":{"$error":"#N/A"}},null,null,null,null,null,null,null,"Reg Issues","Task","Where to find info / What to check",null,null,"Customs Advisor",{"$f":"INDEX('My Students'!$2:$16,MATCH($S$1,'My Students'!$B$2:$B$16,0),MATCH(R27,'My Students'!$2:$2,0))","v":{"$error":"#N/A"}}]
[null,null,null,"Might need BUAF",{"$f":"INDEX($S:$S,MATCH(\"VetOrDep\",$R:$R,0))","v":{"$error":"#N/A"}},null,null,null,null,null,null,null,null,"Immunization issues?","Banner: SZAITRK",null,null,"Holds",{"$f":"INDEX('My Students'!$2:$16,MATCH($S$1,'My Students'!$B$2:$B$16,0),MATCH(R28,'My Students'!$2:$2,0))","v":{"$error":"#N/A"}}]
[null,null,null,"Reverse Transfer",{"$f":"INDEX($S:$S,MATCH(\"ReverseTransfer\",$R:$R,0))","v":{"$error":"#N/A"}},null,null,null,null,null,null,null,null,null,"Missing imm docs, under 18--need parent form",null,null,"RegistrationRestrictions",{"$f":"INDEX('My Students'!$2:$16,MATCH($S$1,'My Students'!$B$2:$B$16,0),MATCH(R29,'My Students'!$2:$2,0))","v":{"$error":"#N/A"}}]
[null,null,null,"First Generation",{"$f":"INDEX($S:$S,MATCH(\"1stGen\",$R:$R,0))","v":{"$error":"#N/A"}},null,"Course Types",null,null,null,null,null,null,null,null,null,null,"MissingChecklistItems",{"$f":"INDEX('My Students'!$2:$16,MATCH($S$1,'My Students'!$B$2:$B$16,0),MATCH(R30,'My Students'!$2:$2,0))","v":{"$error":"#N/A"}}]
["Want to add a link to the student's folder? ",null,null,null,null,null,null,null,"Prescribeds",null,null,null,null,"Holds","SOAHOLD, Customs chart--\"Factors\"",null,null,"AdmissionDecision",{"$f":"INDEX('My Students'!$2:$16,MATCH($S$1,'My Students'!$B$2:$B$16,0),MATCH(R31,'My Students'!$2:$2,0))","v":{"$error":"#N/A"}}]
["--Click on the \"Stu folder\" field above (B21).",null,null,null,null,null,null,null,"Check RLC options",null,null,null,null,null,null,null,null,"TermDesc",{"$f":"INDEX('My Students'!$2:$16,MATCH($S$1,'My Students'!$B$2:$B$16,0),MATCH(R32,'My Students'!$2:$2,0))","v":{"$error":"#N/A"}}]
["--Control-K to start the process of creating a link.",null,null,null,null,null,null,null,"Honors",null,null,null,null,null,null,null,null,"DateofBirth",{"$f":"INDEX('My Students'!$2:$16,MATCH($S$1,'My Students'!$B$2:$B$16,0),MATCH(R33,'My Students'!$2:$2,0))","v":{"$error":"#N/A"}}]
["--Browse to the student's folder.",null,null,null,null,null,null,null,"Pre-Nursing",null,null,null,null,null,null,null,null,"Notes",{"$f":"INDEX('My Students'!$2:$16,MATCH($S$1,'My Students'!$B$2:$B$16,0),MATCH(R34,'My Students'!$2:$2,0))","v":{"$error":"#N/A"}}]
["--Choose any file in the folder and double-click on it.",null,null,null,null,null,null,null,null,null,null,null,"Check Transcripts","Task","Where to find info / What to check",null,null,"MTSUEmail",{"$f":"INDEX('My Students'!$2:$16,MATCH($S$1,'My Students'!$B$2:$B$16,0),MATCH(R35,'My Students'!$2:$2,0))","v":{"$error":"#N/A"}}]
["--In the Address box, delete the file name (back to the \\ after the folder name).",null,null,null,null,null,null,null,null,null,null,null,null,"Prior schools","Banner: SOAPCOL / Pipeline: Prior College Info",null,null,"PersonalEmail",{"$f":"INDEX('My Students'!$2:$16,MATCH($S$1,'My Students'!$B$2:$B$16,0),MATCH(R36,'My Students'!$2:$2,0))","v":{"$error":"#N/A"}}]
["--Click OK.",null,null,null,null,null,"Major-Specific",null,null,null,null,null,null,null,null,null,null,"PermPhone",{"$f":"INDEX('My Students'!$2:$16,MATCH($S$1,'My Students'!$B$2:$B$16,0),MATCH(R37,'My Students'!$2:$2,0))","v":{"$error":"#N/A"}}]
["--Now you should see the path to the folder, underlined as a link.",null,null,null,null,null,null,null,null,null,null,null,null,null,null,null,null,"MailingPhone",{"$f":"INDEX('My Students'!$2:$16,MATCH($S$1,'My Students'!$B$2:$B$16,0),MATCH(R38,'My Students'!$2:$2,0))","v":{"$error":"#N/A"}}]
["--When you click on your link, the folder should open in a separate window.",null,null,null,null,null,null,null,null,null,null,null,null,"Missing classes/ transcripts","BDMS (Banner: SAAADMS, click search icon) / Pline: Transfer Eval / Ask stu in welcome email",null,null,"NursElig",{"$f":"INDEX('My Students'!$2:$16,MATCH($S$1,'My Students'!$B$2:$B$16,0),MATCH(R39,'My Students'!$2:$2,0))","v":{"$error":"#N/A"}}]
[null,null,null,null,null,null,null,null,null,null,null,null,null,null,"FRs: AP, IB, DE, Dual Credit, Cambridge  /  TRs: Sems in progress or missing from MT transcript",null,null,"ACTMathScre",{"$f":"INDEX('My Students'!$2:$16,MATCH($S$1,'My Students'!$B$2:$B$16,0),MATCH(R40,'My Students'!$2:$2,0))","v":{"$error":"#N/A"}}]
[null,null,null,null,null,null,null,null,null,null,null,null,null,null,null,null,null,"ACTScienceScre",{"$f":"INDEX('My Students'!$2:$16,MATCH($S$1,'My Students'!$B$2:$B$16,0),MATCH(R41,'My Students'!$2:$2,0))","v":{"$error":"#N/A"}}]
[null,null,null,null,null,null,null,null,null,null,null,null,null,"Subs needed","By comparing transcript, transfer eval, & UD form.  Use TES for course descriptions.",null,null,"A&P?",{"$f":"IF(S1<>\"\",IF(OR(AND(S40=21,S41>21),AND(S40>21,S41=21)),\"maybe\",IF(AND(S31>=21,S41>=21),\"Y\",\"N\")),\"\")","v":{"$error":"#N/A"}}]
[null,null,null,null,null,null,null,null,null,null,null,null,null,null,"Any classes that might/should count but aren't?",null,null,"Major by Look-up",{"$f":"INDEX('Data Lists'!B:B,MATCH(S24,'Data Lists'!A:A,0))","v":{"$error":"#N/A"}}]
[null,null,null,null,null,null,"Notes:",null,null,null,null,null,null,null,null,null,null,"NameM#",{"$f":"CONCATENATE(S47,\", \",S46,\" \",S45)","v":{"$error":"#N/A"}}]
[null,null,null,null,null,null,null,null,null,null,null,null,"Pre-Customs Task Guide--Page 2",null,null,null,null,"M# copy",{"$f":"S1","v":0}]
[null,null,null,null,null,null,null,null,null,null,null,null,"Specific Course Types","Task","Where to find info / What to check",null,null,"Fname",{"$f":"IF(1<>\"\",IFERROR(MID(S9,SEARCH(\" \",S9,1)+1,SEARCH(\" \",S9,SEARCH(\" \",S9,1)+1)-SEARCH(\" \",S9,1)-1),MID(S9,FIND(\" \",S9)+1,256)),\"\")","v":{"$error":"#N/A"}}]
[null,null,null,null,null,null,null,null,null,null,null,null,null,"Prescribeds","Compare SZAADEF and SOATEST scores",null,null,"Lname",{"$f":"IF(S1<>\"\",CONCATENATE(LEFT(S9,FIND(\", \",S9,1)-1)),\"\")","v":{"$error":"#N/A"}}]
[null,null,null,null,null,null,null,null,null,null,null,null,null,null,"Do they match? What K classes are required?  (\"SAILS Math\"=1010 or 1530 non-K or 1710K)"]
[null,null,null,null,null,null,"Post-Customs To-Do List",null,null,{"$f":"CONCATENATE($B$2,\" (\",$B$3,\")\")","v":{"$error":"#N/A"}}]
[null,null,null,null,null,null,"General",null,null,null,null,null,null,"Check RLC options","Based on class list"]
[null,null,null,null,null,null,null,null,"Assign advisor in Banner",null,null,null,null,null,"Must use for students who need READ 1000K/HIST 2020. May recommend for other students."]
[null,null,null,null,null,null,null,null,"Submit appointment report"]
[null,null,null,null,null,null,null,null,null,null,null,null,null,"Honors","Customs chart--\"Factors\" box"]
[null,null,null,null,null,null,null,null,null,null,null,null,null,null,"Is the student eligible to take honors classes? If TR, email Judy Albakry to add honors code."]
[]
[null,null,null,null,null,null,null,null,null,null,null,null,null,"Pre-Nursing","Customs chart--\"Factors\" box"]
[null,null,null,null,null,null,"Special Pops",null,null,null,null,null,null,null,"Do they need different gen eds for PREN vs major?"]
[null,null,null,null,null,null,null,null,"Vet benefits"]
[null,null,null,null,null,null,null,null,"Submit change of major form"]
[null,null,null,null,null,null,null,null,"Send follow-up emails, if needed",null,null,null,"Major-Specific Checks","Task","Where to find info / What to check"]
[null,null,null,null,null,null,null,null,null,null,null,null,null,"Check advising folder","Should have UD form, Reg checklist, anything else specific to major"]
[]
[]
[null,null,null,null,null,null,"Notes:"]
[]
[]
["Copy-Pastes & Folder Links",null,null,"MTSUEmail",{"$f":"B4","v":{"$error":"#N/A"}}]
[{"$f":"A19","v":{"$error":"#N/A"}},{"$f":"$S$1","v":0},null,"PersonalEmail",{"$f":"B5","v":{"$error":"#N/A"}}]
[{"$f":"A20","v":{"$error":"#N/A"}},{"$f":"B20","v":{"$error":"#N/A"}},null,"CustomsPOS",{"$f":"E7","v":{"$error":"#N/A"}}]
["Major name",{"$f":"B21","v":{"$error":"#N/A"}},null,null,{"$f":"E8","v":{"$error":"#N/A"}}]
["Folder name",{"$error":"#N/A"},null,"BannerPOS",{"$f":"E9","v":{"$error":"#N/A"}}]
["Dept folders",{"$f":"HYPERLINK(B24)","v":{"$error":"#N/A"}},null,"Majors match?",{"$f":"E10","v":{"$error":"#N/A"}}]
["Stu folder",{"$f":"HYPERLINK(B25)","v":""},null,"Override major",{"$f":"E11","v":0}]
[null,null,null,"Might need BUAF",{"$f":"E28","v":{"$error":"#N/A"}},null,null,null,null,null,null,null,"Post-Customs Task Guide"]
[null,null,null,null,null,null,null,null,null,null,null,null,"General","Task","Where to find info / What to check"]
["Start",null,null,"Change major",null,null,null,null,null,null,null,null,null,"Assign advisor in Banner","SGAADVR"]
["Stop",null,null,"Notes for advisor",null,null,null,null,null,null,null,null,null,null,"Our type is COLL; We generally are the primary advisor."]
[]
[null,"Report Builder",null,null,"Student Message Builder",null,null,null,null,null,null,null,null,"Submit appointment report","Navigate (SSC)"]
["Registered",null,"see below","Docs attached",null,"x (to say that you've attached docs for the student)"]
["Attaching Scan",null,"x","Drop/Add info",null,"x (to give info on switching classes & steps to do so)"]
["Submitted COM",null,"x","Acad success tips",null,"x (to give acad tips, tutoring & SI websites, & \"ask for help\")"]
["Supp Instructn",null,"x","NURS Info Session",null,"x (to refer student to nursing info webpage and session)",null,null,null,null,null,null,"Special Pops","Task","Where to find info / What to check"]
["RTTP",null,"x","Check phone #",null,"x (to tell stu their listed ph #s are wrong, & how to fix)",null,null,null,null,null,null,null,"Vet benefits","Submit BUAF"]
["Note 1",null,"x","Advisor info",{"$f":"INDEX('Data Lists'!$J:$J,MATCH($B$12,'Data Lists'!$H:$H,0))","v":{"$error":"#N/A"}},"(leave formula, or type \"me <email>\")",null,null,null,null,null,null,null,null,"Form: Z:> Advising> Advising Forms> \"VA Benefit User Adv Form\"; Submit: V drive along w/ UD form"]
["Other",null,"[notes]","Other",null,"[type any notes to student]"]
["Paste in advising report:",{"$f":"CONCATENATE(\"Student came for advising during Customs.\",IF(B81<>\"\",\"  Attaching scanned copy of notes.\",\"\"),IF(B80=\"a\",Messages!$C$2,IF(B80=\"b\",Messages!$C$3,IF(B80<>\"\",CONCATENATE(\"  Registered student for classes for upcoming semester: \",B80),\"\"))),IF(B86<>\"\",CONCATENATE(\"\n\n\",B86),\"\"),IF(B82<>\"\",\"\n\nSubmitted change of major form. \",\"\"),IF(B83<>\"\",Messages!$C$4,\"\"),IF(B84<>\"\",Messages!$C$5,\"\"),IF(B85<>\"\",Messages!$C$6,\"\"))","v":"Student came for advising during Customs."},null,"Paste in stu msg:",{"$f":"CONCATENATE(\"We enjoyed seeing you at the CBHS Advising Center Customs session today, \",$A$21,\"!  \",IF(E80=\"x\",\"I've attached your Registration Checklist, for your records.\",\"\"),IF(E86<>\"\",CONCATENATE(\"\n\n\",E86),\"\"),IF(E81=\"x\",CONCATENATE(Messages!$C$7&E85&\", before making changes.\"),\"\"),IF(E84=\"x\",Messages!$C$10,\"\"),IF(E82=\"x\",Messages!$C$8,\"\"),IF(E83<>\"\",Messages!$C$9,\"\"),CONCATENATE(\"\n\nIf you have any questions or concerns, please contact \"&E85&\".  You'll also want to plan to come in for an advising appointment around mid-terms each semester, to talk about your classes for the upcoming term.  You can find Instructions and Schedule links at mtsu.edu/cbhsadv. \"),\"\n\nWe look forward to seeing you at MTSU this semester!\n\n\",$B$2,\"\n\",$B$3)","v":{"$error":"#N/A"}},null,null,null,null,null,null,null,null,"Submit change of major form","(If applicable)  Pipeline > Bottom of Advisor menu"]
["\"Registered\" choices: \"a\" to get message re stu registering in lab, \"b\" to get message re helping stu register in office, or type list of classes to be inserted."]
[]
["This is what it will say:",null,null,"This is what it will say:",null,null,null,null,null,null,null,null,null,"Send follow-up emails","(if needed)"]
[{"$f":"B87","v":"Student came for advising during Customs."},null,null,{"$f":"E87","v":{"$error":"#N/A"}},null,null,null,null,null,null,null,null,null,null,"e.g., To new advisor if student changed major during advising session"]

{"sheet":"10","index":11,"n_rows":91,"n_cols":20,"rows_kept":91,"cut":false,"hidden":false,"merged":[[90,0,114,1],[90,3,114,4],[1,6,6,6],[2,9,5,9],[2,12,12,12],[14,0,15,0],[14,1,15,1],[14,3,15,3],[14,4,15,4],[15,6,20,6],[82,12,91,12],[74,12,80,12],[2,13,3,13],[5,13,6,13],[8,6,13,6],[8,13,9,13],[9,9,12,9],[11,13,12,13],[16,13,17,13],[19,13,20,13],[22,6,27,6],[22,13,23,13],[23,9,26,9],[26,12,32,12],[27,13,28,13],[29,6,34,6],[30,9,33,9],[30,13,31,13],[15,12,24,12],[16,9,19,9],[34,12,43,12],[35,13,36,13],[36,6,41,6],[37,9,40,9],[38,13,39,13],[41,13,42,13],[44,6,47,10],[45,12,57,12],[46,13,47,13],[49,6,54,6],[49,13,50,13],[50,9,53,9],[52,13,53,13],[55,13,56,13],[56,6,61,6],[57,9,60,9],[59,12,71,12],[60,13,61,13],[63,13,64,13],[64,6,68,10],[83,13,84,13],[86,13,87,13],[89,13,90,13],[66,13,67,13],[69,13,70,13],[75,13,76,13],[78,13,79,13]]}
["Contact & Demographic Info",null,null,"Academic Info",null,null,"Pre-Customs To-Do List",null,null,{"$f":"CONCATENATE($B$2,\" (\",$B$3,\")\"&\", \"&B21)","v":{"$error":"#N/A"}},null,null,"Pre-Customs Task Guide",null,null,null,null,"M#",{"$f":"'My Students'!B12","v":0}]
["Name",{"$f":"CONCATENATE(A20,\" \",B20)","v":{"$error":"#N/A"}},null,"Transferred hours",{"$f":"INDEX($S:$S,MATCH(\"HrsEarned\",$R:$R,0))","v":{"$error":"#N/A"}},null,"General",null,null,null,null,null,null,"Task","Where to find info / What to check",null,null,"Deleted",{"$f":"INDEX('My Students'!$2:$16,MATCH($S$1,'My Students'!$B$2:$B$16,0),MATCH(R2,'My Students'!$2:$2,0))","v":{"$error":"#N/A"}}]
["M#",{"$f":"S1","v":0},null,"HS GPA",{"$f":"INDEX($S:$S,MATCH(\"HighSchoolGPA\",$R:$R,0))","v":{"$error":"#N/A"}},null,null,null,"Make stu folder in Z drive",null,null,null,"General","Make stu folder in Z drive","Naming scheme: <major> <conc> <last>, <first> <M#>",null,null,"SAcad",{"$f":"INDEX('My Students'!$2:$16,MATCH($S$1,'My Students'!$B$2:$B$16,0),MATCH(R3,'My Students'!$2:$2,0))","v":{"$error":"#N/A"}}]
["MTSUEmail",{"$f":"INDEX($S:$S,MATCH(A4,$R:$R,0))","v":{"$error":"#N/A"}},null,"Inclusive GPA",{"$f":"INDEX($S:$S,MATCH(\"InclusiveGPA\",$R:$R,0))","v":{"$error":"#N/A"}},null,null,null,"Check admit term",null,null,null,null,null,"e.g., CRJU LAEN Smith, John M01234567",null,null,"VetOrDep",{"$f":"INDEX('My Students'!$2:$16,MATCH($S$1,'My Students'!$B$2:$B$16,0),MATCH(R4,'My Students'!$2:$2,0))","v":{"$error":"#N/A"}}]
["PersonalEmail",{"$f":"INDEX($S:$S,MATCH(A5,$R:$R,0))","v":{"$error":"#N/A"}},null,"ACT Math",{"$f":"INDEX($S:$S,MATCH(\"ACTMathScre\",$R:$R,0))","v":{"$error":"#N/A"}},null,null,null,"Major",null,null,null,null,null,null,null,null,"PREN",{"$f":"INDEX('My Students'!$2:$16,MATCH($S$1,'My Students'!$B$2:$B$16,0),MATCH(R5,'My Students'!$2:$2,0))","v":{"$error":"#N/A"}}]
["PermPhone",{"$f":"INDEX($S:$S,MATCH(A6,$R:$R,0))","v":{"$error":"#N/A"}},null,"ACT Science",{"$f":"INDEX($S:$S,MATCH(\"ACTScienceScre\",$R:$R,0))","v":{"$error":"#N/A"}},null,null,null,"Acad standing (TRs only)",null,null,null,null,"Check admit term","SAAADMS, Customs chart--\"Flags\"",null,null,"1stGen",{"$f":"INDEX('My Students'!$2:$16,MATCH($S$1,'My Students'!$B$2:$B$16,0),MATCH(R6,'My Students'!$2:$2,0))","v":{"$error":"#N/A"}}]
["MailingPhone",{"$f":"INDEX($S:$S,MATCH(A7,$R:$R,0))","v":{"$error":"#N/A"}},null,"CustomsPOS",{"$f":"INDEX($S:$S,MATCH(D7,$R:$R,0))","v":{"$error":"#N/A"}},null,null,null,null,null,null,null,null,null,"If summer: Verify w/ stu before Customs",null,null,"ReverseTransfer",{"$f":"INDEX('My Students'!$2:$16,MATCH($S$1,'My Students'!$B$2:$B$16,0),MATCH(R7,'My Students'!$2:$2,0))","v":{"$error":"#N/A"}}]
[null,null,null,null,{"$f":"INDEX($S:$S,MATCH(\"Major\",$R:$R,0))","v":{"$error":"#N/A"}},null,null,null,null,null,null,null,null,null,null,null,null,"FR/TR",{"$f":"INDEX('My Students'!$2:$16,MATCH($S$1,'My Students'!$B$2:$B$16,0),MATCH(R8,'My Students'!$2:$2,0))","v":{"$error":"#N/A"}}]
["Customs Info",null,null,"BannerPOS",{"$f":"INDEX($S:$S,MATCH(D9,$R:$R,0))","v":{"$error":"#N/A"}},null,"Special Pops",null,null,null,null,null,null,"Major","SGASTDN, Customs chart--\"Academic\" (& updates from stu)",null,null,"StudentName",{"$f":"INDEX('My Students'!$2:$16,MATCH($S$1,'My Students'!$B$2:$B$16,0),MATCH(R9,'My Students'!$2:$2,0))","v":{"$error":"#N/A"}}]
["CountrySlot",{"$f":"INDEX(S:S,MATCH(A10,R:R,0))","v":{"$error":"#N/A"}},null,"Majors match?",{"$f":"IF(AND(E11=\"\",E7=E9),\"Y\",\"N, Submit change of major\")","v":{"$error":"#N/A"}},null,null,null,"Vet benefits",null,null,null,null,null,null,null,null,"Major",{"$f":"INDEX('My Students'!$2:$16,MATCH($S$1,'My Students'!$B$2:$B$16,0),MATCH(R10,'My Students'!$2:$2,0))","v":{"$error":"#N/A"}}]
["Order/Time",{"$f":"CONCATENATE(INDEX(S:S,MATCH(A11,R:R,0)),\" (\",LEFT(S23,2),\")\")","v":{"$error":"#N/A"}},null,"Override major",null,null,null,null,"Student athlete",null,null,null,null,null,null,null,null,"Order/Time",{"$f":"INDEX('My Students'!$2:$16,MATCH($S$1,'My Students'!$B$2:$B$16,0),MATCH(R11,'My Students'!$2:$2,0))","v":{"$error":"#N/A"}}]
["Acad Advisor",{"$f":"INDEX($S:$S,MATCH(\"Assigned Advisor\",$R:$R,0))","v":{"$error":"#N/A"}},null,null,null,null,null,null,"Pre-Professional",null,null,null,null,"Acad standing (TRs only)","SHATERM, SAAADMS, Transcript",null,null,"PrescribedCrsMath",{"$f":"INDEX('My Students'!$2:$16,MATCH($S$1,'My Students'!$B$2:$B$16,0),MATCH(R12,'My Students'!$2:$2,0))","v":{"$error":"#N/A"}},{"$f":"IF(S12=\"college level\",\"n\",IF(S12=0,\"blank--check\",\"y\"))","v":{"$error":"#N/A"}}]
["Customs Advisor",{"$f":"INDEX($S:$S,MATCH(\"Customs Advisor\",$R:$R,0))","v":{"$error":"#N/A"}},null,"Factors in Choosing Classes",null,null,null,null,null,null,null,null,null,null,"Probation on SHATERM? Must take U2020, meet GPA reqs 1st sem.",null,null,"PrescribedCrsWriting",{"$f":"INDEX('My Students'!$2:$16,MATCH($S$1,'My Students'!$B$2:$B$16,0),MATCH(R13,'My Students'!$2:$2,0))","v":{"$error":"#N/A"}},{"$f":"IF(S13=\"college level\",\"n\",IF(S13=0,\"blank--check\",\"y\"))","v":{"$error":"#N/A"}}]
[null,null,null,"Honors",{"$f":"INDEX($S:$S,MATCH(\"HonorsElig\",$R:$R,0))","v":{"$error":"#N/A"}},null,null,null,null,null,null,null,null,null,null,null,null,"PrescribedCrsReading",{"$f":"INDEX('My Students'!$2:$16,MATCH($S$1,'My Students'!$B$2:$B$16,0),MATCH(R14,'My Students'!$2:$2,0))","v":{"$error":"#N/A"}},{"$f":"IF(S14=\"college level\",\"n\",IF(S14=0,\"blank--check\",\"y\"))","v":{"$error":"#N/A"}}]
["Emily's Notes",{"$f":"INDEX($S:$S,MATCH(\"Notes\",$R:$R,0))","v":{"$error":"#N/A"}},null,"Prescribeds",{"$f":"IF(AND(T12=\"n\",T13=\"n\",T14=\"n\"),\"\",\nCONCATENATE(\"Ks: \"&IF(T12=\"y\",S12,\"\")&IF(T13=\"y\",\", \",\"\")&IF(T12=\"blank--check\",\"Math--check; \",\"\")&\nIF(T13=\"y\",\"ENGL\",\"\")&IF(T14=\"y\",\", \",\"\")&IF(T13=\"blank--check\",\"Engl--check; \",\"\")&\nIF(T14=\"y\",\"READ\",\"\")&IF(T15=\"y\",\", \",\"\")&IF(T14=\"blank--check\",\"Read--check; \",\"\")&\nIF(T15=\"y\",\"U1010\",\"\")))","v":{"$error":"#N/A"}},null,null,null,null,null,null,null,null,null,null,null,null,"PrescribedCrsStudySkills",{"$f":"INDEX('My Students'!$2:$16,MATCH($S$1,'My Students'!$B$2:$B$16,0),MATCH(R15,'My Students'!$2:$2,0))","v":{"$error":"#N/A"}},{"$f":"IF((T12<>\"n\")+(T13=\"y\")+(T14=\"y\")>=2,\"y\",\"n\")","v":{"$error":"#N/A"}}]
[null,null,null,null,null,null,"Reg Issues",null,null,null,null,null,"Special Pops","Task","Where to find info / What to check",null,null,"HonorsElig",{"$f":"INDEX('My Students'!$2:$16,MATCH($S$1,'My Students'!$B$2:$B$16,0),MATCH(R16,'My Students'!$2:$2,0))","v":{"$error":"#N/A"}}]
[null,null,null,"Scholars Acad",{"$f":"INDEX($S:$S,MATCH(\"Sacad\",$R:$R,0))","v":{"$error":"#N/A"}},null,null,null,"Immunization issues?",null,null,null,null,"Vet benefits","SAAQUAN, SGASTDN, SPAIDEN, Customs chart--\"Flags\", ask student",null,null,"ACTEngl",{"$f":"INDEX('My Students'!$2:$16,MATCH($S$1,'My Students'!$B$2:$B$16,0),MATCH(R17,'My Students'!$2:$2,0))","v":{"$error":"#N/A"}}]
["Copy-Pastes & Folder Links",null,null,"Pre-Nursing",{"$f":"INDEX($S:$S,MATCH(\"PREN\",$R:$R,0))","v":{"$error":"#N/A"}},null,null,null,"Holds",null,null,null,null,null,"Need a BUAF form?  (FYI: Flag on Customs list doesn't always mean getting vet benefits!!)",null,null,"HighSchoolGPA",{"$f":"INDEX('My Students'!$2:$16,MATCH($S$1,'My Students'!$B$2:$B$16,0),MATCH(R18,'My Students'!$2:$2,0))","v":{"$error":"#N/A"}}]
[{"$f":"INDEX(S:S,MATCH(\"StudentName\",R:R,0))","v":{"$error":"#N/A"}},{"$f":"S1","v":0},null,"ACTEngl",{"$f":"INDEX($S:$S,MATCH(\"ACTEngl\",$R:$R,0))","v":{"$error":"#N/A"}},null,null,null,null,null,null,null,null,null,null,null,null,"ACTCompositeScore",{"$f":"INDEX('My Students'!$2:$16,MATCH($S$1,'My Students'!$B$2:$B$16,0),MATCH(R19,'My Students'!$2:$2,0))","v":{"$error":"#N/A"}}]
[{"$f":"IFERROR(MID(A19,SEARCH(\" \",A19,1)+1,SEARCH(\" \",A19,SEARCH(\" \",A19,1)+1)-SEARCH(\" \",A19,1)-1),MID(A19,FIND(\" \",A19)+1,256))","v":{"$error":"#N/A"}},{"$f":"CONCATENATE(LEFT(A19,FIND(\", \",A19,1)-1))","v":{"$error":"#N/A"}},null,null,null,null,null,null,null,null,null,null,null,"Student athlete","SGASPRT (Also on main Customs spreadsheet but not sure if accurate)",null,null,"InclusiveGPA",{"$f":"INDEX('My Students'!$2:$16,MATCH($S$1,'My Students'!$B$2:$B$16,0),MATCH(R20,'My Students'!$2:$2,0))","v":{"$error":"#N/A"}}]
["Major name",{"$f":"CONCATENATE(IF(E11=\"\",INDEX('Data Lists'!$B:$B,MATCH($E$7,'Data Lists'!$A:$A,0)),CONCATENATE(INDEX('Data Lists'!$B:$B,MATCH($E$11,'Data Lists'!$B:$B,0))&IF(E18=\"Y\",\" (PREN)\")&\"\")))","v":{"$error":"#N/A"}},null,"Flags",null,null,null,null,null,null,null,null,null,null,"Stu meet with SAEC advisor; Scheduling challenges; Major changes approved through SAEC",null,null,"HrsEarned",{"$f":"INDEX('My Students'!$2:$16,MATCH($S$1,'My Students'!$B$2:$B$16,0),MATCH(R21,'My Students'!$2:$2,0))","v":{"$error":"#N/A"}}]
["Folder name",{"$f":"IF(E11=\"\",CONCATENATE(INDEX('Data Lists'!$E:$E,MATCH($E$7,'Data Lists'!$A:$A,0)),\" \",B20,\", \",A20,\" \",B3),CONCATENATE(INDEX('Data Lists'!$E:$E,MATCH($E$11,'Data Lists'!$B:$B,0)),\" \",B20,\", \",A20,\" \",B3))","v":{"$error":"#N/A"}},null,"Holds",{"$f":"INDEX($S:$S,MATCH(D22,$R:$R,0))","v":{"$error":"#N/A"}},null,null,null,null,null,null,null,null,null,null,null,null,"CountrySlot",{"$f":"INDEX('My Students'!$2:$16,MATCH($S$1,'My Students'!$B$2:$B$16,0),MATCH(R22,'My Students'!$2:$2,0))","v":{"$error":"#N/A"}}]
["Dept folders",{"$f":"HYPERLINK(CONCATENATE(\"Z:\\CoBHS Advising\\Departments\\\",IF(E11=\"\",INDEX('Data Lists'!D:D,MATCH(E7,'Data Lists'!A:A,0)),INDEX('Data Lists'!D:D,MATCH(E11,'Data Lists'!B:B,0))),\"\\Student Forms\\\"))","v":{"$error":"#N/A"}},null,"Reg Restrictions",{"$f":"INDEX($S:$S,MATCH(\"RegistrationRestrictions\",$R:$R,0))","v":{"$error":"#N/A"}},null,"Transcripts",null,null,null,null,null,null,"Pre-Professional","May not know until stu or CBAS reports to us; ask in welcome email!",null,null,"CUSTOMSGrp",{"$f":"INDEX('My Students'!$2:$16,MATCH($S$1,'My Students'!$B$2:$B$16,0),MATCH(R23,'My Students'!$2:$2,0))","v":{"$error":"#N/A"}}]
["Stu folder",{"$f":"HYPERLINK(CONCATENATE(\"Z:\\CoBHS Advising\\Departments\\\",IF(E11=\"\",INDEX('Data Lists'!D:D,MATCH(E7,'Data Lists'!A:A,0)),INDEX('Data Lists'!D:D,MATCH(E11,'Data Lists'!B:B,0))),\"\\Student Forms\\\",B22))","v":{"$error":"#N/A"}},null,"Immunizations",{"$f":"INDEX($S:$S,MATCH(\"RegistrationRestrictions\",$R:$R,0))","v":{"$error":"#N/A"}},null,null,null,"Prior schools",null,null,null,null,null,"Provide Pre-Prof info packet and info session flyer",null,null,"CustomsPOS",{"$f":"INDEX('My Students'!$2:$16,MATCH($S$1,'My Students'!$B$2:$B$16,0),MATCH(R24,'My Students'!$2:$2,0))","v":{"$error":"#N/A"}}]
[null,null,{"$f":"YEARFRAC(S33,NOW())","v":{"$error":"#N/A"}},"Under 18 & Imm",{"$f":"IF(C25>=18,\"OK--over 18\",\"If need imms, will need parent sig\")","v":{"$error":"#N/A"}},null,null,null,"Missing classes/transcripts",null,null,null,null,null,null,null,null,"BannerPOS",{"$f":"INDEX('My Students'!$2:$16,MATCH($S$1,'My Students'!$B$2:$B$16,0),MATCH(R25,'My Students'!$2:$2,0))","v":{"$error":"#N/A"}}]
[null,null,null,"Missing Items",{"$f":"INDEX($S:$S,MATCH(\"MissingChecklistItems\",$R:$R,0))","v":{"$error":"#N/A"}},null,null,null,"Subs needed",null,null,null,null,null,null,null,null,"Assigned Advisor",{"$f":"INDEX('My Students'!$2:$16,MATCH($S$1,'My Students'!$B$2:$B$16,0),MATCH(R26,'My Students'!$2:$2,0))","v":{"$error":"#N/A"}}]
[null,null,null,"Term",{"$f":"INDEX($S:$S,MATCH(\"TermDesc\",$R:$R,0))","v":{"$error":"#N/A"}},null,null,null,null,null,null,null,"Reg Issues","Task","Where to find info / What to check",null,null,"Customs Advisor",{"$f":"INDEX('My Students'!$2:$16,MATCH($S$1,'My Students'!$B$2:$B$16,0),MATCH(R27,'My Students'!$2:$2,0))","v":{"$error":"#N/A"}}]
[null,null,null,"Might need BUAF",{"$f":"INDEX($S:$S,MATCH(\"VetOrDep\",$R:$R,0))","v":{"$error":"#N/A"}},null,null,null,null,null,null,null,null,"Immunization issues?","Banner: SZAITRK",null,null,"Holds",{"$f":"INDEX('My Students'!$2:$16,MATCH($S$1,'My Students'!$B$2:$B$16,0),MATCH(R28,'My Students'!$2:$2,0))","v":{"$error":"#N/A"}}]
[null,null,null,"Reverse Transfer",{"$f":"INDEX($S:$S,MATCH(\"ReverseTransfer\",$R:$R,0))","v":{"$error":"#N/A"}},null,null,null,null,null,null,null,null,null,"Missing imm docs, under 18--need parent form",null,null,"RegistrationRestrictions",{"$f":"INDEX('My Students'!$2:$16,MATCH($S$1,'My Students'!$B$2:$B$16,0),MATCH(R29,'My Students'!$2:$2,0))","v":{"$error":"#N/A"}}]
[null,null,null,"First Generation",{"$f":"INDEX($S:$S,MATCH(\"1stGen\",$R:$R,0))","v":{"$error":"#N/A"}},null,"Course Types",null,null,null,null,null,null,null,null,null,null,"MissingChecklistItems",{"$f":"INDEX('My Students'!$2:$16,MATCH($S$1,'My Students'!$B$2:$B$16,0),MATCH(R30,'My Students'!$2:$2,0))","v":{"$error":"#N/A"}}]
["Want to add a link to the student's folder? ",null,null,null,null,null,null,null,"Prescribeds",null,null,null,null,"Holds","SOAHOLD, Customs chart--\"Factors\"",null,null,"AdmissionDecision",{"$f":"INDEX('My Students'!$2:$16,MATCH($S$1,'My Students'!$B$2:$B$16,0),MATCH(R31,'My Students'!$2:$2,0))","v":{"$error":"#N/A"}}]
["--Click on the \"Stu folder\" field above (B21).",null,null,null,null,null,null,null,"Check RLC options",null,null,null,null,null,null,null,null,"TermDesc",{"$f":"INDEX('My Students'!$2:$16,MATCH($S$1,'My Students'!$B$2:$B$16,0),MATCH(R32,'My Students'!$2:$2,0))","v":{"$error":"#N/A"}}]
["--Control-K to start the process of creating a link.",null,null,null,null,null,null,null,"Honors",null,null,null,null,null,null,null,null,"DateofBirth",{"$f":"INDEX('My Students'!$2:$16,MATCH($S$1,'My Students'!$B$2:$B$16,0),MATCH(R33,'My Students'!$2:$2,0))","v":{"$error":"#N/A"}}]
["--Browse to the student's folder.",null,null,null,null,null,null,null,"Pre-Nursing",null,null,null,null,null,null,null,null,"Notes",{"$f":"INDEX('My Students'!$2:$16,MATCH($S$1,'My Students'!$B$2:$B$16,0),MATCH(R34,'My Students'!$2:$2,0))","v":{"$error":"#N/A"}}]
["--Choose any file in the folder and double-click on it.",null,null,null,null,null,null,null,null,null,null,null,"Check Transcripts","Task","Where to find info / What to check",null,null,"MTSUEmail",{"$f":"INDEX('My Students'!$2:$16,MATCH($S$1,'My Students'!$B$2:$B$16,0),MATCH(R35,'My Students'!$2:$2,0))","v":{"$error":"#N/A"}}]
["--In the Address box, delete the file name (back to the \\ after the folder name).",null,null,null,null,null,null,null,null,null,null,null,null,"Prior schools","Banner: SOAPCOL / Pipeline: Prior College Info",null,null,"PersonalEmail",{"$f":"INDEX('My Students'!$2:$16,MATCH($S$1,'My Students'!$B$2:$B$16,0),MATCH(R36,'My Students'!$2:$2,0))","v":{"$error":"#N/A"}}]
["--Click OK.",null,null,null,null,null,"Major-Specific",null,null,null,null,null,null,null,null,null,null,"PermPhone",{"$f":"INDEX('My Students'!$2:$16,MATCH($S$1,'My Students'!$B$2:$B$16,0),MATCH(R37,'My Students'!$2:$2,0))","v":{"$error":"#N/A"}}]
["--Now you should see the path to the folder, underlined as a link.",null,null,null,null,null,null,null,null,null,null,null,null,null,null,null,null,"MailingPhone",{"$f":"INDEX('My Students'!$2:$16,MATCH($S$1,'My Students'!$B$2:$B$16,0),MATCH(R38,'My Students'!$2:$2,0))","v":{"$error":"#N/A"}}]
["--When you click on your link, the folder should open in a separate window.",null,null,null,null,null,null,null,null,null,null,null,null,"Missing classes/ transcripts","BDMS (Banner: SAAADMS, click search icon) / Pline: Transfer Eval / Ask stu in welcome email",null,null,"NursElig",{"$f":"INDEX('My Students'!$2:$16,MATCH($S$1,'My Students'!$B$2:$B$16,0),MATCH(R39,'My Students'!$2:$2,0))","v":{"$error":"#N/A"}}]
[null,null,null,null,null,null,null,null,null,null,null,null,null,null,"FRs: AP, IB, DE, Dual Credit, Cambridge  /  TRs: Sems in progress or missing from MT transcript",null,null,"ACTMathScre",{"$f":"INDEX('My Students'!$2:$16,MATCH($S$1,'My Students'!$B$2:$B$16,0),MATCH(R40,'My Students'!$2:$2,0))","v":{"$error":"#N/A"}}]
[null,null,null,null,null,null,null,null,null,null,null,null,null,null,null,null,null,"ACTScienceScre",{"$f":"INDEX('My Students'!$2:$16,MATCH($S$1,'My Students'!$B$2:$B$16,0),MATCH(R41,'My Students'!$2:$2,0))","v":{"$error":"#N/A"}}]
[null,null,null,null,null,null,null,null,null,null,null,null,null,"Subs needed","By comparing transcript, transfer eval, & UD form.  Use TES for course descriptions.",null,null,"A&P?",{"$f":"IF(S1<>\"\",IF(OR(AND(S40=21,S41>21),AND(S40>21,S41=21)),\"maybe\",IF(AND(S31>=21,S41>=21),\"Y\",\"N\")),\"\")","v":{"$error":"#N/A"}}]
[null,null,null,null,null,null,null,null,null,null,null,null,null,null,"Any classes that might/should count but aren't?",null,null,"Major by Look-up",{"$f":"INDEX('Data Lists'!B:B,MATCH(S24,'Data Lists'!A:A,0))","v":{"$error":"#N/A"}}]
[null,null,null,null,null,null,"Notes:",null,null,null,null,null,null,null,null,null,null,"NameM#",{"$f":"CONCATENATE(S47,\", \",S46,\" \",S45)","v":{"$error":"#N/A"}}]
[null,null,null,null,null,null,null,null,null,null,null,null,"Pre-Customs Task Guide--Page 2",null,null,null,null,"M# copy",{"$f":"S1","v":0}]
[null,null,null,null,null,null,null,null,null,null,null,null,"Specific Course Types","Task","Where to find info / What to check",null,null,"Fname",{"$f":"IF(1<>\"\",IFERROR(MID(S9,SEARCH(\" \",S9,1)+1,SEARCH(\" \",S9,SEARCH(\" \",S9,1)+1)-SEARCH(\" \",S9,1)-1),MID(S9,FIND(\" \",S9)+1,256)),\"\")","v":{"$error":"#N/A"}}]
[null,null,null,null,null,null,null,null,null,null,null,null,null,"Prescribeds","Compare SZAADEF and SOATEST scores",null,null,"Lname",{"$f":"IF(S1<>\"\",CONCATENATE(LEFT(S9,FIND(\", \",S9,1)-1)),\"\")","v":{"$error":"#N/A"}}]
[null,null,null,null,null,null,null,null,null,null,null,null,null,null,"Do they match? What K classes are required?  (\"SAILS Math\"=1010 or 1530 non-K or 1710K)"]
[null,null,null,null,null,null,"Post-Customs To-Do List",null,null,{"$f":"CONCATENATE($B$2,\" (\",$B$3,\")\")","v":{"$error":"#N/A"}}]
[null,null,null,null,null,null,"General",null,null,null,null,null,null,"Check RLC options","Based on class list"]
[null,null,null,null,null,null,null,null,"Assign advisor in Banner",null,null,null,null,null,"Must use for students who need READ 1000K/HIST 2020. May recommend for other students."]
[null,null,null,null,null,null,null,null,"Submit appointment report"]
[null,null,null,null,null,null,null,null,null,null,null,null,null,"Honors","Customs chart--\"Factors\" box"]
[null,null,null,null,null,null,null,null,null,null,null,null,null,null,"Is the student eligible to take honors classes? If TR, email Judy Albakry to add honors code."]
[]
[null,null,null,null,null,null,null,null,null,null,null,null,null,"Pre-Nursing","Customs chart--\"Factors\" box"]
[null,null,null,null,null,null,"Special Pops",null,null,null,null,null,null,null,"Do they need different gen eds for PREN vs major?"]
[null,null,null,null,null,null,null,null,"Vet benefits"]
[null,null,null,null,null,null,null,null,"Submit change of major form"]
[null,null,null,null,null,null,null,null,"Send follow-up emails, if needed",null,null,null,"Major-Specific Checks","Task","Where to find info / What to check"]
[null,null,null,null,null,null,null,null,null,null,null,null,null,"Check advising folder","Should have UD form, Reg checklist, anything else specific to major"]
[]
[]
[null,null,null,null,null,null,"Notes:"]
[]
[]
["Copy-Pastes & Folder Links",null,null,"MTSUEmail",{"$f":"B4","v":{"$error":"#N/A"}}]
[{"$f":"A19","v":{"$error":"#N/A"}},{"$f":"$S$1","v":0},null,"PersonalEmail",{"$f":"B5","v":{"$error":"#N/A"}}]
[{"$f":"A20","v":{"$error":"#N/A"}},{"$f":"B20","v":{"$error":"#N/A"}},null,"CustomsPOS",{"$f":"E7","v":{"$error":"#N/A"}}]
["Major name",{"$f":"B21","v":{"$error":"#N/A"}},null,null,{"$f":"E8","v":{"$error":"#N/A"}}]
["Folder name",{"$error":"#N/A"},null,"BannerPOS",{"$f":"E9","v":{"$error":"#N/A"}}]
["Dept folders",{"$f":"HYPERLINK(B24)","v":{"$error":"#N/A"}},null,"Majors match?",{"$f":"E10","v":{"$error":"#N/A"}}]
["Stu folder",{"$f":"HYPERLINK(B25)","v":""},null,"Override major",{"$f":"E11","v":0}]
[null,null,null,"Might need BUAF",{"$f":"E28","v":{"$error":"#N/A"}},null,null,null,null,null,null,null,"Post-Customs Task Guide"]
[null,null,null,null,null,null,null,null,null,null,null,null,"General","Task","Where to find info / What to check"]
["Start",null,null,"Change major",null,null,null,null,null,null,null,null,null,"Assign advisor in Banner","SGAADVR"]
["Stop",null,null,"Notes for advisor",null,null,null,null,null,null,null,null,null,null,"Our type is COLL; We generally are the primary advisor."]
[]
[null,"Report Builder",null,null,"Student Message Builder",null,null,null,null,null,null,null,null,"Submit appointment report","Navigate (SSC)"]
["Registered",null,"see below","Docs attached",null,"x (to say that you've attached docs for the student)"]
["Attaching Scan",null,"x","Drop/Add info",null,"x (to give info on switching classes & steps to do so)"]
["Submitted COM",null,"x","Acad success tips",null,"x (to give acad tips, tutoring & SI websites, & \"ask for help\")"]
["Supp Instructn",null,"x","NURS Info Session",null,"x (to refer student to nursing info webpage and session)",null,null,null,null,null,null,"Special Pops","Task","Where to find info / What to check"]
["RTTP",null,"x","Check phone #",null,"x (to tell stu their listed ph #s are wrong, & how to fix)",null,null,null,null,null,null,null,"Vet benefits","Submit BUAF"]
["Note 1",null,"x","Advisor info",{"$f":"INDEX('Data Lists'!$J:$J,MATCH($B$12,'Data Lists'!$H:$H,0))","v":{"$error":"#N/A"}},"(leave formula, or type \"me <email>\")",null,null,null,null,null,null,null,null,"Form: Z:> Advising> Advising Forms> \"VA Benefit User Adv Form\"; Submit: V drive along w/ UD form"]
["Other",null,"[notes]","Other",null,"[type any notes to student]"]
["Paste in advising report:",{"$f":"CONCATENATE(\"Student came for advising during Customs.\",IF(B81<>\"\",\"  Attaching scanned copy of notes.\",\"\"),IF(B80=\"a\",Messages!$C$2,IF(B80=\"b\",Messages!$C$3,IF(B80<>\"\",CONCATENATE(\"  Registered student for classes for upcoming semester: \",B80),\"\"))),IF(B86<>\"\",CONCATENATE(\"\n\n\",B86),\"\"),IF(B82<>\"\",\"\n\nSubmitted change of major form. \",\"\"),IF(B83<>\"\",Messages!$C$4,\"\"),IF(B84<>\"\",Messages!$C$5,\"\"),IF(B85<>\"\",Messages!$C$6,\"\"))","v":"Student came for advising during Customs."},null,"Paste in stu msg:",{"$f":"CONCATENATE(\"We enjoyed seeing you at the CBHS Advising Center Customs session today, \",$A$21,\"!  \",IF(E80=\"x\",\"I've attached your Registration Checklist, for your records.\",\"\"),IF(E86<>\"\",CONCATENATE(\"\n\n\",E86),\"\"),IF(E81=\"x\",CONCATENATE(Messages!$C$7&E85&\", before making changes.\"),\"\"),IF(E84=\"x\",Messages!$C$10,\"\"),IF(E82=\"x\",Messages!$C$8,\"\"),IF(E83<>\"\",Messages!$C$9,\"\"),CONCATENATE(\"\n\nIf you have any questions or concerns, please contact \"&E85&\".  You'll also want to plan to come in for an advising appointment around mid-terms each semester, to talk about your classes for the upcoming term.  You can find Instructions and Schedule links at mtsu.edu/cbhsadv. \"),\"\n\nWe look forward to seeing you at MTSU this semester!\n\n\",$B$2,\"\n\",$B$3)","v":{"$error":"#N/A"}},null,null,null,null,null,null,null,null,"Submit change of major form","(If applicable)  Pipeline > Bottom of Advisor menu"]
["\"Registered\" choices: \"a\" to get message re stu registering in lab, \"b\" to get message re helping stu register in office, or type list of classes to be inserted."]
[]
["This is what it will say:",null,null,"This is what it will say:",null,null,null,null,null,null,null,null,null,"Send follow-up emails","(if needed)"]
[{"$f":"B87","v":"Student came for advising during Customs."},null,null,{"$f":"E87","v":{"$error":"#N/A"}},null,null,null,null,null,null,null,null,null,null,"e.g., To new advisor if student changed major during advising session"]

{"sheet":"11","index":12,"n_rows":91,"n_cols":20,"rows_kept":91,"cut":false,"hidden":false,"merged":[[90,0,114,1],[90,3,114,4],[1,6,6,6],[2,9,5,9],[2,12,12,12],[14,0,15,0],[14,1,15,1],[14,3,15,3],[14,4,15,4],[15,6,20,6],[82,12,91,12],[74,12,80,12],[2,13,3,13],[5,13,6,13],[8,6,13,6],[8,13,9,13],[9,9,12,9],[11,13,12,13],[16,13,17,13],[19,13,20,13],[22,6,27,6],[22,13,23,13],[23,9,26,9],[26,12,32,12],[27,13,28,13],[29,6,34,6],[30,9,33,9],[30,13,31,13],[15,12,24,12],[16,9,19,9],[34,12,43,12],[35,13,36,13],[36,6,41,6],[37,9,40,9],[38,13,39,13],[41,13,42,13],[44,6,47,10],[45,12,57,12],[46,13,47,13],[49,6,54,6],[49,13,50,13],[50,9,53,9],[52,13,53,13],[55,13,56,13],[56,6,61,6],[57,9,60,9],[59,12,71,12],[60,13,61,13],[63,13,64,13],[64,6,68,10],[83,13,84,13],[86,13,87,13],[89,13,90,13],[66,13,67,13],[69,13,70,13],[75,13,76,13],[78,13,79,13]]}
["Contact & Demographic Info",null,null,"Academic Info",null,null,"Pre-Customs To-Do List",null,null,{"$f":"CONCATENATE($B$2,\" (\",$B$3,\")\"&\", \"&B21)","v":{"$error":"#N/A"}},null,null,"Pre-Customs Task Guide",null,null,null,null,"M#",{"$f":"'My Students'!B13","v":0}]
["Name",{"$f":"CONCATENATE(A20,\" \",B20)","v":{"$error":"#N/A"}},null,"Transferred hours",{"$f":"INDEX($S:$S,MATCH(\"HrsEarned\",$R:$R,0))","v":{"$error":"#N/A"}},null,"General",null,null,null,null,null,null,"Task","Where to find info / What to check",null,null,"Deleted",{"$f":"INDEX('My Students'!$2:$16,MATCH($S$1,'My Students'!$B$2:$B$16,0),MATCH(R2,'My Students'!$2:$2,0))","v":{"$error":"#N/A"}}]
["M#",{"$f":"S1","v":0},null,"HS GPA",{"$f":"INDEX($S:$S,MATCH(\"HighSchoolGPA\",$R:$R,0))","v":{"$error":"#N/A"}},null,null,null,"Make stu folder in Z drive",null,null,null,"General","Make stu folder in Z drive","Naming scheme: <major> <conc> <last>, <first> <M#>",null,null,"SAcad",{"$f":"INDEX('My Students'!$2:$16,MATCH($S$1,'My Students'!$B$2:$B$16,0),MATCH(R3,'My Students'!$2:$2,0))","v":{"$error":"#N/A"}}]
["MTSUEmail",{"$f":"INDEX($S:$S,MATCH(A4,$R:$R,0))","v":{"$error":"#N/A"}},null,"Inclusive GPA",{"$f":"INDEX($S:$S,MATCH(\"InclusiveGPA\",$R:$R,0))","v":{"$error":"#N/A"}},null,null,null,"Check admit term",null,null,null,null,null,"e.g., CRJU LAEN Smith, John M01234567",null,null,"VetOrDep",{"$f":"INDEX('My Students'!$2:$16,MATCH($S$1,'My Students'!$B$2:$B$16,0),MATCH(R4,'My Students'!$2:$2,0))","v":{"$error":"#N/A"}}]
["PersonalEmail",{"$f":"INDEX($S:$S,MATCH(A5,$R:$R,0))","v":{"$error":"#N/A"}},null,"ACT Math",{"$f":"INDEX($S:$S,MATCH(\"ACTMathScre\",$R:$R,0))","v":{"$error":"#N/A"}},null,null,null,"Major",null,null,null,null,null,null,null,null,"PREN",{"$f":"INDEX('My Students'!$2:$16,MATCH($S$1,'My Students'!$B$2:$B$16,0),MATCH(R5,'My Students'!$2:$2,0))","v":{"$error":"#N/A"}}]
["PermPhone",{"$f":"INDEX($S:$S,MATCH(A6,$R:$R,0))","v":{"$error":"#N/A"}},null,"ACT Science",{"$f":"INDEX($S:$S,MATCH(\"ACTScienceScre\",$R:$R,0))","v":{"$error":"#N/A"}},null,null,null,"Acad standing (TRs only)",null,null,null,null,"Check admit term","SAAADMS, Customs chart--\"Flags\"",null,null,"1stGen",{"$f":"INDEX('My Students'!$2:$16,MATCH($S$1,'My Students'!$B$2:$B$16,0),MATCH(R6,'My Students'!$2:$2,0))","v":{"$error":"#N/A"}}]
["MailingPhone",{"$f":"INDEX($S:$S,MATCH(A7,$R:$R,0))","v":{"$error":"#N/A"}},null,"CustomsPOS",{"$f":"INDEX($S:$S,MATCH(D7,$R:$R,0))","v":{"$error":"#N/A"}},null,null,null,null,null,null,null,null,null,"If summer: Verify w/ stu before Customs",null,null,"ReverseTransfer",{"$f":"INDEX('My Students'!$2:$16,MATCH($S$1,'My Students'!$B$2:$B$16,0),MATCH(R7,'My Students'!$2:$2,0))","v":{"$error":"#N/A"}}]
[null,null,null,null,{"$f":"INDEX($S:$S,MATCH(\"Major\",$R:$R,0))","v":{"$error":"#N/A"}},null,null,null,null,null,null,null,null,null,null,null,null,"FR/TR",{"$f":"INDEX('My Students'!$2:$16,MATCH($S$1,'My Students'!$B$2:$B$16,0),MATCH(R8,'My Students'!$2:$2,0))","v":{"$error":"#N/A"}}]
["Customs Info",null,null,"BannerPOS",{"$f":"INDEX($S:$S,MATCH(D9,$R:$R,0))","v":{"$error":"#N/A"}},null,"Special Pops",null,null,null,null,null,null,"Major","SGASTDN, Customs chart--\"Academic\" (& updates from stu)",null,null,"StudentName",{"$f":"INDEX('My Students'!$2:$16,MATCH($S$1,'My Students'!$B$2:$B$16,0),MATCH(R9,'My Students'!$2:$2,0))","v":{"$error":"#N/A"}}]
["CountrySlot",{"$f":"INDEX(S:S,MATCH(A10,R:R,0))","v":{"$error":"#N/A"}},null,"Majors match?",{"$f":"IF(AND(E11=\"\",E7=E9),\"Y\",\"N, Submit change of major\")","v":{"$error":"#N/A"}},null,null,null,"Vet benefits",null,null,null,null,null,null,null,null,"Major",{"$f":"INDEX('My Students'!$2:$16,MATCH($S$1,'My Students'!$B$2:$B$16,0),MATCH(R10,'My Students'!$2:$2,0))","v":{"$error":"#N/A"}}]
["Order/Time",{"$f":"CONCATENATE(INDEX(S:S,MATCH(A11,R:R,0)),\" (\",LEFT(S23,2),\")\")","v":{"$error":"#N/A"}},null,"Override major",null,null,null,null,"Student athlete",null,null,null,null,null,null,null,null,"Order/Time",{"$f":"INDEX('My Students'!$2:$16,MATCH($S$1,'My Students'!$B$2:$B$16,0),MATCH(R11,'My Students'!$2:$2,0))","v":{"$error":"#N/A"}}]
["Acad Advisor",{"$f":"INDEX($S:$S,MATCH(\"Assigned Advisor\",$R:$R,0))","v":{"$error":"#N/A"}},null,null,null,null,null,null,"Pre-Professional",null,null,null,null,"Acad standing (TRs only)","SHATERM, SAAADMS, Transcript",null,null,"PrescribedCrsMath",{"$f":"INDEX('My Students'!$2:$16,MATCH($S$1,'My Students'!$B$2:$B$16,0),MATCH(R12,'My Students'!$2:$2,0))","v":{"$error":"#N/A"}},{"$f":"IF(S12=\"college level\",\"n\",IF(S12=0,\"blank--check\",\"y\"))","v":{"$error":"#N/A"}}]
["Customs Advisor",{"$f":"INDEX($S:$S,MATCH(\"Customs Advisor\",$R:$R,0))","v":{"$error":"#N/A"}},null,"Factors in Choosing Classes",null,null,null,null,null,null,null,null,null,null,"Probation on SHATERM? Must take U2020, meet GPA reqs 1st sem.",null,null,"PrescribedCrsWriting",{"$f":"INDEX('My Students'!$2:$16,MATCH($S$1,'My Students'!$B$2:$B$16,0),MATCH(R13,'My Students'!$2:$2,0))","v":{"$error":"#N/A"}},{"$f":"IF(S13=\"college level\",\"n\",IF(S13=0,\"blank--check\",\"y\"))","v":{"$error":"#N/A"}}]
[null,null,null,"Honors",{"$f":"INDEX($S:$S,MATCH(\"HonorsElig\",$R:$R,0))","v":{"$error":"#N/A"}},null,null,null,null,null,null,null,null,null,null,null,null,"PrescribedCrsReading",{"$f":"INDEX('My Students'!$2:$16,MATCH($S$1,'My Students'!$B$2:$B$16,0),MATCH(R14,'My Students'!$2:$2,0))","v":{"$error":"#N/A"}},{"$f":"IF(S14=\"college level\",\"n\",IF(S14=0,\"blank--check\",\"y\"))","v":{"$error":"#N/A"}}]
["Emily's Notes",{"$f":"INDEX($S:$S,MATCH(\"Notes\",$R:$R,0))","v":{"$error":"#N/A"}},null,"Prescribeds",{"$f":"IF(AND(T12=\"n\",T13=\"n\",T14=\"n\"),\"\",\nCONCATENATE(\"Ks: \"&IF(T12=\"y\",S12,\"\")&IF(T13=\"y\",\", \",\"\")&IF(T12=\"blank--check\",\"Math--check; \",\"\")&\nIF(T13=\"y\",\"ENGL\",\"\")&IF(T14=\"y\",\", \",\"\")&IF(T13=\"blank--check\",\"Engl--check; \",\"\")&\nIF(T14=\"y\",\"READ\",\"\")&IF(T15=\"y\",\", \",\"\")&IF(T14=\"blank--check\",\"Read--check; \",\"\")&\nIF(T15=\"y\",\"U1010\",\"\")))","v":{"$error":"#N/A"}},null,null,null,null,null,null,null,null,null,null,null,null,"PrescribedCrsStudySkills",{"$f":"INDEX('My Students'!$2:$16,MATCH($S$1,'My Students'!$B$2:$B$16,0),MATCH(R15,'My Students'!$2:$2,0))","v":{"$error":"#N/A"}},{"$f":"IF((T12<>\"n\")+(T13=\"y\")+(T14=\"y\")>=2,\"y\",\"n\")","v":{"$error":"#N/A"}}]
[null,null,null,null,null,null,"Reg Issues",null,null,null,null,null,"Special Pops","Task","Where to find info / What to check",null,null,"HonorsElig",{"$f":"INDEX('My Students'!$2:$16,MATCH($S$1,'My Students'!$B$2:$B$16,0),MATCH(R16,'My Students'!$2:$2,0))","v":{"$error":"#N/A"}}]
[null,null,null,"Scholars Acad",{"$f":"INDEX($S:$S,MATCH(\"Sacad\",$R:$R,0))","v":{"$error":"#N/A"}},null,null,null,"Immunization issues?",null,null,null,null,"Vet benefits","SAAQUAN, SGASTDN, SPAIDEN, Customs chart--\"Flags\", ask student",null,null,"ACTEngl",{"$f":"INDEX('My Students'!$2:$16,MATCH($S$1,'My Students'!$B$2:$B$16,0),MATCH(R17,'My Students'!$2:$2,0))","v":{"$error":"#N/A"}}]
["Copy-Pastes & Folder Links",null,null,"Pre-Nursing",{"$f":"INDEX($S:$S,MATCH(\"PREN\",$R:$R,0))","v":{"$error":"#N/A"}},null,null,null,"Holds",null,null,null,null,null,"Need a BUAF form?  (FYI: Flag on Customs list doesn't always mean getting vet benefits!!)",null,null,"HighSchoolGPA",{"$f":"INDEX('My Students'!$2:$16,MATCH($S$1,'My Students'!$B$2:$B$16,0),MATCH(R18,'My Students'!$2:$2,0))","v":{"$error":"#N/A"}}]
[{"$f":"INDEX(S:S,MATCH(\"StudentName\",R:R,0))","v":{"$error":"#N/A"}},{"$f":"S1","v":0},null,"ACTEngl",{"$f":"INDEX($S:$S,MATCH(\"ACTEngl\",$R:$R,0))","v":{"$error":"#N/A"}},null,null,null,null,null,null,null,null,null,null,null,null,"ACTCompositeScore",{"$f":"INDEX('My Students'!$2:$16,MATCH($S$1,'My Students'!$B$2:$B$16,0),MATCH(R19,'My Students'!$2:$2,0))","v":{"$error":"#N/A"}}]
[{"$f":"IFERROR(MID(A19,SEARCH(\" \",A19,1)+1,SEARCH(\" \",A19,SEARCH(\" \",A19,1)+1)-SEARCH(\" \",A19,1)-1),MID(A19,FIND(\" \",A19)+1,256))","v":{"$error":"#N/A"}},{"$f":"CONCATENATE(LEFT(A19,FIND(\", \",A19,1)-1))","v":{"$error":"#N/A"}},null,null,null,null,null,null,null,null,null,null,null,"Student athlete","SGASPRT (Also on main Customs spreadsheet but not sure if accurate)",null,null,"InclusiveGPA",{"$f":"INDEX('My Students'!$2:$16,MATCH($S$1,'My Students'!$B$2:$B$16,0),MATCH(R20,'My Students'!$2:$2,0))","v":{"$error":"#N/A"}}]
["Major name",{"$f":"CONCATENATE(IF(E11=\"\",INDEX('Data Lists'!$B:$B,MATCH($E$7,'Data Lists'!$A:$A,0)),CONCATENATE(INDEX('Data Lists'!$B:$B,MATCH($E$11,'Data Lists'!$B:$B,0))&IF(E18=\"Y\",\" (PREN)\")&\"\")))","v":{"$error":"#N/A"}},null,"Flags",null,null,null,null,null,null,null,null,null,null,"Stu meet with SAEC advisor; Scheduling challenges; Major changes approved through SAEC",null,null,"HrsEarned",{"$f":"INDEX('My Students'!$2:$16,MATCH($S$1,'My Students'!$B$2:$B$16,0),MATCH(R21,'My Students'!$2:$2,0))","v":{"$error":"#N/A"}}]
["Folder name",{"$f":"IF(E11=\"\",CONCATENATE(INDEX('Data Lists'!$E:$E,MATCH($E$7,'Data Lists'!$A:$A,0)),\" \",B20,\", \",A20,\" \",B3),CONCATENATE(INDEX('Data Lists'!$E:$E,MATCH($E$11,'Data Lists'!$B:$B,0)),\" \",B20,\", \",A20,\" \",B3))","v":{"$error":"#N/A"}},null,"Holds",{"$f":"INDEX($S:$S,MATCH(D22,$R:$R,0))","v":{"$error":"#N/A"}},null,null,null,null,null,null,null,null,null,null,null,null,"CountrySlot",{"$f":"INDEX('My Students'!$2:$16,MATCH($S$1,'My Students'!$B$2:$B$16,0),MATCH(R22,'My Students'!$2:$2,0))","v":{"$error":"#N/A"}}]
["Dept folders",{"$f":"HYPERLINK(CONCATENATE(\"Z:\\CoBHS Advising\\Departments\\\",IF(E11=\"\",INDEX('Data Lists'!D:D,MATCH(E7,'Data Lists'!A:A,0)),INDEX('Data Lists'!D:D,MATCH(E11,'Data Lists'!B:B,0))),\"\\Student Forms\\\"))","v":{"$error":"#N/A"}},null,"Reg Restrictions",{"$f":"INDEX($S:$S,MATCH(\"RegistrationRestrictions\",$R:$R,0))","v":{"$error":"#N/A"}},null,"Transcripts",null,null,null,null,null,null,"Pre-Professional","May not know until stu or CBAS reports to us; ask in welcome email!",null,null,"CUSTOMSGrp",{"$f":"INDEX('My Students'!$2:$16,MATCH($S$1,'My Students'!$B$2:$B$16,0),MATCH(R23,'My Students'!$2:$2,0))","v":{"$error":"#N/A"}}]
["Stu folder",{"$f":"HYPERLINK(CONCATENATE(\"Z:\\CoBHS Advising\\Departments\\\",IF(E11=\"\",INDEX('Data Lists'!D:D,MATCH(E7,'Data Lists'!A:A,0)),INDEX('Data Lists'!D:D,MATCH(E11,'Data Lists'!B:B,0))),\"\\Student Forms\\\",B22))","v":{"$error":"#N/A"}},null,"Immunizations",{"$f":"INDEX($S:$S,MATCH(\"RegistrationRestrictions\",$R:$R,0))","v":{"$error":"#N/A"}},null,null,null,"Prior schools",null,null,null,null,null,"Provide Pre-Prof info packet and info session flyer",null,null,"CustomsPOS",{"$f":"INDEX('My Students'!$2:$16,MATCH($S$1,'My Students'!$B$2:$B$16,0),MATCH(R24,'My Students'!$2:$2,0))","v":{"$error":"#N/A"}}]
[null,null,{"$f":"YEARFRAC(S33,NOW())","v":{"$error":"#N/A"}},"Under 18 & Imm",{"$f":"IF(C25>=18,\"OK--over 18\",\"If need imms, will need parent sig\")","v":{"$error":"#N/A"}},null,null,null,"Missing classes/transcripts",null,null,null,null,null,null,null,null,"BannerPOS",{"$f":"INDEX('My Students'!$2:$16,MATCH($S$1,'My Students'!$B$2:$B$16,0),MATCH(R25,'My Students'!$2:$2,0))","v":{"$error":"#N/A"}}]
[null,null,null,"Missing Items",{"$f":"INDEX($S:$S,MATCH(\"MissingChecklistItems\",$R:$R,0))","v":{"$error":"#N/A"}},null,null,null,"Subs needed",null,null,null,null,null,null,null,null,"Assigned Advisor",{"$f":"INDEX('My Students'!$2:$16,MATCH($S$1,'My Students'!$B$2:$B$16,0),MATCH(R26,'My Students'!$2:$2,0))","v":{"$error":"#N/A"}}]
[null,null,null,"Term",{"$f":"INDEX($S:$S,MATCH(\"TermDesc\",$R:$R,0))","v":{"$error":"#N/A"}},null,null,null,null,null,null,null,"Reg Issues","Task","Where to find info / What to check",null,null,"Customs Advisor",{"$f":"INDEX('My Students'!$2:$16,MATCH($S$1,'My Students'!$B$2:$B$16,0),MATCH(R27,'My Students'!$2:$2,0))","v":{"$error":"#N/A"}}]
[null,null,null,"Might need BUAF",{"$f":"INDEX($S:$S,MATCH(\"VetOrDep\",$R:$R,0))","v":{"$error":"#N/A"}},null,null,null,null,null,null,null,null,"Immunization issues?","Banner: SZAITRK",null,null,"Holds",{"$f":"INDEX('My Students'!$2:$16,MATCH($S$1,'My Students'!$B$2:$B$16,0),MATCH(R28,'My Students'!$2:$2,0))","v":{"$error":"#N/A"}}]
[null,null,null,"Reverse Transfer",{"$f":"INDEX($S:$S,MATCH(\"ReverseTransfer\",$R:$R,0))","v":{"$error":"#N/A"}},null,null,null,null,null,null,null,null,null,"Missing imm docs, under 18--need parent form",null,null,"RegistrationRestrictions",{"$f":"INDEX('My Students'!$2:$16,MATCH($S$1,'My Students'!$B$2:$B$16,0),MATCH(R29,'My Students'!$2:$2,0))","v":{"$error":"#N/A"}}]
[null,null,null,"First Generation",{"$f":"INDEX($S:$S,MATCH(\"1stGen\",$R:$R,0))","v":{"$error":"#N/A"}},null,"Course Types",null,null,null,null,null,null,null,null,null,null,"MissingChecklistItems",{"$f":"INDEX('My Students'!$2:$16,MATCH($S$1,'My Students'!$B$2:$B$16,0),MATCH(R30,'My Students'!$2:$2,0))","v":{"$error":"#N/A"}}]
["Want to add a link to the student's folder? ",null,null,null,null,null,null,null,"Prescribeds",null,null,null,null,"Holds","SOAHOLD, Customs chart--\"Factors\"",null,null,"AdmissionDecision",{"$f":"INDEX('My Students'!$2:$16,MATCH($S$1,'My Students'!$B$2:$B$16,0),MATCH(R31,'My Students'!$2:$2,0))","v":{"$error":"#N/A"}}]
["--Click on the \"Stu folder\" field above (B21).",null,null,null,null,null,null,null,"Check RLC options",null,null,null,null,null,null,null,null,"TermDesc",{"$f":"INDEX('My Students'!$2:$16,MATCH($S$1,'My Students'!$B$2:$B$16,0),MATCH(R32,'My Students'!$2:$2,0))","v":{"$error":"#N/A"}}]
["--Control-K to start the process of creating a link.",null,null,null,null,null,null,null,"Honors",null,null,null,null,null,null,null,null,"DateofBirth",{"$f":"INDEX('My Students'!$2:$16,MATCH($S$1,'My Students'!$B$2:$B$16,0),MATCH(R33,'My Students'!$2:$2,0))","v":{"$error":"#N/A"}}]
["--Browse to the student's folder.",null,null,null,null,null,null,null,"Pre-Nursing",null,null,null,null,null,null,null,null,"Notes",{"$f":"INDEX('My Students'!$2:$16,MATCH($S$1,'My Students'!$B$2:$B$16,0),MATCH(R34,'My Students'!$2:$2,0))","v":{"$error":"#N/A"}}]
["--Choose any file in the folder and double-click on it.",null,null,null,null,null,null,null,null,null,null,null,"Check Transcripts","Task","Where to find info / What to check",null,null,"MTSUEmail",{"$f":"INDEX('My Students'!$2:$16,MATCH($S$1,'My Students'!$B$2:$B$16,0),MATCH(R35,'My Students'!$2:$2,0))","v":{"$error":"#N/A"}}]
["--In the Address box, delete the file name (back to the \\ after the folder name).",null,null,null,null,null,null,null,null,null,null,null,null,"Prior schools","Banner: SOAPCOL / Pipeline: Prior College Info",null,null,"PersonalEmail",{"$f":"INDEX('My Students'!$2:$16,MATCH($S$1,'My Students'!$B$2:$B$16,0),MATCH(R36,'My Students'!$2:$2,0))","v":{"$error":"#N/A"}}]
["--Click OK.",null,null,null,null,null,"Major-Specific",null,null,null,null,null,null,null,null,null,null,"PermPhone",{"$f":"INDEX('My Students'!$2:$16,MATCH($S$1,'My Students'!$B$2:$B$16,0),MATCH(R37,'My Students'!$2:$2,0))","v":{"$error":"#N/A"}}]
["--Now you should see the path to the folder, underlined as a link.",null,null,null,null,null,null,null,null,null,null,null,null,null,null,null,null,"MailingPhone",{"$f":"INDEX('My Students'!$2:$16,MATCH($S$1,'My Students'!$B$2:$B$16,0),MATCH(R38,'My Students'!$2:$2,0))","v":{"$error":"#N/A"}}]
["--When you click on your link, the folder should open in a separate window.",null,null,null,null,null,null,null,null,null,null,null,null,"Missing classes/ transcripts","BDMS (Banner: SAAADMS, click search icon) / Pline: Transfer Eval / Ask stu in welcome email",null,null,"NursElig",{"$f":"INDEX('My Students'!$2:$16,MATCH($S$1,'My Students'!$B$2:$B$16,0),MATCH(R39,'My Students'!$2:$2,0))","v":{"$error":"#N/A"}}]
[null,null,null,null,null,null,null,null,null,null,null,null,null,null,"FRs: AP, IB, DE, Dual Credit, Cambridge  /  TRs: Sems in progress or missing from MT transcript",null,null,"ACTMathScre",{"$f":"INDEX('My Students'!$2:$16,MATCH($S$1,'My Students'!$B$2:$B$16,0),MATCH(R40,'My Students'!$2:$2,0))","v":{"$error":"#N/A"}}]
[null,null,null,null,null,null,null,null,null,null,null,null,null,null,null,null,null,"ACTScienceScre",{"$f":"INDEX('My Students'!$2:$16,MATCH($S$1,'My Students'!$B$2:$B$16,0),MATCH(R41,'My Students'!$2:$2,0))","v":{"$error":"#N/A"}}]
[null,null,null,null,null,null,null,null,null,null,null,null,null,"Subs needed","By comparing transcript, transfer eval, & UD form.  Use TES for course descriptions.",null,null,"A&P?",{"$f":"IF(S1<>\"\",IF(OR(AND(S40=21,S41>21),AND(S40>21,S41=21)),\"maybe\",IF(AND(S31>=21,S41>=21),\"Y\",\"N\")),\"\")","v":{"$error":"#N/A"}}]
[null,null,null,null,null,null,null,null,null,null,null,null,null,null,"Any classes that might/should count but aren't?",null,null,"Major by Look-up",{"$f":"INDEX('Data Lists'!B:B,MATCH(S24,'Data Lists'!A:A,0))","v":{"$error":"#N/A"}}]
[null,null,null,null,null,null,"Notes:",null,null,null,null,null,null,null,null,null,null,"NameM#",{"$f":"CONCATENATE(S47,\", \",S46,\" \",S45)","v":{"$error":"#N/A"}}]
[null,null,null,null,null,null,null,null,null,null,null,null,"Pre-Customs Task Guide--Page 2",null,null,null,null,"M# copy",{"$f":"S1","v":0}]
[null,null,null,null,null,null,null,null,null,null,null,null,"Specific Course Types","Task","Where to find info / What to check",null,null,"Fname",{"$f":"IF(1<>\"\",IFERROR(MID(S9,SEARCH(\" \",S9,1)+1,SEARCH(\" \",S9,SEARCH(\" \",S9,1)+1)-SEARCH(\" \",S9,1)-1),MID(S9,FIND(\" \",S9)+1,256)),\"\")","v":{"$error":"#N/A"}}]
[null,null,null,null,null,null,null,null,null,null,null,null,null,"Prescribeds","Compare SZAADEF and SOATEST scores",null,null,"Lname",{"$f":"IF(S1<>\"\",CONCATENATE(LEFT(S9,FIND(\", \",S9,1)-1)),\"\")","v":{"$error":"#N/A"}}]
[null,null,null,null,null,null,null,null,null,null,null,null,null,null,"Do they match? What K classes are required?  (\"SAILS Math\"=1010 or 1530 non-K or 1710K)"]
[null,null,null,null,null,null,"Post-Customs To-Do List",null,null,{"$f":"CONCATENATE($B$2,\" (\",$B$3,\")\")","v":{"$error":"#N/A"}}]
[null,null,null,null,null,null,"General",null,null,null,null,null,null,"Check RLC options","Based on class list"]
[null,null,null,null,null,null,null,null,"Assign advisor in Banner",null,null,null,null,null,"Must use for students who need READ 1000K/HIST 2020. May recommend for other students."]
[null,null,null,null,null,null,null,null,"Submit appointment report"]
[null,null,null,null,null,null,null,null,null,null,null,null,null,"Honors","Customs chart--\"Factors\" box"]
[null,null,null,null,null,null,null,null,null,null,null,null,null,null,"Is the student eligible to take honors classes? If TR, email Judy Albakry to add honors code."]
[]
[null,null,null,null,null,null,null,null,null,null,null,null,null,"Pre-Nursing","Customs chart--\"Factors\" box"]
[null,null,null,null,null,null,"Special Pops",null,null,null,null,null,null,null,"Do they need different gen eds for PREN vs major?"]
[null,null,null,null,null,null,null,null,"Vet benefits"]
[null,null,null,null,null,null,null,null,"Submit change of major form"]
[null,null,null,null,null,null,null,null,"Send follow-up emails, if needed",null,null,null,"Major-Specific Checks","Task","Where to find info / What to check"]
[null,null,null,null,null,null,null,null,null,null,null,null,null,"Check advising folder","Should have UD form, Reg checklist, anything else specific to major"]
[]
[]
[null,null,null,null,null,null,"Notes:"]
[]
[]
["Copy-Pastes & Folder Links",null,null,"MTSUEmail",{"$f":"B4","v":{"$error":"#N/A"}}]
[{"$f":"A19","v":{"$error":"#N/A"}},{"$f":"$S$1","v":0},null,"PersonalEmail",{"$f":"B5","v":{"$error":"#N/A"}}]
[{"$f":"A20","v":{"$error":"#N/A"}},{"$f":"B20","v":{"$error":"#N/A"}},null,"CustomsPOS",{"$f":"E7","v":{"$error":"#N/A"}}]
["Major name",{"$f":"B21","v":{"$error":"#N/A"}},null,null,{"$f":"E8","v":{"$error":"#N/A"}}]
["Folder name",{"$error":"#N/A"},null,"BannerPOS",{"$f":"E9","v":{"$error":"#N/A"}}]
["Dept folders",{"$f":"HYPERLINK(B24)","v":{"$error":"#N/A"}},null,"Majors match?",{"$f":"E10","v":{"$error":"#N/A"}}]
["Stu folder",{"$f":"HYPERLINK(B25)","v":""},null,"Override major",{"$f":"E11","v":0}]
[null,null,null,"Might need BUAF",{"$f":"E28","v":{"$error":"#N/A"}},null,null,null,null,null,null,null,"Post-Customs Task Guide"]
[null,null,null,null,null,null,null,null,null,null,null,null,"General","Task","Where to find info / What to check"]
["Start",null,null,"Change major",null,null,null,null,null,null,null,null,null,"Assign advisor in Banner","SGAADVR"]
["Stop",null,null,"Notes for advisor",null,null,null,null,null,null,null,null,null,null,"Our type is COLL; We generally are the primary advisor."]
[]
[null,"Report Builder",null,null,"Student Message Builder",null,null,null,null,null,null,null,null,"Submit appointment report","Navigate (SSC)"]
["Registered",null,"see below","Docs attached",null,"x (to say that you've attached docs for the student)"]
["Attaching Scan",null,"x","Drop/Add info",null,"x (to give info on switching classes & steps to do so)"]
["Submitted COM",null,"x","Acad success tips",null,"x (to give acad tips, tutoring & SI websites, & \"ask for help\")"]
["Supp Instructn",null,"x","NURS Info Session",null,"x (to refer student to nursing info webpage and session)",null,null,null,null,null,null,"Special Pops","Task","Where to find info / What to check"]
["RTTP",null,"x","Check phone #",null,"x (to tell stu their listed ph #s are wrong, & how to fix)",null,null,null,null,null,null,null,"Vet benefits","Submit BUAF"]
["Note 1",null,"x","Advisor info",{"$f":"INDEX('Data Lists'!$J:$J,MATCH($B$12,'Data Lists'!$H:$H,0))","v":{"$error":"#N/A"}},"(leave formula, or type \"me <email>\")",null,null,null,null,null,null,null,null,"Form: Z:> Advising> Advising Forms> \"VA Benefit User Adv Form\"; Submit: V drive along w/ UD form"]
["Other",null,"[notes]","Other",null,"[type any notes to student]"]
["Paste in advising report:",{"$f":"CONCATENATE(\"Student came for advising during Customs.\",IF(B81<>\"\",\"  Attaching scanned copy of notes.\",\"\"),IF(B80=\"a\",Messages!$C$2,IF(B80=\"b\",Messages!$C$3,IF(B80<>\"\",CONCATENATE(\"  Registered student for classes for upcoming semester: \",B80),\"\"))),IF(B86<>\"\",CONCATENATE(\"\n\n\",B86),\"\"),IF(B82<>\"\",\"\n\nSubmitted change of major form. \",\"\"),IF(B83<>\"\",Messages!$C$4,\"\"),IF(B84<>\"\",Messages!$C$5,\"\"),IF(B85<>\"\",Messages!$C$6,\"\"))","v":"Student came for advising during Customs."},null,"Paste in stu msg:",{"$f":"CONCATENATE(\"We enjoyed seeing you at the CBHS Advising Center Customs session today, \",$A$21,\"!  \",IF(E80=\"x\",\"I've attached your Registration Checklist, for your records.\",\"\"),IF(E86<>\"\",CONCATENATE(\"\n\n\",E86),\"\"),IF(E81=\"x\",CONCATENATE(Messages!$C$7&E85&\", before making changes.\"),\"\"),IF(E84=\"x\",Messages!$C$10,\"\"),IF(E82=\"x\",Messages!$C$8,\"\"),IF(E83<>\"\",Messages!$C$9,\"\"),CONCATENATE(\"\n\nIf you have any questions or concerns, please contact \"&E85&\".  You'll also want to plan to come in for an advising appointment around mid-terms each semester, to talk about your classes for the upcoming term.  You can find Instructions and Schedule links at mtsu.edu/cbhsadv. \"),\"\n\nWe look forward to seeing you at MTSU this semester!\n\n\",$B$2,\"\n\",$B$3)","v":{"$error":"#N/A"}},null,null,null,null,null,null,null,null,"Submit change of major form","(If applicable)  Pipeline > Bottom of Advisor menu"]
["\"Registered\" choices: \"a\" to get message re stu registering in lab, \"b\" to get message re helping stu register in office, or type list of classes to be inserted."]
[]
["This is what it will say:",null,null,"This is what it will say:",null,null,null,null,null,null,null,null,null,"Send follow-up emails","(if needed)"]
[{"$f":"B87","v":"Student came for advising during Customs."},null,null,{"$f":"E87","v":{"$error":"#N/A"}},null,null,null,null,null,null,null,null,null,null,"e.g., To new advisor if student changed major during advising session"]

{"sheet":"12","index":13,"n_rows":91,"n_cols":20,"rows_kept":91,"cut":false,"hidden":false,"merged":[[90,0,114,1],[90,3,114,4],[1,6,6,6],[2,9,5,9],[2,12,12,12],[14,0,15,0],[14,1,15,1],[14,3,15,3],[14,4,15,4],[15,6,20,6],[82,12,91,12],[74,12,80,12],[2,13,3,13],[5,13,6,13],[8,6,13,6],[8,13,9,13],[9,9,12,9],[11,13,12,13],[16,13,17,13],[19,13,20,13],[22,6,27,6],[22,13,23,13],[23,9,26,9],[26,12,32,12],[27,13,28,13],[29,6,34,6],[30,9,33,9],[30,13,31,13],[15,12,24,12],[16,9,19,9],[34,12,43,12],[35,13,36,13],[36,6,41,6],[37,9,40,9],[38,13,39,13],[41,13,42,13],[44,6,47,10],[45,12,57,12],[46,13,47,13],[49,6,54,6],[49,13,50,13],[50,9,53,9],[52,13,53,13],[55,13,56,13],[56,6,61,6],[57,9,60,9],[59,12,71,12],[60,13,61,13],[63,13,64,13],[64,6,68,10],[83,13,84,13],[86,13,87,13],[89,13,90,13],[66,13,67,13],[69,13,70,13],[75,13,76,13],[78,13,79,13]]}
["Contact & Demographic Info",null,null,"Academic Info",null,null,"Pre-Customs To-Do List",null,null,{"$f":"CONCATENATE($B$2,\" (\",$B$3,\")\"&\", \"&B21)","v":{"$error":"#N/A"}},null,null,"Pre-Customs Task Guide",null,null,null,null,"M#",{"$f":"'My Students'!B14","v":0}]
["Name",{"$f":"CONCATENATE(A20,\" \",B20)","v":{"$error":"#N/A"}},null,"Transferred hours",{"$f":"INDEX($S:$S,MATCH(\"HrsEarned\",$R:$R,0))","v":{"$error":"#N/A"}},null,"General",null,null,null,null,null,null,"Task","Where to find info / What to check",null,null,"Deleted",{"$f":"INDEX('My Students'!$2:$16,MATCH($S$1,'My Students'!$B$2:$B$16,0),MATCH(R2,'My Students'!$2:$2,0))","v":{"$error":"#N/A"}}]
["M#",{"$f":"S1","v":0},null,"HS GPA",{"$f":"INDEX($S:$S,MATCH(\"HighSchoolGPA\",$R:$R,0))","v":{"$error":"#N/A"}},null,null,null,"Make stu folder in Z drive",null,null,null,"General","Make stu folder in Z drive","Naming scheme: <major> <conc> <last>, <first> <M#>",null,null,"SAcad",{"$f":"INDEX('My Students'!$2:$16,MATCH($S$1,'My Students'!$B$2:$B$16,0),MATCH(R3,'My Students'!$2:$2,0))","v":{"$error":"#N/A"}}]
["MTSUEmail",{"$f":"INDEX($S:$S,MATCH(A4,$R:$R,0))","v":{"$error":"#N/A"}},null,"Inclusive GPA",{"$f":"INDEX($S:$S,MATCH(\"InclusiveGPA\",$R:$R,0))","v":{"$error":"#N/A"}},null,null,null,"Check admit term",null,null,null,null,null,"e.g., CRJU LAEN Smith, John M01234567",null,null,"VetOrDep",{"$f":"INDEX('My Students'!$2:$16,MATCH($S$1,'My Students'!$B$2:$B$16,0),MATCH(R4,'My Students'!$2:$2,0))","v":{"$error":"#N/A"}}]
["PersonalEmail",{"$f":"INDEX($S:$S,MATCH(A5,$R:$R,0))","v":{"$error":"#N/A"}},null,"ACT Math",{"$f":"INDEX($S:$S,MATCH(\"ACTMathScre\",$R:$R,0))","v":{"$error":"#N/A"}},null,null,null,"Major",null,null,null,null,null,null,null,null,"PREN",{"$f":"INDEX('My Students'!$2:$16,MATCH($S$1,'My Students'!$B$2:$B$16,0),MATCH(R5,'My Students'!$2:$2,0))","v":{"$error":"#N/A"}}]
["PermPhone",{"$f":"INDEX($S:$S,MATCH(A6,$R:$R,0))","v":{"$error":"#N/A"}},null,"ACT Science",{"$f":"INDEX($S:$S,MATCH(\"ACTScienceScre\",$R:$R,0))","v":{"$error":"#N/A"}},null,null,null,"Acad standing (TRs only)",null,null,null,null,"Check admit term","SAAADMS, Customs chart--\"Flags\"",null,null,"1stGen",{"$f":"INDEX('My Students'!$2:$16,MATCH($S$1,'My Students'!$B$2:$B$16,0),MATCH(R6,'My Students'!$2:$2,0))","v":{"$error":"#N/A"}}]
["MailingPhone",{"$f":"INDEX($S:$S,MATCH(A7,$R:$R,0))","v":{"$error":"#N/A"}},null,"CustomsPOS",{"$f":"INDEX($S:$S,MATCH(D7,$R:$R,0))","v":{"$error":"#N/A"}},null,null,null,null,null,null,null,null,null,"If summer: Verify w/ stu before Customs",null,null,"ReverseTransfer",{"$f":"INDEX('My Students'!$2:$16,MATCH($S$1,'My Students'!$B$2:$B$16,0),MATCH(R7,'My Students'!$2:$2,0))","v":{"$error":"#N/A"}}]
[null,null,null,null,{"$f":"INDEX($S:$S,MATCH(\"Major\",$R:$R,0))","v":{"$error":"#N/A"}},null,null,null,null,null,null,null,null,null,null,null,null,"FR/TR",{"$f":"INDEX('My Students'!$2:$16,MATCH($S$1,'My Students'!$B$2:$B$16,0),MATCH(R8,'My Students'!$2:$2,0))","v":{"$error":"#N/A"}}]
["Customs Info",null,null,"BannerPOS",{"$f":"INDEX($S:$S,MATCH(D9,$R:$R,0))","v":{"$error":"#N/A"}},null,"Special Pops",null,null,null,null,null,null,"Major","SGASTDN, Customs chart--\"Academic\" (& updates from stu)",null,null,"StudentName",{"$f":"INDEX('My Students'!$2:$16,MATCH($S$1,'My Students'!$B$2:$B$16,0),MATCH(R9,'My Students'!$2:$2,0))","v":{"$error":"#N/A"}}]
["CountrySlot",{"$f":"INDEX(S:S,MATCH(A10,R:R,0))","v":{"$error":"#N/A"}},null,"Majors match?",{"$f":"IF(AND(E11=\"\",E7=E9),\"Y\",\"N, Submit change of major\")","v":{"$error":"#N/A"}},null,null,null,"Vet benefits",null,null,null,null,null,null,null,null,"Major",{"$f":"INDEX('My Students'!$2:$16,MATCH($S$1,'My Students'!$B$2:$B$16,0),MATCH(R10,'My Students'!$2:$2,0))","v":{"$error":"#N/A"}}]
["Order/Time",{"$f":"CONCATENATE(INDEX(S:S,MATCH(A11,R:R,0)),\" (\",LEFT(S23,2),\")\")","v":{"$error":"#N/A"}},null,"Override major",null,null,null,null,"Student athlete",null,null,null,null,null,null,null,null,"Order/Time",{"$f":"INDEX('My Students'!$2:$16,MATCH($S$1,'My Students'!$B$2:$B$16,0),MATCH(R11,'My Students'!$2:$2,0))","v":{"$error":"#N/A"}}]
["Acad Advisor",{"$f":"INDEX($S:$S,MATCH(\"Assigned Advisor\",$R:$R,0))","v":{"$error":"#N/A"}},null,null,null,null,null,null,"Pre-Professional",null,null,null,null,"Acad standing (TRs only)","SHATERM, SAAADMS, Transcript",null,null,"PrescribedCrsMath",{"$f":"INDEX('My Students'!$2:$16,MATCH($S$1,'My Students'!$B$2:$B$16,0),MATCH(R12,'My Students'!$2:$2,0))","v":{"$error":"#N/A"}},{"$f":"IF(S12=\"college level\",\"n\",IF(S12=0,\"blank--check\",\"y\"))","v":{"$error":"#N/A"}}]
["Customs Advisor",{"$f":"INDEX($S:$S,MATCH(\"Customs Advisor\",$R:$R,0))","v":{"$error":"#N/A"}},null,"Factors in Choosing Classes",null,null,null,null,null,null,null,null,null,null,"Probation on SHATERM? Must take U2020, meet GPA reqs 1st sem.",null,null,"PrescribedCrsWriting",{"$f":"INDEX('My Students'!$2:$16,MATCH($S$1,'My Students'!$B$2:$B$16,0),MATCH(R13,'My Students'!$2:$2,0))","v":{"$error":"#N/A"}},{"$f":"IF(S13=\"college level\",\"n\",IF(S13=0,\"blank--check\",\"y\"))","v":{"$error":"#N/A"}}]
[null,null,null,"Honors",{"$f":"INDEX($S:$S,MATCH(\"HonorsElig\",$R:$R,0))","v":{"$error":"#N/A"}},null,null,null,null,null,null,null,null,null,null,null,null,"PrescribedCrsReading",{"$f":"INDEX('My Students'!$2:$16,MATCH($S$1,'My Students'!$B$2:$B$16,0),MATCH(R14,'My Students'!$2:$2,0))","v":{"$error":"#N/A"}},{"$f":"IF(S14=\"college level\",\"n\",IF(S14=0,\"blank--check\",\"y\"))","v":{"$error":"#N/A"}}]
["Emily's Notes",{"$f":"INDEX($S:$S,MATCH(\"Notes\",$R:$R,0))","v":{"$error":"#N/A"}},null,"Prescribeds",{"$f":"IF(AND(T12=\"n\",T13=\"n\",T14=\"n\"),\"\",\nCONCATENATE(\"Ks: \"&IF(T12=\"y\",S12,\"\")&IF(T13=\"y\",\", \",\"\")&IF(T12=\"blank--check\",\"Math--check; \",\"\")&\nIF(T13=\"y\",\"ENGL\",\"\")&IF(T14=\"y\",\", \",\"\")&IF(T13=\"blank--check\",\"Engl--check; \",\"\")&\nIF(T14=\"y\",\"READ\",\"\")&IF(T15=\"y\",\", \",\"\")&IF(T14=\"blank--check\",\"Read--check; \",\"\")&\nIF(T15=\"y\",\"U1010\",\"\")))","v":{"$error":"#N/A"}},null,null,null,null,null,null,null,null,null,null,null,null,"PrescribedCrsStudySkills",{"$f":"INDEX('My Students'!$2:$16,MATCH($S$1,'My Students'!$B$2:$B$16,0),MATCH(R15,'My Students'!$2:$2,0))","v":{"$error":"#N/A"}},{"$f":"IF((T12<>\"n\")+(T13=\"y\")+(T14=\"y\")>=2,\"y\",\"n\")","v":{"$error":"#N/A"}}]
[null,null,null,null,null,null,"Reg Issues",null,null,null,null,null,"Special Pops","Task","Where to find info / What to check",null,null,"HonorsElig",{"$f":"INDEX('My Students'!$2:$16,MATCH($S$1,'My Students'!$B$2:$B$16,0),MATCH(R16,'My Students'!$2:$2,0))","v":{"$error":"#N/A"}}]
[null,null,null,"Scholars Acad",{"$f":"INDEX($S:$S,MATCH(\"Sacad\",$R:$R,0))","v":{"$error":"#N/A"}},null,null,null,"Immunization issues?",null,null,null,null,"Vet benefits","SAAQUAN, SGASTDN, SPAIDEN, Customs chart--\"Flags\", ask student",null,null,"ACTEngl",{"$f":"INDEX('My Students'!$2:$16,MATCH($S$1,'My Students'!$B$2:$B$16,0),MATCH(R17,'My Students'!$2:$2,0))","v":{"$error":"#N/A"}}]
["Copy-Pastes & Folder Links",null,null,"Pre-Nursing",{"$f":"INDEX($S:$S,MATCH(\"PREN\",$R:$R,0))","v":{"$error":"#N/A"}},null,null,null,"Holds",null,null,null,null,null,"Need a BUAF form?  (FYI: Flag on Customs list doesn't always mean getting vet benefits!!)",null,null,"HighSchoolGPA",{"$f":"INDEX('My Students'!$2:$16,MATCH($S$1,'My Students'!$B$2:$B$16,0),MATCH(R18,'My Students'!$2:$2,0))","v":{"$error":"#N/A"}}]
[{"$f":"INDEX(S:S,MATCH(\"StudentName\",R:R,0))","v":{"$error":"#N/A"}},{"$f":"S1","v":0},null,"ACTEngl",{"$f":"INDEX($S:$S,MATCH(\"ACTEngl\",$R:$R,0))","v":{"$error":"#N/A"}},null,null,null,null,null,null,null,null,null,null,null,null,"ACTCompositeScore",{"$f":"INDEX('My Students'!$2:$16,MATCH($S$1,'My Students'!$B$2:$B$16,0),MATCH(R19,'My Students'!$2:$2,0))","v":{"$error":"#N/A"}}]
[{"$f":"IFERROR(MID(A19,SEARCH(\" \",A19,1)+1,SEARCH(\" \",A19,SEARCH(\" \",A19,1)+1)-SEARCH(\" \",A19,1)-1),MID(A19,FIND(\" \",A19)+1,256))","v":{"$error":"#N/A"}},{"$f":"CONCATENATE(LEFT(A19,FIND(\", \",A19,1)-1))","v":{"$error":"#N/A"}},null,null,null,null,null,null,null,null,null,null,null,"Student athlete","SGASPRT (Also on main Customs spreadsheet but not sure if accurate)",null,null,"InclusiveGPA",{"$f":"INDEX('My Students'!$2:$16,MATCH($S$1,'My Students'!$B$2:$B$16,0),MATCH(R20,'My Students'!$2:$2,0))","v":{"$error":"#N/A"}}]
["Major name",{"$f":"CONCATENATE(IF(E11=\"\",INDEX('Data Lists'!$B:$B,MATCH($E$7,'Data Lists'!$A:$A,0)),CONCATENATE(INDEX('Data Lists'!$B:$B,MATCH($E$11,'Data Lists'!$B:$B,0))&IF(E18=\"Y\",\" (PREN)\")&\"\")))","v":{"$error":"#N/A"}},null,"Flags",null,null,null,null,null,null,null,null,null,null,"Stu meet with SAEC advisor; Scheduling challenges; Major changes approved through SAEC",null,null,"HrsEarned",{"$f":"INDEX('My Students'!$2:$16,MATCH($S$1,'My Students'!$B$2:$B$16,0),MATCH(R21,'My Students'!$2:$2,0))","v":{"$error":"#N/A"}}]
["Folder name",{"$f":"IF(E11=\"\",CONCATENATE(INDEX('Data Lists'!$E:$E,MATCH($E$7,'Data Lists'!$A:$A,0)),\" \",B20,\", \",A20,\" \",B3),CONCATENATE(INDEX('Data Lists'!$E:$E,MATCH($E$11,'Data Lists'!$B:$B,0)),\" \",B20,\", \",A20,\" \",B3))","v":{"$error":"#N/A"}},null,"Holds",{"$f":"INDEX($S:$S,MATCH(D22,$R:$R,0))","v":{"$error":"#N/A"}},null,null,null,null,null,null,null,null,null,null,null,null,"CountrySlot",{"$f":"INDEX('My Students'!$2:$16,MATCH($S$1,'My Students'!$B$2:$B$16,0),MATCH(R22,'My Students'!$2:$2,0))","v":{"$error":"#N/A"}}]
["Dept folders",{"$f":"HYPERLINK(CONCATENATE(\"Z:\\CoBHS Advising\\Departments\\\",IF(E11=\"\",INDEX('Data Lists'!D:D,MATCH(E7,'Data Lists'!A:A,0)),INDEX('Data Lists'!D:D,MATCH(E11,'Data Lists'!B:B,0))),\"\\Student Forms\\\"))","v":{"$error":"#N/A"}},null,"Reg Restrictions",{"$f":"INDEX($S:$S,MATCH(\"RegistrationRestrictions\",$R:$R,0))","v":{"$error":"#N/A"}},null,"Transcripts",null,null,null,null,null,null,"Pre-Professional","May not know until stu or CBAS reports to us; ask in welcome email!",null,null,"CUSTOMSGrp",{"$f":"INDEX('My Students'!$2:$16,MATCH($S$1,'My Students'!$B$2:$B$16,0),MATCH(R23,'My Students'!$2:$2,0))","v":{"$error":"#N/A"}}]
["Stu folder",{"$f":"HYPERLINK(CONCATENATE(\"Z:\\CoBHS Advising\\Departments\\\",IF(E11=\"\",INDEX('Data Lists'!D:D,MATCH(E7,'Data Lists'!A:A,0)),INDEX('Data Lists'!D:D,MATCH(E11,'Data Lists'!B:B,0))),\"\\Student Forms\\\",B22))","v":{"$error":"#N/A"}},null,"Immunizations",{"$f":"INDEX($S:$S,MATCH(\"RegistrationRestrictions\",$R:$R,0))","v":{"$error":"#N/A"}},null,null,null,"Prior schools",null,null,null,null,null,"Provide Pre-Prof info packet and info session flyer",null,null,"CustomsPOS",{"$f":"INDEX('My Students'!$2:$16,MATCH($S$1,'My Students'!$B$2:$B$16,0),MATCH(R24,'My Students'!$2:$2,0))","v":{"$error":"#N/A"}}]
[null,null,{"$f":"YEARFRAC(S33,NOW())","v":{"$error":"#N/A"}},"Under 18 & Imm",{"$f":"IF(C25>=18,\"OK--over 18\",\"If need imms, will need parent sig\")","v":{"$error":"#N/A"}},null,null,null,"Missing classes/transcripts",null,null,null,null,null,null,null,null,"BannerPOS",{"$f":"INDEX('My Students'!$2:$16,MATCH($S$1,'My Students'!$B$2:$B$16,0),MATCH(R25,'My Students'!$2:$2,0))","v":{"$error":"#N/A"}}]
[null,null,null,"Missing Items",{"$f":"INDEX($S:$S,MATCH(\"MissingChecklistItems\",$R:$R,0))","v":{"$error":"#N/A"}},null,null,null,"Subs needed",null,null,null,null,null,null,null,null,"Assigned Advisor",{"$f":"INDEX('My Students'!$2:$16,MATCH($S$1,'My Students'!$B$2:$B$16,0),MATCH(R26,'My Students'!$2:$2,0))","v":{"$error":"#N/A"}}]
[null,null,null,"Term",{"$f":"INDEX($S:$S,MATCH(\"TermDesc\",$R:$R,0))","v":{"$error":"#N/A"}},null,null,null,null,null,null,null,"Reg Issues","Task","Where to find info / What to check",null,null,"Customs Advisor",{"$f":"INDEX('My Students'!$2:$16,MATCH($S$1,'My Students'!$B$2:$B$16,0),MATCH(R27,'My Students'!$2:$2,0))","v":{"$error":"#N/A"}}]
[null,null,null,"Might need BUAF",{"$f":"INDEX($S:$S,MATCH(\"VetOrDep\",$R:$R,0))","v":{"$error":"#N/A"}},null,null,null,null,null,null,null,null,"Immunization issues?","Banner: SZAITRK",null,null,"Holds",{"$f":"INDEX('My Students'!$2:$16,MATCH($S$1,'My Students'!$B$2:$B$16,0),MATCH(R28,'My Students'!$2:$2,0))","v":{"$error":"#N/A"}}]
[null,null,null,"Reverse Transfer",{"$f":"INDEX($S:$S,MATCH(\"ReverseTransfer\",$R:$R,0))","v":{"$error":"#N/A"}},null,null,null,null,null,null,null,null,null,"Missing imm docs, under 18--need parent form",null,null,"RegistrationRestrictions",{"$f":"INDEX('My Students'!$2:$16,MATCH($S$1,'My Students'!$B$2:$B$16,0),MATCH(R29,'My Students'!$2:$2,0))","v":{"$error":"#N/A"}}]
[null,null,null,"First Generation",{"$f":"INDEX($S:$S,MATCH(\"1stGen\",$R:$R,0))","v":{"$error":"#N/A"}},null,"Course Types",null,null,null,null,null,null,null,null,null,null,"MissingChecklistItems",{"$f":"INDEX('My Students'!$2:$16,MATCH($S$1,'My Students'!$B$2:$B$16,0),MATCH(R30,'My Students'!$2:$2,0))","v":{"$error":"#N/A"}}]
["Want to add a link to the student's folder? ",null,null,null,null,null,null,null,"Prescribeds",null,null,null,null,"Holds","SOAHOLD, Customs chart--\"Factors\"",null,null,"AdmissionDecision",{"$f":"INDEX('My Students'!$2:$16,MATCH($S$1,'My Students'!$B$2:$B$16,0),MATCH(R31,'My Students'!$2:$2,0))","v":{"$error":"#N/A"}}]
["--Click on the \"Stu folder\" field above (B21).",null,null,null,null,null,null,null,"Check RLC options",null,null,null,null,null,null,null,null,"TermDesc",{"$f":"INDEX('My Students'!$2:$16,MATCH($S$1,'My Students'!$B$2:$B$16,0),MATCH(R32,'My Students'!$2:$2,0))","v":{"$error":"#N/A"}}]
["--Control-K to start the process of creating a link.",null,null,null,null,null,null,null,"Honors",null,null,null,null,null,null,null,null,"DateofBirth",{"$f":"INDEX('My Students'!$2:$16,MATCH($S$1,'My Students'!$B$2:$B$16,0),MATCH(R33,'My Students'!$2:$2,0))","v":{"$error":"#N/A"}}]
["--Browse to the student's folder.",null,null,null,null,null,null,null,"Pre-Nursing",null,null,null,null,null,null,null,null,"Notes",{"$f":"INDEX('My Students'!$2:$16,MATCH($S$1,'My Students'!$B$2:$B$16,0),MATCH(R34,'My Students'!$2:$2,0))","v":{"$error":"#N/A"}}]
["--Choose any file in the folder and double-click on it.",null,null,null,null,null,null,null,null,null,null,null,"Check Transcripts","Task","Where to find info / What to check",null,null,"MTSUEmail",{"$f":"INDEX('My Students'!$2:$16,MATCH($S$1,'My Students'!$B$2:$B$16,0),MATCH(R35,'My Students'!$2:$2,0))","v":{"$error":"#N/A"}}]
["--In the Address box, delete the file name (back to the \\ after the folder name).",null,null,null,null,null,null,null,null,null,null,null,null,"Prior schools","Banner: SOAPCOL / Pipeline: Prior College Info",null,null,"PersonalEmail",{"$f":"INDEX('My Students'!$2:$16,MATCH($S$1,'My Students'!$B$2:$B$16,0),MATCH(R36,'My Students'!$2:$2,0))","v":{"$error":"#N/A"}}]
["--Click OK.",null,null,null,null,null,"Major-Specific",null,null,null,null,null,null,null,null,null,null,"PermPhone",{"$f":"INDEX('My Students'!$2:$16,MATCH($S$1,'My Students'!$B$2:$B$16,0),MATCH(R37,'My Students'!$2:$2,0))","v":{"$error":"#N/A"}}]
["--Now you should see the path to the folder, underlined as a link.",null,null,null,null,null,null,null,null,null,null,null,null,null,null,null,null,"MailingPhone",{"$f":"INDEX('My Students'!$2:$16,MATCH($S$1,'My Students'!$B$2:$B$16,0),MATCH(R38,'My Students'!$2:$2,0))","v":{"$error":"#N/A"}}]
["--When you click on your link, the folder should open in a separate window.",null,null,null,null,null,null,null,null,null,null,null,null,"Missing classes/ transcripts","BDMS (Banner: SAAADMS, click search icon) / Pline: Transfer Eval / Ask stu in welcome email",null,null,"NursElig",{"$f":"INDEX('My Students'!$2:$16,MATCH($S$1,'My Students'!$B$2:$B$16,0),MATCH(R39,'My Students'!$2:$2,0))","v":{"$error":"#N/A"}}]
[null,null,null,null,null,null,null,null,null,null,null,null,null,null,"FRs: AP, IB, DE, Dual Credit, Cambridge  /  TRs: Sems in progress or missing from MT transcript",null,null,"ACTMathScre",{"$f":"INDEX('My Students'!$2:$16,MATCH($S$1,'My Students'!$B$2:$B$16,0),MATCH(R40,'My Students'!$2:$2,0))","v":{"$error":"#N/A"}}]
[null,null,null,null,null,null,null,null,null,null,null,null,null,null,null,null,null,"ACTScienceScre",{"$f":"INDEX('My Students'!$2:$16,MATCH($S$1,'My Students'!$B$2:$B$16,0),MATCH(R41,'My Students'!$2:$2,0))","v":{"$error":"#N/A"}}]
[null,null,null,null,null,null,null,null,null,null,null,null,null,"Subs needed","By comparing transcript, transfer eval, & UD form.  Use TES for course descriptions.",null,null,"A&P?",{"$f":"IF(S1<>\"\",IF(OR(AND(S40=21,S41>21),AND(S40>21,S41=21)),\"maybe\",IF(AND(S31>=21,S41>=21),\"Y\",\"N\")),\"\")","v":{"$error":"#N/A"}}]
[null,null,null,null,null,null,null,null,null,null,null,null,null,null,"Any classes that might/should count but aren't?",null,null,"Major by Look-up",{"$f":"INDEX('Data Lists'!B:B,MATCH(S24,'Data Lists'!A:A,0))","v":{"$error":"#N/A"}}]
[null,null,null,null,null,null,"Notes:",null,null,null,null,null,null,null,null,null,null,"NameM#",{"$f":"CONCATENATE(S47,\", \",S46,\" \",S45)","v":{"$error":"#N/A"}}]
[null,null,null,null,null,null,null,null,null,null,null,null,"Pre-Customs Task Guide--Page 2",null,null,null,null,"M# copy",{"$f":"S1","v":0}]
[null,null,null,null,null,null,null,null,null,null,null,null,"Specific Course Types","Task","Where to find info / What to check",null,null,"Fname",{"$f":"IF(1<>\"\",IFERROR(MID(S9,SEARCH(\" \",S9,1)+1,SEARCH(\" \",S9,SEARCH(\" \",S9,1)+1)-SEARCH(\" \",S9,1)-1),MID(S9,FIND(\" \",S9)+1,256)),\"\")","v":{"$error":"#N/A"}}]
[null,null,null,null,null,null,null,null,null,null,null,null,null,"Prescribeds","Compare SZAADEF and SOATEST scores",null,null,"Lname",{"$f":"IF(S1<>\"\",CONCATENATE(LEFT(S9,FIND(\", \",S9,1)-1)),\"\")","v":{"$error":"#N/A"}}]
[null,null,null,null,null,null,null,null,null,null,null,null,null,null,"Do they match? What K classes are required?  (\"SAILS Math\"=1010 or 1530 non-K or 1710K)"]
[null,null,null,null,null,null,"Post-Customs To-Do List",null,null,{"$f":"CONCATENATE($B$2,\" (\",$B$3,\")\")","v":{"$error":"#N/A"}}]
[null,null,null,null,null,null,"General",null,null,null,null,null,null,"Check RLC options","Based on class list"]
[null,null,null,null,null,null,null,null,"Assign advisor in Banner",null,null,null,null,null,"Must use for students who need READ 1000K/HIST 2020. May recommend for other students."]
[null,null,null,null,null,null,null,null,"Submit appointment report"]
[null,null,null,null,null,null,null,null,null,null,null,null,null,"Honors","Customs chart--\"Factors\" box"]
[null,null,null,null,null,null,null,null,null,null,null,null,null,null,"Is the student eligible to take honors classes? If TR, email Judy Albakry to add honors code."]
[]
[null,null,null,null,null,null,null,null,null,null,null,null,null,"Pre-Nursing","Customs chart--\"Factors\" box"]
[null,null,null,null,null,null,"Special Pops",null,null,null,null,null,null,null,"Do they need different gen eds for PREN vs major?"]
[null,null,null,null,null,null,null,null,"Vet benefits"]
[null,null,null,null,null,null,null,null,"Submit change of major form"]
[null,null,null,null,null,null,null,null,"Send follow-up emails, if needed",null,null,null,"Major-Specific Checks","Task","Where to find info / What to check"]
[null,null,null,null,null,null,null,null,null,null,null,null,null,"Check advising folder","Should have UD form, Reg checklist, anything else specific to major"]
[]
[]
[null,null,null,null,null,null,"Notes:"]
[]
[]
["Copy-Pastes & Folder Links",null,null,"MTSUEmail",{"$f":"B4","v":{"$error":"#N/A"}}]
[{"$f":"A19","v":{"$error":"#N/A"}},{"$f":"$S$1","v":0},null,"PersonalEmail",{"$f":"B5","v":{"$error":"#N/A"}}]
[{"$f":"A20","v":{"$error":"#N/A"}},{"$f":"B20","v":{"$error":"#N/A"}},null,"CustomsPOS",{"$f":"E7","v":{"$error":"#N/A"}}]
["Major name",{"$f":"B21","v":{"$error":"#N/A"}},null,null,{"$f":"E8","v":{"$error":"#N/A"}}]
["Folder name",{"$error":"#N/A"},null,"BannerPOS",{"$f":"E9","v":{"$error":"#N/A"}}]
["Dept folders",{"$f":"HYPERLINK(B24)","v":{"$error":"#N/A"}},null,"Majors match?",{"$f":"E10","v":{"$error":"#N/A"}}]
["Stu folder",{"$f":"HYPERLINK(B25)","v":""},null,"Override major",{"$f":"E11","v":0}]
[null,null,null,"Might need BUAF",{"$f":"E28","v":{"$error":"#N/A"}},null,null,null,null,null,null,null,"Post-Customs Task Guide"]
[null,null,null,null,null,null,null,null,null,null,null,null,"General","Task","Where to find info / What to check"]
["Start",null,null,"Change major",null,null,null,null,null,null,null,null,null,"Assign advisor in Banner","SGAADVR"]
["Stop",null,null,"Notes for advisor",null,null,null,null,null,null,null,null,null,null,"Our type is COLL; We generally are the primary advisor."]
[]
[null,"Report Builder",null,null,"Student Message Builder",null,null,null,null,null,null,null,null,"Submit appointment report","Navigate (SSC)"]
["Registered",null,"see below","Docs attached",null,"x (to say that you've attached docs for the student)"]
["Attaching Scan",null,"x","Drop/Add info",null,"x (to give info on switching classes & steps to do so)"]
["Submitted COM",null,"x","Acad success tips",null,"x (to give acad tips, tutoring & SI websites, & \"ask for help\")"]
["Supp Instructn",null,"x","NURS Info Session",null,"x (to refer student to nursing info webpage and session)",null,null,null,null,null,null,"Special Pops","Task","Where to find info / What to check"]
["RTTP",null,"x","Check phone #",null,"x (to tell stu their listed ph #s are wrong, & how to fix)",null,null,null,null,null,null,null,"Vet benefits","Submit BUAF"]
["Note 1",null,"x","Advisor info",{"$f":"INDEX('Data Lists'!$J:$J,MATCH($B$12,'Data Lists'!$H:$H,0))","v":{"$error":"#N/A"}},"(leave formula, or type \"me <email>\")",null,null,null,null,null,null,null,null,"Form: Z:> Advising> Advising Forms> \"VA Benefit User Adv Form\"; Submit: V drive along w/ UD form"]
["Other",null,"[notes]","Other",null,"[type any notes to student]"]
["Paste in advising report:",{"$f":"CONCATENATE(\"Student came for advising during Customs.\",IF(B81<>\"\",\"  Attaching scanned copy of notes.\",\"\"),IF(B80=\"a\",Messages!$C$2,IF(B80=\"b\",Messages!$C$3,IF(B80<>\"\",CONCATENATE(\"  Registered student for classes for upcoming semester: \",B80),\"\"))),IF(B86<>\"\",CONCATENATE(\"\n\n\",B86),\"\"),IF(B82<>\"\",\"\n\nSubmitted change of major form. \",\"\"),IF(B83<>\"\",Messages!$C$4,\"\"),IF(B84<>\"\",Messages!$C$5,\"\"),IF(B85<>\"\",Messages!$C$6,\"\"))","v":"Student came for advising during Customs."},null,"Paste in stu msg:",{"$f":"CONCATENATE(\"We enjoyed seeing you at the CBHS Advising Center Customs session today, \",$A$21,\"!  \",IF(E80=\"x\",\"I've attached your Registration Checklist, for your records.\",\"\"),IF(E86<>\"\",CONCATENATE(\"\n\n\",E86),\"\"),IF(E81=\"x\",CONCATENATE(Messages!$C$7&E85&\", before making changes.\"),\"\"),IF(E84=\"x\",Messages!$C$10,\"\"),IF(E82=\"x\",Messages!$C$8,\"\"),IF(E83<>\"\",Messages!$C$9,\"\"),CONCATENATE(\"\n\nIf you have any questions or concerns, please contact \"&E85&\".  You'll also want to plan to come in for an advising appointment around mid-terms each semester, to talk about your classes for the upcoming term.  You can find Instructions and Schedule links at mtsu.edu/cbhsadv. \"),\"\n\nWe look forward to seeing you at MTSU this semester!\n\n\",$B$2,\"\n\",$B$3)","v":{"$error":"#N/A"}},null,null,null,null,null,null,null,null,"Submit change of major form","(If applicable)  Pipeline > Bottom of Advisor menu"]
["\"Registered\" choices: \"a\" to get message re stu registering in lab, \"b\" to get message re helping stu register in office, or type list of classes to be inserted."]
[]
["This is what it will say:",null,null,"This is what it will say:",null,null,null,null,null,null,null,null,null,"Send follow-up emails","(if needed)"]
[{"$f":"B87","v":"Student came for advising during Customs."},null,null,{"$f":"E87","v":{"$error":"#N/A"}},null,null,null,null,null,null,null,null,null,null,"e.g., To new advisor if student changed major during advising session"]

{"sheet":"13","index":14,"n_rows":91,"n_cols":20,"rows_kept":91,"cut":false,"hidden":false,"merged":[[90,0,114,1],[90,3,114,4],[1,6,6,6],[2,9,5,9],[2,12,12,12],[14,0,15,0],[14,1,15,1],[14,3,15,3],[14,4,15,4],[15,6,20,6],[82,12,91,12],[74,12,80,12],[2,13,3,13],[5,13,6,13],[8,6,13,6],[8,13,9,13],[9,9,12,9],[11,13,12,13],[16,13,17,13],[19,13,20,13],[22,6,27,6],[22,13,23,13],[23,9,26,9],[26,12,32,12],[27,13,28,13],[29,6,34,6],[30,9,33,9],[30,13,31,13],[15,12,24,12],[16,9,19,9],[34,12,43,12],[35,13,36,13],[36,6,41,6],[37,9,40,9],[38,13,39,13],[41,13,42,13],[44,6,47,10],[45,12,57,12],[46,13,47,13],[49,6,54,6],[49,13,50,13],[50,9,53,9],[52,13,53,13],[55,13,56,13],[56,6,61,6],[57,9,60,9],[59,12,71,12],[60,13,61,13],[63,13,64,13],[64,6,68,10],[83,13,84,13],[86,13,87,13],[89,13,90,13],[66,13,67,13],[69,13,70,13],[75,13,76,13],[78,13,79,13]]}
["Contact & Demographic Info",null,null,"Academic Info",null,null,"Pre-Customs To-Do List",null,null,{"$f":"CONCATENATE($B$2,\" (\",$B$3,\")\"&\", \"&B21)","v":{"$error":"#N/A"}},null,null,"Pre-Customs Task Guide",null,null,null,null,"M#",{"$f":"'My Students'!B15","v":0}]
["Name",{"$f":"CONCATENATE(A20,\" \",B20)","v":{"$error":"#N/A"}},null,"Transferred hours",{"$f":"INDEX($S:$S,MATCH(\"HrsEarned\",$R:$R,0))","v":{"$error":"#N/A"}},null,"General",null,null,null,null,null,null,"Task","Where to find info / What to check",null,null,"Deleted",{"$f":"INDEX('My Students'!$2:$16,MATCH($S$1,'My Students'!$B$2:$B$16,0),MATCH(R2,'My Students'!$2:$2,0))","v":{"$error":"#N/A"}}]
["M#",{"$f":"S1","v":0},null,"HS GPA",{"$f":"INDEX($S:$S,MATCH(\"HighSchoolGPA\",$R:$R,0))","v":{"$error":"#N/A"}},null,null,null,"Make stu folder in Z drive",null,null,null,"General","Make stu folder in Z drive","Naming scheme: <major> <conc> <last>, <first> <M#>",null,null,"SAcad",{"$f":"INDEX('My Students'!$2:$16,MATCH($S$1,'My Students'!$B$2:$B$16,0),MATCH(R3,'My Students'!$2:$2,0))","v":{"$error":"#N/A"}}]
["MTSUEmail",{"$f":"INDEX($S:$S,MATCH(A4,$R:$R,0))","v":{"$error":"#N/A"}},null,"Inclusive GPA",{"$f":"INDEX($S:$S,MATCH(\"InclusiveGPA\",$R:$R,0))","v":{"$error":"#N/A"}},null,null,null,"Check admit term",null,null,null,null,null,"e.g., CRJU LAEN Smith, John M01234567",null,null,"VetOrDep",{"$f":"INDEX('My Students'!$2:$16,MATCH($S$1,'My Students'!$B$2:$B$16,0),MATCH(R4,'My Students'!$2:$2,0))","v":{"$error":"#N/A"}}]
["PersonalEmail",{"$f":"INDEX($S:$S,MATCH(A5,$R:$R,0))","v":{"$error":"#N/A"}},null,"ACT Math",{"$f":"INDEX($S:$S,MATCH(\"ACTMathScre\",$R:$R,0))","v":{"$error":"#N/A"}},null,null,null,"Major",null,null,null,null,null,null,null,null,"PREN",{"$f":"INDEX('My Students'!$2:$16,MATCH($S$1,'My Students'!$B$2:$B$16,0),MATCH(R5,'My Students'!$2:$2,0))","v":{"$error":"#N/A"}}]
["PermPhone",{"$f":"INDEX($S:$S,MATCH(A6,$R:$R,0))","v":{"$error":"#N/A"}},null,"ACT Science",{"$f":"INDEX($S:$S,MATCH(\"ACTScienceScre\",$R:$R,0))","v":{"$error":"#N/A"}},null,null,null,"Acad standing (TRs only)",null,null,null,null,"Check admit term","SAAADMS, Customs chart--\"Flags\"",null,null,"1stGen",{"$f":"INDEX('My Students'!$2:$16,MATCH($S$1,'My Students'!$B$2:$B$16,0),MATCH(R6,'My Students'!$2:$2,0))","v":{"$error":"#N/A"}}]
["MailingPhone",{"$f":"INDEX($S:$S,MATCH(A7,$R:$R,0))","v":{"$error":"#N/A"}},null,"CustomsPOS",{"$f":"INDEX($S:$S,MATCH(D7,$R:$R,0))","v":{"$error":"#N/A"}},null,null,null,null,null,null,null,null,null,"If summer: Verify w/ stu before Customs",null,null,"ReverseTransfer",{"$f":"INDEX('My Students'!$2:$16,MATCH($S$1,'My Students'!$B$2:$B$16,0),MATCH(R7,'My Students'!$2:$2,0))","v":{"$error":"#N/A"}}]
[null,null,null,null,{"$f":"INDEX($S:$S,MATCH(\"Major\",$R:$R,0))","v":{"$error":"#N/A"}},null,null,null,null,null,null,null,null,null,null,null,null,"FR/TR",{"$f":"INDEX('My Students'!$2:$16,MATCH($S$1,'My Students'!$B$2:$B$16,0),MATCH(R8,'My Students'!$2:$2,0))","v":{"$error":"#N/A"}}]
["Customs Info",null,null,"BannerPOS",{"$f":"INDEX($S:$S,MATCH(D9,$R:$R,0))","v":{"$error":"#N/A"}},null,"Special Pops",null,null,null,null,null,null,"Major","SGASTDN, Customs chart--\"Academic\" (& updates from stu)",null,null,"StudentName",{"$f":"INDEX('My Students'!$2:$16,MATCH($S$1,'My Students'!$B$2:$B$16,0),MATCH(R9,'My Students'!$2:$2,0))","v":{"$error":"#N/A"}}]
["CountrySlot",{"$f":"INDEX(S:S,MATCH(A10,R:R,0))","v":{"$error":"#N/A"}},null,"Majors match?",{"$f":"IF(AND(E11=\"\",E7=E9),\"Y\",\"N, Submit change of major\")","v":{"$error":"#N/A"}},null,null,null,"Vet benefits",null,null,null,null,null,null,null,null,"Major",{"$f":"INDEX('My Students'!$2:$16,MATCH($S$1,'My Students'!$B$2:$B$16,0),MATCH(R10,'My Students'!$2:$2,0))","v":{"$error":"#N/A"}}]
["Order/Time",{"$f":"CONCATENATE(INDEX(S:S,MATCH(A11,R:R,0)),\" (\",LEFT(S23,2),\")\")","v":{"$error":"#N/A"}},null,"Override major",null,null,null,null,"Student athlete",null,null,null,null,null,null,null,null,"Order/Time",{"$f":"INDEX('My Students'!$2:$16,MATCH($S$1,'My Students'!$B$2:$B$16,0),MATCH(R11,'My Students'!$2:$2,0))","v":{"$error":"#N/A"}}]
["Acad Advisor",{"$f":"INDEX($S:$S,MATCH(\"Assigned Advisor\",$R:$R,0))","v":{"$error":"#N/A"}},null,null,null,null,null,null,"Pre-Professional",null,null,null,null,"Acad standing (TRs only)","SHATERM, SAAADMS, Transcript",null,null,"PrescribedCrsMath",{"$f":"INDEX('My Students'!$2:$16,MATCH($S$1,'My Students'!$B$2:$B$16,0),MATCH(R12,'My Students'!$2:$2,0))","v":{"$error":"#N/A"}},{"$f":"IF(S12=\"college level\",\"n\",IF(S12=0,\"blank--check\",\"y\"))","v":{"$error":"#N/A"}}]
["Customs Advisor",{"$f":"INDEX($S:$S,MATCH(\"Customs Advisor\",$R:$R,0))","v":{"$error":"#N/A"}},null,"Factors in Choosing Classes",null,null,null,null,null,null,null,null,null,null,"Probation on SHATERM? Must take U2020, meet GPA reqs 1st sem.",null,null,"PrescribedCrsWriting",{"$f":"INDEX('My Students'!$2:$16,MATCH($S$1,'My Students'!$B$2:$B$16,0),MATCH(R13,'My Students'!$2:$2,0))","v":{"$error":"#N/A"}},{"$f":"IF(S13=\"college level\",\"n\",IF(S13=0,\"blank--check\",\"y\"))","v":{"$error":"#N/A"}}]
[null,null,null,"Honors",{"$f":"INDEX($S:$S,MATCH(\"HonorsElig\",$R:$R,0))","v":{"$error":"#N/A"}},null,null,null,null,null,null,null,null,null,null,null,null,"PrescribedCrsReading",{"$f":"INDEX('My Students'!$2:$16,MATCH($S$1,'My Students'!$B$2:$B$16,0),MATCH(R14,'My Students'!$2:$2,0))","v":{"$error":"#N/A"}},{"$f":"IF(S14=\"college level\",\"n\",IF(S14=0,\"blank--check\",\"y\"))","v":{"$error":"#N/A"}}]
["Emily's Notes",{"$f":"INDEX($S:$S,MATCH(\"Notes\",$R:$R,0))","v":{"$error":"#N/A"}},null,"Prescribeds",{"$f":"IF(AND(T12=\"n\",T13=\"n\",T14=\"n\"),\"\",\nCONCATENATE(\"Ks: \"&IF(T12=\"y\",S12,\"\")&IF(T13=\"y\",\", \",\"\")&IF(T12=\"blank--check\",\"Math--check; \",\"\")&\nIF(T13=\"y\",\"ENGL\",\"\")&IF(T14=\"y\",\", \",\"\")&IF(T13=\"blank--check\",\"Engl--check; \",\"\")&\nIF(T14=\"y\",\"READ\",\"\")&IF(T15=\"y\",\", \",\"\")&IF(T14=\"blank--check\",\"Read--check; \",\"\")&\nIF(T15=\"y\",\"U1010\",\"\")))","v":{"$error":"#N/A"}},null,null,null,null,null,null,null,null,null,null,null,null,"PrescribedCrsStudySkills",{"$f":"INDEX('My Students'!$2:$16,MATCH($S$1,'My Students'!$B$2:$B$16,0),MATCH(R15,'My Students'!$2:$2,0))","v":{"$error":"#N/A"}},{"$f":"IF((T12<>\"n\")+(T13=\"y\")+(T14=\"y\")>=2,\"y\",\"n\")","v":{"$error":"#N/A"}}]
[null,null,null,null,null,null,"Reg Issues",null,null,null,null,null,"Special Pops","Task","Where to find info / What to check",null,null,"HonorsElig",{"$f":"INDEX('My Students'!$2:$16,MATCH($S$1,'My Students'!$B$2:$B$16,0),MATCH(R16,'My Students'!$2:$2,0))","v":{"$error":"#N/A"}}]
[null,null,null,"Scholars Acad",{"$f":"INDEX($S:$S,MATCH(\"Sacad\",$R:$R,0))","v":{"$error":"#N/A"}},null,null,null,"Immunization issues?",null,null,null,null,"Vet benefits","SAAQUAN, SGASTDN, SPAIDEN, Customs chart--\"Flags\", ask student",null,null,"ACTEngl",{"$f":"INDEX('My Students'!$2:$16,MATCH($S$1,'My Students'!$B$2:$B$16,0),MATCH(R17,'My Students'!$2:$2,0))","v":{"$error":"#N/A"}}]
["Copy-Pastes & Folder Links",null,null,"Pre-Nursing",{"$f":"INDEX($S:$S,MATCH(\"PREN\",$R:$R,0))","v":{"$error":"#N/A"}},null,null,null,"Holds",null,null,null,null,null,"Need a BUAF form?  (FYI: Flag on Customs list doesn't always mean getting vet benefits!!)",null,null,"HighSchoolGPA",{"$f":"INDEX('My Students'!$2:$16,MATCH($S$1,'My Students'!$B$2:$B$16,0),MATCH(R18,'My Students'!$2:$2,0))","v":{"$error":"#N/A"}}]
[{"$f":"INDEX(S:S,MATCH(\"StudentName\",R:R,0))","v":{"$error":"#N/A"}},{"$f":"S1","v":0},null,"ACTEngl",{"$f":"INDEX($S:$S,MATCH(\"ACTEngl\",$R:$R,0))","v":{"$error":"#N/A"}},null,null,null,null,null,null,null,null,null,null,null,null,"ACTCompositeScore",{"$f":"INDEX('My Students'!$2:$16,MATCH($S$1,'My Students'!$B$2:$B$16,0),MATCH(R19,'My Students'!$2:$2,0))","v":{"$error":"#N/A"}}]
[{"$f":"IFERROR(MID(A19,SEARCH(\" \",A19,1)+1,SEARCH(\" \",A19,SEARCH(\" \",A19,1)+1)-SEARCH(\" \",A19,1)-1),MID(A19,FIND(\" \",A19)+1,256))","v":{"$error":"#N/A"}},{"$f":"CONCATENATE(LEFT(A19,FIND(\", \",A19,1)-1))","v":{"$error":"#N/A"}},null,null,null,null,null,null,null,null,null,null,null,"Student athlete","SGASPRT (Also on main Customs spreadsheet but not sure if accurate)",null,null,"InclusiveGPA",{"$f":"INDEX('My Students'!$2:$16,MATCH($S$1,'My Students'!$B$2:$B$16,0),MATCH(R20,'My Students'!$2:$2,0))","v":{"$error":"#N/A"}}]
["Major name",{"$f":"CONCATENATE(IF(E11=\"\",INDEX('Data Lists'!$B:$B,MATCH($E$7,'Data Lists'!$A:$A,0)),CONCATENATE(INDEX('Data Lists'!$B:$B,MATCH($E$11,'Data Lists'!$B:$B,0))&IF(E18=\"Y\",\" (PREN)\")&\"\")))","v":{"$error":"#N/A"}},null,"Flags",null,null,null,null,null,null,null,null,null,null,"Stu meet with SAEC advisor; Scheduling challenges; Major changes approved through SAEC",null,null,"HrsEarned",{"$f":"INDEX('My Students'!$2:$16,MATCH($S$1,'My Students'!$B$2:$B$16,0),MATCH(R21,'My Students'!$2:$2,0))","v":{"$error":"#N/A"}}]
["Folder name",{"$f":"IF(E11=\"\",CONCATENATE(INDEX('Data Lists'!$E:$E,MATCH($E$7,'Data Lists'!$A:$A,0)),\" \",B20,\", \",A20,\" \",B3),CONCATENATE(INDEX('Data Lists'!$E:$E,MATCH($E$11,'Data Lists'!$B:$B,0)),\" \",B20,\", \",A20,\" \",B3))","v":{"$error":"#N/A"}},null,"Holds",{"$f":"INDEX($S:$S,MATCH(D22,$R:$R,0))","v":{"$error":"#N/A"}},null,null,null,null,null,null,null,null,null,null,null,null,"CountrySlot",{"$f":"INDEX('My Students'!$2:$16,MATCH($S$1,'My Students'!$B$2:$B$16,0),MATCH(R22,'My Students'!$2:$2,0))","v":{"$error":"#N/A"}}]
["Dept folders",{"$f":"HYPERLINK(CONCATENATE(\"Z:\\CoBHS Advising\\Departments\\\",IF(E11=\"\",INDEX('Data Lists'!D:D,MATCH(E7,'Data Lists'!A:A,0)),INDEX('Data Lists'!D:D,MATCH(E11,'Data Lists'!B:B,0))),\"\\Student Forms\\\"))","v":{"$error":"#N/A"}},null,"Reg Restrictions",{"$f":"INDEX($S:$S,MATCH(\"RegistrationRestrictions\",$R:$R,0))","v":{"$error":"#N/A"}},null,"Transcripts",null,null,null,null,null,null,"Pre-Professional","May not know until stu or CBAS reports to us; ask in welcome email!",null,null,"CUSTOMSGrp",{"$f":"INDEX('My Students'!$2:$16,MATCH($S$1,'My Students'!$B$2:$B$16,0),MATCH(R23,'My Students'!$2:$2,0))","v":{"$error":"#N/A"}}]
["Stu folder",{"$f":"HYPERLINK(CONCATENATE(\"Z:\\CoBHS Advising\\Departments\\\",IF(E11=\"\",INDEX('Data Lists'!D:D,MATCH(E7,'Data Lists'!A:A,0)),INDEX('Data Lists'!D:D,MATCH(E11,'Data Lists'!B:B,0))),\"\\Student Forms\\\",B22))","v":{"$error":"#N/A"}},null,"Immunizations",{"$f":"INDEX($S:$S,MATCH(\"RegistrationRestrictions\",$R:$R,0))","v":{"$error":"#N/A"}},null,null,null,"Prior schools",null,null,null,null,null,"Provide Pre-Prof info packet and info session flyer",null,null,"CustomsPOS",{"$f":"INDEX('My Students'!$2:$16,MATCH($S$1,'My Students'!$B$2:$B$16,0),MATCH(R24,'My Students'!$2:$2,0))","v":{"$error":"#N/A"}}]
[null,null,{"$f":"YEARFRAC(S33,NOW())","v":{"$error":"#N/A"}},"Under 18 & Imm",{"$f":"IF(C25>=18,\"OK--over 18\",\"If need imms, will need parent sig\")","v":{"$error":"#N/A"}},null,null,null,"Missing classes/transcripts",null,null,null,null,null,null,null,null,"BannerPOS",{"$f":"INDEX('My Students'!$2:$16,MATCH($S$1,'My Students'!$B$2:$B$16,0),MATCH(R25,'My Students'!$2:$2,0))","v":{"$error":"#N/A"}}]
[null,null,null,"Missing Items",{"$f":"INDEX($S:$S,MATCH(\"MissingChecklistItems\",$R:$R,0))","v":{"$error":"#N/A"}},null,null,null,"Subs needed",null,null,null,null,null,null,null,null,"Assigned Advisor",{"$f":"INDEX('My Students'!$2:$16,MATCH($S$1,'My Students'!$B$2:$B$16,0),MATCH(R26,'My Students'!$2:$2,0))","v":{"$error":"#N/A"}}]
[null,null,null,"Term",{"$f":"INDEX($S:$S,MATCH(\"TermDesc\",$R:$R,0))","v":{"$error":"#N/A"}},null,null,null,null,null,null,null,"Reg Issues","Task","Where to find info / What to check",null,null,"Customs Advisor",{"$f":"INDEX('My Students'!$2:$16,MATCH($S$1,'My Students'!$B$2:$B$16,0),MATCH(R27,'My Students'!$2:$2,0))","v":{"$error":"#N/A"}}]
[null,null,null,"Might need BUAF",{"$f":"INDEX($S:$S,MATCH(\"VetOrDep\",$R:$R,0))","v":{"$error":"#N/A"}},null,null,null,null,null,null,null,null,"Immunization issues?","Banner: SZAITRK",null,null,"Holds",{"$f":"INDEX('My Students'!$2:$16,MATCH($S$1,'My Students'!$B$2:$B$16,0),MATCH(R28,'My Students'!$2:$2,0))","v":{"$error":"#N/A"}}]
[null,null,null,"Reverse Transfer",{"$f":"INDEX($S:$S,MATCH(\"ReverseTransfer\",$R:$R,0))","v":{"$error":"#N/A"}},null,null,null,null,null,null,null,null,null,"Missing imm docs, under 18--need parent form",null,null,"RegistrationRestrictions",{"$f":"INDEX('My Students'!$2:$16,MATCH($S$1,'My Students'!$B$2:$B$16,0),MATCH(R29,'My Students'!$2:$2,0))","v":{"$error":"#N/A"}}]
[null,null,null,"First Generation",{"$f":"INDEX($S:$S,MATCH(\"1stGen\",$R:$R,0))","v":{"$error":"#N/A"}},null,"Course Types",null,null,null,null,null,null,null,null,null,null,"MissingChecklistItems",{"$f":"INDEX('My Students'!$2:$16,MATCH($S$1,'My Students'!$B$2:$B$16,0),MATCH(R30,'My Students'!$2:$2,0))","v":{"$error":"#N/A"}}]
["Want to add a link to the student's folder? ",null,null,null,null,null,null,null,"Prescribeds",null,null,null,null,"Holds","SOAHOLD, Customs chart--\"Factors\"",null,null,"AdmissionDecision",{"$f":"INDEX('My Students'!$2:$16,MATCH($S$1,'My Students'!$B$2:$B$16,0),MATCH(R31,'My Students'!$2:$2,0))","v":{"$error":"#N/A"}}]
["--Click on the \"Stu folder\" field above (B21).",null,null,null,null,null,null,null,"Check RLC options",null,null,null,null,null,null,null,null,"TermDesc",{"$f":"INDEX('My Students'!$2:$16,MATCH($S$1,'My Students'!$B$2:$B$16,0),MATCH(R32,'My Students'!$2:$2,0))","v":{"$error":"#N/A"}}]
["--Control-K to start the process of creating a link.",null,null,null,null,null,null,null,"Honors",null,null,null,null,null,null,null,null,"DateofBirth",{"$f":"INDEX('My Students'!$2:$16,MATCH($S$1,'My Students'!$B$2:$B$16,0),MATCH(R33,'My Students'!$2:$2,0))","v":{"$error":"#N/A"}}]
["--Browse to the student's folder.",null,null,null,null,null,null,null,"Pre-Nursing",null,null,null,null,null,null,null,null,"Notes",{"$f":"INDEX('My Students'!$2:$16,MATCH($S$1,'My Students'!$B$2:$B$16,0),MATCH(R34,'My Students'!$2:$2,0))","v":{"$error":"#N/A"}}]
["--Choose any file in the folder and double-click on it.",null,null,null,null,null,null,null,null,null,null,null,"Check Transcripts","Task","Where to find info / What to check",null,null,"MTSUEmail",{"$f":"INDEX('My Students'!$2:$16,MATCH($S$1,'My Students'!$B$2:$B$16,0),MATCH(R35,'My Students'!$2:$2,0))","v":{"$error":"#N/A"}}]
["--In the Address box, delete the file name (back to the \\ after the folder name).",null,null,null,null,null,null,null,null,null,null,null,null,"Prior schools","Banner: SOAPCOL / Pipeline: Prior College Info",null,null,"PersonalEmail",{"$f":"INDEX('My Students'!$2:$16,MATCH($S$1,'My Students'!$B$2:$B$16,0),MATCH(R36,'My Students'!$2:$2,0))","v":{"$error":"#N/A"}}]
["--Click OK.",null,null,null,null,null,"Major-Specific",null,null,null,null,null,null,null,null,null,null,"PermPhone",{"$f":"INDEX('My Students'!$2:$16,MATCH($S$1,'My Students'!$B$2:$B$16,0),MATCH(R37,'My Students'!$2:$2,0))","v":{"$error":"#N/A"}}]
["--Now you should see the path to the folder, underlined as a link.",null,null,null,null,null,null,null,null,null,null,null,null,null,null,null,null,"MailingPhone",{"$f":"INDEX('My Students'!$2:$16,MATCH($S$1,'My Students'!$B$2:$B$16,0),MATCH(R38,'My Students'!$2:$2,0))","v":{"$error":"#N/A"}}]
["--When you click on your link, the folder should open in a separate window.",null,null,null,null,null,null,null,null,null,null,null,null,"Missing classes/ transcripts","BDMS (Banner: SAAADMS, click search icon) / Pline: Transfer Eval / Ask stu in welcome email",null,null,"NursElig",{"$f":"INDEX('My Students'!$2:$16,MATCH($S$1,'My Students'!$B$2:$B$16,0),MATCH(R39,'My Students'!$2:$2,0))","v":{"$error":"#N/A"}}]
[null,null,null,null,null,null,null,null,null,null,null,null,null,null,"FRs: AP, IB, DE, Dual Credit, Cambridge  /  TRs: Sems in progress or missing from MT transcript",null,null,"ACTMathScre",{"$f":"INDEX('My Students'!$2:$16,MATCH($S$1,'My Students'!$B$2:$B$16,0),MATCH(R40,'My Students'!$2:$2,0))","v":{"$error":"#N/A"}}]
[null,null,null,null,null,null,null,null,null,null,null,null,null,null,null,null,null,"ACTScienceScre",{"$f":"INDEX('My Students'!$2:$16,MATCH($S$1,'My Students'!$B$2:$B$16,0),MATCH(R41,'My Students'!$2:$2,0))","v":{"$error":"#N/A"}}]
[null,null,null,null,null,null,null,null,null,null,null,null,null,"Subs needed","By comparing transcript, transfer eval, & UD form.  Use TES for course descriptions.",null,null,"A&P?",{"$f":"IF(S1<>\"\",IF(OR(AND(S40=21,S41>21),AND(S40>21,S41=21)),\"maybe\",IF(AND(S31>=21,S41>=21),\"Y\",\"N\")),\"\")","v":{"$error":"#N/A"}}]
[null,null,null,null,null,null,null,null,null,null,null,null,null,null,"Any classes that might/should count but aren't?",null,null,"Major by Look-up",{"$f":"INDEX('Data Lists'!B:B,MATCH(S24,'Data Lists'!A:A,0))","v":{"$error":"#N/A"}}]
[null,null,null,null,null,null,"Notes:",null,null,null,null,null,null,null,null,null,null,"NameM#",{"$f":"CONCATENATE(S47,\", \",S46,\" \",S45)","v":{"$error":"#N/A"}}]
[null,null,null,null,null,null,null,null,null,null,null,null,"Pre-Customs Task Guide--Page 2",null,null,null,null,"M# copy",{"$f":"S1","v":0}]
[null,null,null,null,null,null,null,null,null,null,null,null,"Specific Course Types","Task","Where to find info / What to check",null,null,"Fname",{"$f":"IF(1<>\"\",IFERROR(MID(S9,SEARCH(\" \",S9,1)+1,SEARCH(\" \",S9,SEARCH(\" \",S9,1)+1)-SEARCH(\" \",S9,1)-1),MID(S9,FIND(\" \",S9)+1,256)),\"\")","v":{"$error":"#N/A"}}]
[null,null,null,null,null,null,null,null,null,null,null,null,null,"Prescribeds","Compare SZAADEF and SOATEST scores",null,null,"Lname",{"$f":"IF(S1<>\"\",CONCATENATE(LEFT(S9,FIND(\", \",S9,1)-1)),\"\")","v":{"$error":"#N/A"}}]
[null,null,null,null,null,null,null,null,null,null,null,null,null,null,"Do they match? What K classes are required?  (\"SAILS Math\"=1010 or 1530 non-K or 1710K)"]
[null,null,null,null,null,null,"Post-Customs To-Do List",null,null,{"$f":"CONCATENATE($B$2,\" (\",$B$3,\")\")","v":{"$error":"#N/A"}}]
[null,null,null,null,null,null,"General",null,null,null,null,null,null,"Check RLC options","Based on class list"]
[null,null,null,null,null,null,null,null,"Assign advisor in Banner",null,null,null,null,null,"Must use for students who need READ 1000K/HIST 2020. May recommend for other students."]
[null,null,null,null,null,null,null,null,"Submit appointment report"]
[null,null,null,null,null,null,null,null,null,null,null,null,null,"Honors","Customs chart--\"Factors\" box"]
[null,null,null,null,null,null,null,null,null,null,null,null,null,null,"Is the student eligible to take honors classes? If TR, email Judy Albakry to add honors code."]
[]
[null,null,null,null,null,null,null,null,null,null,null,null,null,"Pre-Nursing","Customs chart--\"Factors\" box"]
[null,null,null,null,null,null,"Special Pops",null,null,null,null,null,null,null,"Do they need different gen eds for PREN vs major?"]
[null,null,null,null,null,null,null,null,"Vet benefits"]
[null,null,null,null,null,null,null,null,"Submit change of major form"]
[null,null,null,null,null,null,null,null,"Send follow-up emails, if needed",null,null,null,"Major-Specific Checks","Task","Where to find info / What to check"]
[null,null,null,null,null,null,null,null,null,null,null,null,null,"Check advising folder","Should have UD form, Reg checklist, anything else specific to major"]
[]
[]
[null,null,null,null,null,null,"Notes:"]
[]
[]
["Copy-Pastes & Folder Links",null,null,"MTSUEmail",{"$f":"B4","v":{"$error":"#N/A"}}]
[{"$f":"A19","v":{"$error":"#N/A"}},{"$f":"$S$1","v":0},null,"PersonalEmail",{"$f":"B5","v":{"$error":"#N/A"}}]
[{"$f":"A20","v":{"$error":"#N/A"}},{"$f":"B20","v":{"$error":"#N/A"}},null,"CustomsPOS",{"$f":"E7","v":{"$error":"#N/A"}}]
["Major name",{"$f":"B21","v":{"$error":"#N/A"}},null,null,{"$f":"E8","v":{"$error":"#N/A"}}]
["Folder name",{"$error":"#N/A"},null,"BannerPOS",{"$f":"E9","v":{"$error":"#N/A"}}]
["Dept folders",{"$f":"HYPERLINK(B24)","v":{"$error":"#N/A"}},null,"Majors match?",{"$f":"E10","v":{"$error":"#N/A"}}]
["Stu folder",{"$f":"HYPERLINK(B25)","v":""},null,"Override major",{"$f":"E11","v":0}]
[null,null,null,"Might need BUAF",{"$f":"E28","v":{"$error":"#N/A"}},null,null,null,null,null,null,null,"Post-Customs Task Guide"]
[null,null,null,null,null,null,null,null,null,null,null,null,"General","Task","Where to find info / What to check"]
["Start",null,null,"Change major",null,null,null,null,null,null,null,null,null,"Assign advisor in Banner","SGAADVR"]
["Stop",null,null,"Notes for advisor",null,null,null,null,null,null,null,null,null,null,"Our type is COLL; We generally are the primary advisor."]
[]
[null,"Report Builder",null,null,"Student Message Builder",null,null,null,null,null,null,null,null,"Submit appointment report","Navigate (SSC)"]
["Registered",null,"see below","Docs attached",null,"x (to say that you've attached docs for the student)"]
["Attaching Scan",null,"x","Drop/Add info",null,"x (to give info on switching classes & steps to do so)"]
["Submitted COM",null,"x","Acad success tips",null,"x (to give acad tips, tutoring & SI websites, & \"ask for help\")"]
["Supp Instructn",null,"x","NURS Info Session",null,"x (to refer student to nursing info webpage and session)",null,null,null,null,null,null,"Special Pops","Task","Where to find info / What to check"]
["RTTP",null,"x","Check phone #",null,"x (to tell stu their listed ph #s are wrong, & how to fix)",null,null,null,null,null,null,null,"Vet benefits","Submit BUAF"]
["Note 1",null,"x","Advisor info",{"$f":"INDEX('Data Lists'!$J:$J,MATCH($B$12,'Data Lists'!$H:$H,0))","v":{"$error":"#N/A"}},"(leave formula, or type \"me <email>\")",null,null,null,null,null,null,null,null,"Form: Z:> Advising> Advising Forms> \"VA Benefit User Adv Form\"; Submit: V drive along w/ UD form"]
["Other",null,"[notes]","Other",null,"[type any notes to student]"]
["Paste in advising report:",{"$f":"CONCATENATE(\"Student came for advising during Customs.\",IF(B81<>\"\",\"  Attaching scanned copy of notes.\",\"\"),IF(B80=\"a\",Messages!$C$2,IF(B80=\"b\",Messages!$C$3,IF(B80<>\"\",CONCATENATE(\"  Registered student for classes for upcoming semester: \",B80),\"\"))),IF(B86<>\"\",CONCATENATE(\"\n\n\",B86),\"\"),IF(B82<>\"\",\"\n\nSubmitted change of major form. \",\"\"),IF(B83<>\"\",Messages!$C$4,\"\"),IF(B84<>\"\",Messages!$C$5,\"\"),IF(B85<>\"\",Messages!$C$6,\"\"))","v":"Student came for advising during Customs."},null,"Paste in stu msg:",{"$f":"CONCATENATE(\"We enjoyed seeing you at the CBHS Advising Center Customs session today, \",$A$21,\"!  \",IF(E80=\"x\",\"I've attached your Registration Checklist, for your records.\",\"\"),IF(E86<>\"\",CONCATENATE(\"\n\n\",E86),\"\"),IF(E81=\"x\",CONCATENATE(Messages!$C$7&E85&\", before making changes.\"),\"\"),IF(E84=\"x\",Messages!$C$10,\"\"),IF(E82=\"x\",Messages!$C$8,\"\"),IF(E83<>\"\",Messages!$C$9,\"\"),CONCATENATE(\"\n\nIf you have any questions or concerns, please contact \"&E85&\".  You'll also want to plan to come in for an advising appointment around mid-terms each semester, to talk about your classes for the upcoming term.  You can find Instructions and Schedule links at mtsu.edu/cbhsadv. \"),\"\n\nWe look forward to seeing you at MTSU this semester!\n\n\",$B$2,\"\n\",$B$3)","v":{"$error":"#N/A"}},null,null,null,null,null,null,null,null,"Submit change of major form","(If applicable)  Pipeline > Bottom of Advisor menu"]
["\"Registered\" choices: \"a\" to get message re stu registering in lab, \"b\" to get message re helping stu register in office, or type list of classes to be inserted."]
[]
["This is what it will say:",null,null,"This is what it will say:",null,null,null,null,null,null,null,null,null,"Send follow-up emails","(if needed)"]
[{"$f":"B87","v":"Student came for advising during Customs."},null,null,{"$f":"E87","v":{"$error":"#N/A"}},null,null,null,null,null,null,null,null,null,null,"e.g., To new advisor if student changed major during advising session"]

{"sheet":"14","index":15,"n_rows":91,"n_cols":20,"rows_kept":91,"cut":false,"hidden":false,"merged":[[90,0,114,1],[90,3,114,4],[1,6,6,6],[2,9,5,9],[2,12,12,12],[14,0,15,0],[14,1,15,1],[14,3,15,3],[14,4,15,4],[15,6,20,6],[82,12,91,12],[74,12,80,12],[2,13,3,13],[5,13,6,13],[8,6,13,6],[8,13,9,13],[9,9,12,9],[11,13,12,13],[16,13,17,13],[19,13,20,13],[22,6,27,6],[22,13,23,13],[23,9,26,9],[26,12,32,12],[27,13,28,13],[29,6,34,6],[30,9,33,9],[30,13,31,13],[15,12,24,12],[16,9,19,9],[34,12,43,12],[35,13,36,13],[36,6,41,6],[37,9,40,9],[38,13,39,13],[41,13,42,13],[44,6,47,10],[45,12,57,12],[46,13,47,13],[49,6,54,6],[49,13,50,13],[50,9,53,9],[52,13,53,13],[55,13,56,13],[56,6,61,6],[57,9,60,9],[59,12,71,12],[60,13,61,13],[63,13,64,13],[64,6,68,10],[83,13,84,13],[86,13,87,13],[89,13,90,13],[66,13,67,13],[69,13,70,13],[75,13,76,13],[78,13,79,13]]}
["Contact & Demographic Info",null,null,"Academic Info",null,null,"Pre-Customs To-Do List",null,null,{"$f":"CONCATENATE($B$2,\" (\",$B$3,\")\"&\", \"&B21)","v":{"$error":"#N/A"}},null,null,"Pre-Customs Task Guide",null,null,null,null,"M#",{"$f":"'My Students'!B16","v":0}]
["Name",{"$f":"CONCATENATE(A20,\" \",B20)","v":{"$error":"#N/A"}},null,"Transferred hours",{"$f":"INDEX($S:$S,MATCH(\"HrsEarned\",$R:$R,0))","v":{"$error":"#N/A"}},null,"General",null,null,null,null,null,null,"Task","Where to find info / What to check",null,null,"Deleted",{"$f":"INDEX('My Students'!$2:$16,MATCH($S$1,'My Students'!$B$2:$B$16,0),MATCH(R2,'My Students'!$2:$2,0))","v":{"$error":"#N/A"}}]
["M#",{"$f":"S1","v":0},null,"HS GPA",{"$f":"INDEX($S:$S,MATCH(\"HighSchoolGPA\",$R:$R,0))","v":{"$error":"#N/A"}},null,null,null,"Make stu folder in Z drive",null,null,null,"General","Make stu folder in Z drive","Naming scheme: <major> <conc> <last>, <first> <M#>",null,null,"SAcad",{"$f":"INDEX('My Students'!$2:$16,MATCH($S$1,'My Students'!$B$2:$B$16,0),MATCH(R3,'My Students'!$2:$2,0))","v":{"$error":"#N/A"}}]
["MTSUEmail",{"$f":"INDEX($S:$S,MATCH(A4,$R:$R,0))","v":{"$error":"#N/A"}},null,"Inclusive GPA",{"$f":"INDEX($S:$S,MATCH(\"InclusiveGPA\",$R:$R,0))","v":{"$error":"#N/A"}},null,null,null,"Check admit term",null,null,null,null,null,"e.g., CRJU LAEN Smith, John M01234567",null,null,"VetOrDep",{"$f":"INDEX('My Students'!$2:$16,MATCH($S$1,'My Students'!$B$2:$B$16,0),MATCH(R4,'My Students'!$2:$2,0))","v":{"$error":"#N/A"}}]
["PersonalEmail",{"$f":"INDEX($S:$S,MATCH(A5,$R:$R,0))","v":{"$error":"#N/A"}},null,"ACT Math",{"$f":"INDEX($S:$S,MATCH(\"ACTMathScre\",$R:$R,0))","v":{"$error":"#N/A"}},null,null,null,"Major",null,null,null,null,null,null,null,null,"PREN",{"$f":"INDEX('My Students'!$2:$16,MATCH($S$1,'My Students'!$B$2:$B$16,0),MATCH(R5,'My Students'!$2:$2,0))","v":{"$error":"#N/A"}}]
["PermPhone",{"$f":"INDEX($S:$S,MATCH(A6,$R:$R,0))","v":{"$error":"#N/A"}},null,"ACT Science",{"$f":"INDEX($S:$S,MATCH(\"ACTScienceScre\",$R:$R,0))","v":{"$error":"#N/A"}},null,null,null,"Acad standing (TRs only)",null,null,null,null,"Check admit term","SAAADMS, Customs chart--\"Flags\"",null,null,"1stGen",{"$f":"INDEX('My Students'!$2:$16,MATCH($S$1,'My Students'!$B$2:$B$16,0),MATCH(R6,'My Students'!$2:$2,0))","v":{"$error":"#N/A"}}]
["MailingPhone",{"$f":"INDEX($S:$S,MATCH(A7,$R:$R,0))","v":{"$error":"#N/A"}},null,"CustomsPOS",{"$f":"INDEX($S:$S,MATCH(D7,$R:$R,0))","v":{"$error":"#N/A"}},null,null,null,null,null,null,null,null,null,"If summer: Verify w/ stu before Customs",null,null,"ReverseTransfer",{"$f":"INDEX('My Students'!$2:$16,MATCH($S$1,'My Students'!$B$2:$B$16,0),MATCH(R7,'My Students'!$2:$2,0))","v":{"$error":"#N/A"}}]
[null,null,null,null,{"$f":"INDEX($S:$S,MATCH(\"Major\",$R:$R,0))","v":{"$error":"#N/A"}},null,null,null,null,null,null,null,null,null,null,null,null,"FR/TR",{"$f":"INDEX('My Students'!$2:$16,MATCH($S$1,'My Students'!$B$2:$B$16,0),MATCH(R8,'My Students'!$2:$2,0))","v":{"$error":"#N/A"}}]
["Customs Info",null,null,"BannerPOS",{"$f":"INDEX($S:$S,MATCH(D9,$R:$R,0))","v":{"$error":"#N/A"}},null,"Special Pops",null,null,null,null,null,null,"Major","SGASTDN, Customs chart--\"Academic\" (& updates from stu)",null,null,"StudentName",{"$f":"INDEX('My Students'!$2:$16,MATCH($S$1,'My Students'!$B$2:$B$16,0),MATCH(R9,'My Students'!$2:$2,0))","v":{"$error":"#N/A"}}]
["CountrySlot",{"$f":"INDEX(S:S,MATCH(A10,R:R,0))","v":{"$error":"#N/A"}},null,"Majors match?",{"$f":"IF(AND(E11=\"\",E7=E9),\"Y\",\"N, Submit change of major\")","v":{"$error":"#N/A"}},null,null,null,"Vet benefits",null,null,null,null,null,null,null,null,"Major",{"$f":"INDEX('My Students'!$2:$16,MATCH($S$1,'My Students'!$B$2:$B$16,0),MATCH(R10,'My Students'!$2:$2,0))","v":{"$error":"#N/A"}}]
["Order/Time",{"$f":"CONCATENATE(INDEX(S:S,MATCH(A11,R:R,0)),\" (\",LEFT(S23,2),\")\")","v":{"$error":"#N/A"}},null,"Override major",null,null,null,null,"Student athlete",null,null,null,null,null,null,null,null,"Order/Time",{"$f":"INDEX('My Students'!$2:$16,MATCH($S$1,'My Students'!$B$2:$B$16,0),MATCH(R11,'My Students'!$2:$2,0))","v":{"$error":"#N/A"}}]
["Acad Advisor",{"$f":"INDEX($S:$S,MATCH(\"Assigned Advisor\",$R:$R,0))","v":{"$error":"#N/A"}},null,null,null,null,null,null,"Pre-Professional",null,null,null,null,"Acad standing (TRs only)","SHATERM, SAAADMS, Transcript",null,null,"PrescribedCrsMath",{"$f":"INDEX('My Students'!$2:$16,MATCH($S$1,'My Students'!$B$2:$B$16,0),MATCH(R12,'My Students'!$2:$2,0))","v":{"$error":"#N/A"}},{"$f":"IF(S12=\"college level\",\"n\",IF(S12=0,\"blank--check\",\"y\"))","v":{"$error":"#N/A"}}]
["Customs Advisor",{"$f":"INDEX($S:$S,MATCH(\"Customs Advisor\",$R:$R,0))","v":{"$error":"#N/A"}},null,"Factors in Choosing Classes",null,null,null,null,null,null,null,null,null,null,"Probation on SHATERM? Must take U2020, meet GPA reqs 1st sem.",null,null,"PrescribedCrsWriting",{"$f":"INDEX('My Students'!$2:$16,MATCH($S$1,'My Students'!$B$2:$B$16,0),MATCH(R13,'My Students'!$2:$2,0))","v":{"$error":"#N/A"}},{"$f":"IF(S13=\"college level\",\"n\",IF(S13=0,\"blank--check\",\"y\"))","v":{"$error":"#N/A"}}]
[null,null,null,"Honors",{"$f":"INDEX($S:$S,MATCH(\"HonorsElig\",$R:$R,0))","v":{"$error":"#N/A"}},null,null,null,null,null,null,null,null,null,null,null,null,"PrescribedCrsReading",{"$f":"INDEX('My Students'!$2:$16,MATCH($S$1,'My Students'!$B$2:$B$16,0),MATCH(R14,'My Students'!$2:$2,0))","v":{"$error":"#N/A"}},{"$f":"IF(S14=\"college level\",\"n\",IF(S14=0,\"blank--check\",\"y\"))","v":{"$error":"#N/A"}}]
["Emily's Notes",{"$f":"INDEX($S:$S,MATCH(\"Notes\",$R:$R,0))","v":{"$error":"#N/A"}},null,"Prescribeds",{"$f":"IF(AND(T12=\"n\",T13=\"n\",T14=\"n\"),\"\",\nCONCATENATE(\"Ks: \"&IF(T12=\"y\",S12,\"\")&IF(T13=\"y\",\", \",\"\")&IF(T12=\"blank--check\",\"Math--check; \",\"\")&\nIF(T13=\"y\",\"ENGL\",\"\")&IF(T14=\"y\",\", \",\"\")&IF(T13=\"blank--check\",\"Engl--check; \",\"\")&\nIF(T14=\"y\",\"READ\",\"\")&IF(T15=\"y\",\", \",\"\")&IF(T14=\"blank--check\",\"Read--check; \",\"\")&\nIF(T15=\"y\",\"U1010\",\"\")))","v":{"$error":"#N/A"}},null,null,null,null,null,null,null,null,null,null,null,null,"PrescribedCrsStudySkills",{"$f":"INDEX('My Students'!$2:$16,MATCH($S$1,'My Students'!$B$2:$B$16,0),MATCH(R15,'My Students'!$2:$2,0))","v":{"$error":"#N/A"}},{"$f":"IF((T12<>\"n\")+(T13=\"y\")+(T14=\"y\")>=2,\"y\",\"n\")","v":{"$error":"#N/A"}}]
[null,null,null,null,null,null,"Reg Issues",null,null,null,null,null,"Special Pops","Task","Where to find info / What to check",null,null,"HonorsElig",{"$f":"INDEX('My Students'!$2:$16,MATCH($S$1,'My Students'!$B$2:$B$16,0),MATCH(R16,'My Students'!$2:$2,0))","v":{"$error":"#N/A"}}]
[null,null,null,"Scholars Acad",{"$f":"INDEX($S:$S,MATCH(\"Sacad\",$R:$R,0))","v":{"$error":"#N/A"}},null,null,null,"Immunization issues?",null,null,null,null,"Vet benefits","SAAQUAN, SGASTDN, SPAIDEN, Customs chart--\"Flags\", ask student",null,null,"ACTEngl",{"$f":"INDEX('My Students'!$2:$16,MATCH($S$1,'My Students'!$B$2:$B$16,0),MATCH(R17,'My Students'!$2:$2,0))","v":{"$error":"#N/A"}}]
["Copy-Pastes & Folder Links",null,null,"Pre-Nursing",{"$f":"INDEX($S:$S,MATCH(\"PREN\",$R:$R,0))","v":{"$error":"#N/A"}},null,null,null,"Holds",null,null,null,null,null,"Need a BUAF form?  (FYI: Flag on Customs list doesn't always mean getting vet benefits!!)",null,null,"HighSchoolGPA",{"$f":"INDEX('My Students'!$2:$16,MATCH($S$1,'My Students'!$B$2:$B$16,0),MATCH(R18,'My Students'!$2:$2,0))","v":{"$error":"#N/A"}}]
[{"$f":"INDEX(S:S,MATCH(\"StudentName\",R:R,0))","v":{"$error":"#N/A"}},{"$f":"S1","v":0},null,"ACTEngl",{"$f":"INDEX($S:$S,MATCH(\"ACTEngl\",$R:$R,0))","v":{"$error":"#N/A"}},null,null,null,null,null,null,null,null,null,null,null,null,"ACTCompositeScore",{"$f":"INDEX('My Students'!$2:$16,MATCH($S$1,'My Students'!$B$2:$B$16,0),MATCH(R19,'My Students'!$2:$2,0))","v":{"$error":"#N/A"}}]
[{"$f":"IFERROR(MID(A19,SEARCH(\" \",A19,1)+1,SEARCH(\" \",A19,SEARCH(\" \",A19,1)+1)-SEARCH(\" \",A19,1)-1),MID(A19,FIND(\" \",A19)+1,256))","v":{"$error":"#N/A"}},{"$f":"CONCATENATE(LEFT(A19,FIND(\", \",A19,1)-1))","v":{"$error":"#N/A"}},null,null,null,null,null,null,null,null,null,null,null,"Student athlete","SGASPRT (Also on main Customs spreadsheet but not sure if accurate)",null,null,"InclusiveGPA",{"$f":"INDEX('My Students'!$2:$16,MATCH($S$1,'My Students'!$B$2:$B$16,0),MATCH(R20,'My Students'!$2:$2,0))","v":{"$error":"#N/A"}}]
["Major name",{"$f":"CONCATENATE(IF(E11=\"\",INDEX('Data Lists'!$B:$B,MATCH($E$7,'Data Lists'!$A:$A,0)),CONCATENATE(INDEX('Data Lists'!$B:$B,MATCH($E$11,'Data Lists'!$B:$B,0))&IF(E18=\"Y\",\" (PREN)\")&\"\")))","v":{"$error":"#N/A"}},null,"Flags",null,null,null,null,null,null,null,null,null,null,"Stu meet with SAEC advisor; Scheduling challenges; Major changes approved through SAEC",null,null,"HrsEarned",{"$f":"INDEX('My Students'!$2:$16,MATCH($S$1,'My Students'!$B$2:$B$16,0),MATCH(R21,'My Students'!$2:$2,0))","v":{"$error":"#N/A"}}]
["Folder name",{"$f":"IF(E11=\"\",CONCATENATE(INDEX('Data Lists'!$E:$E,MATCH($E$7,'Data Lists'!$A:$A,0)),\" \",B20,\", \",A20,\" \",B3),CONCATENATE(INDEX('Data Lists'!$E:$E,MATCH($E$11,'Data Lists'!$B:$B,0)),\" \",B20,\", \",A20,\" \",B3))","v":{"$error":"#N/A"}},null,"Holds",{"$f":"INDEX($S:$S,MATCH(D22,$R:$R,0))","v":{"$error":"#N/A"}},null,null,null,null,null,null,null,null,null,null,null,null,"CountrySlot",{"$f":"INDEX('My Students'!$2:$16,MATCH($S$1,'My Students'!$B$2:$B$16,0),MATCH(R22,'My Students'!$2:$2,0))","v":{"$error":"#N/A"}}]
["Dept folders",{"$f":"HYPERLINK(CONCATENATE(\"Z:\\CoBHS Advising\\Departments\\\",IF(E11=\"\",INDEX('Data Lists'!D:D,MATCH(E7,'Data Lists'!A:A,0)),INDEX('Data Lists'!D:D,MATCH(E11,'Data Lists'!B:B,0))),\"\\Student Forms\\\"))","v":{"$error":"#N/A"}},null,"Reg Restrictions",{"$f":"INDEX($S:$S,MATCH(\"RegistrationRestrictions\",$R:$R,0))","v":{"$error":"#N/A"}},null,"Transcripts",null,null,null,null,null,null,"Pre-Professional","May not know until stu or CBAS reports to us; ask in welcome email!",null,null,"CUSTOMSGrp",{"$f":"INDEX('My Students'!$2:$16,MATCH($S$1,'My Students'!$B$2:$B$16,0),MATCH(R23,'My Students'!$2:$2,0))","v":{"$error":"#N/A"}}]
["Stu folder",{"$f":"HYPERLINK(CONCATENATE(\"Z:\\CoBHS Advising\\Departments\\\",IF(E11=\"\",INDEX('Data Lists'!D:D,MATCH(E7,'Data Lists'!A:A,0)),INDEX('Data Lists'!D:D,MATCH(E11,'Data Lists'!B:B,0))),\"\\Student Forms\\\",B22))","v":{"$error":"#N/A"}},null,"Immunizations",{"$f":"INDEX($S:$S,MATCH(\"RegistrationRestrictions\",$R:$R,0))","v":{"$error":"#N/A"}},null,null,null,"Prior schools",null,null,null,null,null,"Provide Pre-Prof info packet and info session flyer",null,null,"CustomsPOS",{"$f":"INDEX('My Students'!$2:$16,MATCH($S$1,'My Students'!$B$2:$B$16,0),MATCH(R24,'My Students'!$2:$2,0))","v":{"$error":"#N/A"}}]
[null,null,{"$f":"YEARFRAC(S33,NOW())","v":{"$error":"#N/A"}},"Under 18 & Imm",{"$f":"IF(C25>=18,\"OK--over 18\",\"If need imms, will need parent sig\")","v":{"$error":"#N/A"}},null,null,null,"Missing classes/transcripts",null,null,null,null,null,null,null,null,"BannerPOS",{"$f":"INDEX('My Students'!$2:$16,MATCH($S$1,'My Students'!$B$2:$B$16,0),MATCH(R25,'My Students'!$2:$2,0))","v":{"$error":"#N/A"}}]
[null,null,null,"Missing Items",{"$f":"INDEX($S:$S,MATCH(\"MissingChecklistItems\",$R:$R,0))","v":{"$error":"#N/A"}},null,null,null,"Subs needed",null,null,null,null,null,null,null,null,"Assigned Advisor",{"$f":"INDEX('My Students'!$2:$16,MATCH($S$1,'My Students'!$B$2:$B$16,0),MATCH(R26,'My Students'!$2:$2,0))","v":{"$error":"#N/A"}}]
[null,null,null,"Term",{"$f":"INDEX($S:$S,MATCH(\"TermDesc\",$R:$R,0))","v":{"$error":"#N/A"}},null,null,null,null,null,null,null,"Reg Issues","Task","Where to find info / What to check",null,null,"Customs Advisor",{"$f":"INDEX('My Students'!$2:$16,MATCH($S$1,'My Students'!$B$2:$B$16,0),MATCH(R27,'My Students'!$2:$2,0))","v":{"$error":"#N/A"}}]
[null,null,null,"Might need BUAF",{"$f":"INDEX($S:$S,MATCH(\"VetOrDep\",$R:$R,0))","v":{"$error":"#N/A"}},null,null,null,null,null,null,null,null,"Immunization issues?","Banner: SZAITRK",null,null,"Holds",{"$f":"INDEX('My Students'!$2:$16,MATCH($S$1,'My Students'!$B$2:$B$16,0),MATCH(R28,'My Students'!$2:$2,0))","v":{"$error":"#N/A"}}]
[null,null,null,"Reverse Transfer",{"$f":"INDEX($S:$S,MATCH(\"ReverseTransfer\",$R:$R,0))","v":{"$error":"#N/A"}},null,null,null,null,null,null,null,null,null,"Missing imm docs, under 18--need parent form",null,null,"RegistrationRestrictions",{"$f":"INDEX('My Students'!$2:$16,MATCH($S$1,'My Students'!$B$2:$B$16,0),MATCH(R29,'My Students'!$2:$2,0))","v":{"$error":"#N/A"}}]
[null,null,null,"First Generation",{"$f":"INDEX($S:$S,MATCH(\"1stGen\",$R:$R,0))","v":{"$error":"#N/A"}},null,"Course Types",null,null,null,null,null,null,null,null,null,null,"MissingChecklistItems",{"$f":"INDEX('My Students'!$2:$16,MATCH($S$1,'My Students'!$B$2:$B$16,0),MATCH(R30,'My Students'!$2:$2,0))","v":{"$error":"#N/A"}}]
["Want to add a link to the student's folder? ",null,null,null,null,null,null,null,"Prescribeds",null,null,null,null,"Holds","SOAHOLD, Customs chart--\"Factors\"",null,null,"AdmissionDecision",{"$f":"INDEX('My Students'!$2:$16,MATCH($S$1,'My Students'!$B$2:$B$16,0),MATCH(R31,'My Students'!$2:$2,0))","v":{"$error":"#N/A"}}]
["--Click on the \"Stu folder\" field above (B21).",null,null,null,null,null,null,null,"Check RLC options",null,null,null,null,null,null,null,null,"TermDesc",{"$f":"INDEX('My Students'!$2:$16,MATCH($S$1,'My Students'!$B$2:$B$16,0),MATCH(R32,'My Students'!$2:$2,0))","v":{"$error":"#N/A"}}]
["--Control-K to start the process of creating a link.",null,null,null,null,null,null,null,"Honors",null,null,null,null,null,null,null,null,"DateofBirth",{"$f":"INDEX('My Students'!$2:$16,MATCH($S$1,'My Students'!$B$2:$B$16,0),MATCH(R33,'My Students'!$2:$2,0))","v":{"$error":"#N/A"}}]
["--Browse to the student's folder.",null,null,null,null,null,null,null,"Pre-Nursing",null,null,null,null,null,null,null,null,"Notes",{"$f":"INDEX('My Students'!$2:$16,MATCH($S$1,'My Students'!$B$2:$B$16,0),MATCH(R34,'My Students'!$2:$2,0))","v":{"$error":"#N/A"}}]
["--Choose any file in the folder and double-click on it.",null,null,null,null,null,null,null,null,null,null,null,"Check Transcripts","Task","Where to find info / What to check",null,null,"MTSUEmail",{"$f":"INDEX('My Students'!$2:$16,MATCH($S$1,'My Students'!$B$2:$B$16,0),MATCH(R35,'My Students'!$2:$2,0))","v":{"$error":"#N/A"}}]
["--In the Address box, delete the file name (back to the \\ after the folder name).",null,null,null,null,null,null,null,null,null,null,null,null,"Prior schools","Banner: SOAPCOL / Pipeline: Prior College Info",null,null,"PersonalEmail",{"$f":"INDEX('My Students'!$2:$16,MATCH($S$1,'My Students'!$B$2:$B$16,0),MATCH(R36,'My Students'!$2:$2,0))","v":{"$error":"#N/A"}}]
["--Click OK.",null,null,null,null,null,"Major-Specific",null,null,null,null,null,null,null,null,null,null,"PermPhone",{"$f":"INDEX('My Students'!$2:$16,MATCH($S$1,'My Students'!$B$2:$B$16,0),MATCH(R37,'My Students'!$2:$2,0))","v":{"$error":"#N/A"}}]
["--Now you should see the path to the folder, underlined as a link.",null,null,null,null,null,null,null,null,null,null,null,null,null,null,null,null,"MailingPhone",{"$f":"INDEX('My Students'!$2:$16,MATCH($S$1,'My Students'!$B$2:$B$16,0),MATCH(R38,'My Students'!$2:$2,0))","v":{"$error":"#N/A"}}]
["--When you click on your link, the folder should open in a separate window.",null,null,null,null,null,null,null,null,null,null,null,null,"Missing classes/ transcripts","BDMS (Banner: SAAADMS, click search icon) / Pline: Transfer Eval / Ask stu in welcome email",null,null,"NursElig",{"$f":"INDEX('My Students'!$2:$16,MATCH($S$1,'My Students'!$B$2:$B$16,0),MATCH(R39,'My Students'!$2:$2,0))","v":{"$error":"#N/A"}}]
[null,null,null,null,null,null,null,null,null,null,null,null,null,null,"FRs: AP, IB, DE, Dual Credit, Cambridge  /  TRs: Sems in progress or missing from MT transcript",null,null,"ACTMathScre",{"$f":"INDEX('My Students'!$2:$16,MATCH($S$1,'My Students'!$B$2:$B$16,0),MATCH(R40,'My Students'!$2:$2,0))","v":{"$error":"#N/A"}}]
[null,null,null,null,null,null,null,null,null,null,null,null,null,null,null,null,null,"ACTScienceScre",{"$f":"INDEX('My Students'!$2:$16,MATCH($S$1,'My Students'!$B$2:$B$16,0),MATCH(R41,'My Students'!$2:$2,0))","v":{"$error":"#N/A"}}]
[null,null,null,null,null,null,null,null,null,null,null,null,null,"Subs needed","By comparing transcript, transfer eval, & UD form.  Use TES for course descriptions.",null,null,"A&P?",{"$f":"IF(S1<>\"\",IF(OR(AND(S40=21,S41>21),AND(S40>21,S41=21)),\"maybe\",IF(AND(S31>=21,S41>=21),\"Y\",\"N\")),\"\")","v":{"$error":"#N/A"}}]
[null,null,null,null,null,null,null,null,null,null,null,null,null,null,"Any classes that might/should count but aren't?",null,null,"Major by Look-up",{"$f":"INDEX('Data Lists'!B:B,MATCH(S24,'Data Lists'!A:A,0))","v":{"$error":"#N/A"}}]
[null,null,null,null,null,null,"Notes:",null,null,null,null,null,null,null,null,null,null,"NameM#",{"$f":"CONCATENATE(S47,\", \",S46,\" \",S45)","v":{"$error":"#N/A"}}]
[null,null,null,null,null,null,null,null,null,null,null,null,"Pre-Customs Task Guide--Page 2",null,null,null,null,"M# copy",{"$f":"S1","v":0}]
[null,null,null,null,null,null,null,null,null,null,null,null,"Specific Course Types","Task","Where to find info / What to check",null,null,"Fname",{"$f":"IF(1<>\"\",IFERROR(MID(S9,SEARCH(\" \",S9,1)+1,SEARCH(\" \",S9,SEARCH(\" \",S9,1)+1)-SEARCH(\" \",S9,1)-1),MID(S9,FIND(\" \",S9)+1,256)),\"\")","v":{"$error":"#N/A"}}]
[null,null,null,null,null,null,null,null,null,null,null,null,null,"Prescribeds","Compare SZAADEF and SOATEST scores",null,null,"Lname",{"$f":"IF(S1<>\"\",CONCATENATE(LEFT(S9,FIND(\", \",S9,1)-1)),\"\")","v":{"$error":"#N/A"}}]
[null,null,null,null,null,null,null,null,null,null,null,null,null,null,"Do they match? What K classes are required?  (\"SAILS Math\"=1010 or 1530 non-K or 1710K)"]
[null,null,null,null,null,null,"Post-Customs To-Do List",null,null,{"$f":"CONCATENATE($B$2,\" (\",$B$3,\")\")","v":{"$error":"#N/A"}}]
[null,null,null,null,null,null,"General",null,null,null,null,null,null,"Check RLC options","Based on class list"]
[null,null,null,null,null,null,null,null,"Assign advisor in Banner",null,null,null,null,null,"Must use for students who need READ 1000K/HIST 2020. May recommend for other students."]
[null,null,null,null,null,null,null,null,"Submit appointment report"]
[null,null,null,null,null,null,null,null,null,null,null,null,null,"Honors","Customs chart--\"Factors\" box"]
[null,null,null,null,null,null,null,null,null,null,null,null,null,null,"Is the student eligible to take honors classes? If TR, email Judy Albakry to add honors code."]
[]
[null,null,null,null,null,null,null,null,null,null,null,null,null,"Pre-Nursing","Customs chart--\"Factors\" box"]
[null,null,null,null,null,null,"Special Pops",null,null,null,null,null,null,null,"Do they need different gen eds for PREN vs major?"]
[null,null,null,null,null,null,null,null,"Vet benefits"]
[null,null,null,null,null,null,null,null,"Submit change of major form"]
[null,null,null,null,null,null,null,null,"Send follow-up emails, if needed",null,null,null,"Major-Specific Checks","Task","Where to find info / What to check"]
[null,null,null,null,null,null,null,null,null,null,null,null,null,"Check advising folder","Should have UD form, Reg checklist, anything else specific to major"]
[]
[]
[null,null,null,null,null,null,"Notes:"]
[]
[]
["Copy-Pastes & Folder Links",null,null,"MTSUEmail",{"$f":"B4","v":{"$error":"#N/A"}}]
[{"$f":"A19","v":{"$error":"#N/A"}},{"$f":"$S$1","v":0},null,"PersonalEmail",{"$f":"B5","v":{"$error":"#N/A"}}]
[{"$f":"A20","v":{"$error":"#N/A"}},{"$f":"B20","v":{"$error":"#N/A"}},null,"CustomsPOS",{"$f":"E7","v":{"$error":"#N/A"}}]
["Major name",{"$f":"B21","v":{"$error":"#N/A"}},null,null,{"$f":"E8","v":{"$error":"#N/A"}}]
["Folder name",{"$error":"#N/A"},null,"BannerPOS",{"$f":"E9","v":{"$error":"#N/A"}}]
["Dept folders",{"$f":"HYPERLINK(B24)","v":{"$error":"#N/A"}},null,"Majors match?",{"$f":"E10","v":{"$error":"#N/A"}}]
["Stu folder",{"$f":"HYPERLINK(B25)","v":""},null,"Override major",{"$f":"E11","v":0}]
[null,null,null,"Might need BUAF",{"$f":"E28","v":{"$error":"#N/A"}},null,null,null,null,null,null,null,"Post-Customs Task Guide"]
[null,null,null,null,null,null,null,null,null,null,null,null,"General","Task","Where to find info / What to check"]
["Start",null,null,"Change major",null,null,null,null,null,null,null,null,null,"Assign advisor in Banner","SGAADVR"]
["Stop",null,null,"Notes for advisor",null,null,null,null,null,null,null,null,null,null,"Our type is COLL; We generally are the primary advisor."]
[]
[null,"Report Builder",null,null,"Student Message Builder",null,null,null,null,null,null,null,null,"Submit appointment report","Navigate (SSC)"]
["Registered",null,"see below","Docs attached",null,"x (to say that you've attached docs for the student)"]
["Attaching Scan",null,"x","Drop/Add info",null,"x (to give info on switching classes & steps to do so)"]
["Submitted COM",null,"x","Acad success tips",null,"x (to give acad tips, tutoring & SI websites, & \"ask for help\")"]
["Supp Instructn",null,"x","NURS Info Session",null,"x (to refer student to nursing info webpage and session)",null,null,null,null,null,null,"Special Pops","Task","Where to find info / What to check"]
["RTTP",null,"x","Check phone #",null,"x (to tell stu their listed ph #s are wrong, & how to fix)",null,null,null,null,null,null,null,"Vet benefits","Submit BUAF"]
["Note 1",null,"x","Advisor info",{"$f":"INDEX('Data Lists'!$J:$J,MATCH($B$12,'Data Lists'!$H:$H,0))","v":{"$error":"#N/A"}},"(leave formula, or type \"me <email>\")",null,null,null,null,null,null,null,null,"Form: Z:> Advising> Advising Forms> \"VA Benefit User Adv Form\"; Submit: V drive along w/ UD form"]
["Other",null,"[notes]","Other",null,"[type any notes to student]"]
["Paste in advising report:",{"$f":"CONCATENATE(\"Student came for advising during Customs.\",IF(B81<>\"\",\"  Attaching scanned copy of notes.\",\"\"),IF(B80=\"a\",Messages!$C$2,IF(B80=\"b\",Messages!$C$3,IF(B80<>\"\",CONCATENATE(\"  Registered student for classes for upcoming semester: \",B80),\"\"))),IF(B86<>\"\",CONCATENATE(\"\n\n\",B86),\"\"),IF(B82<>\"\",\"\n\nSubmitted change of major form. \",\"\"),IF(B83<>\"\",Messages!$C$4,\"\"),IF(B84<>\"\",Messages!$C$5,\"\"),IF(B85<>\"\",Messages!$C$6,\"\"))","v":"Student came for advising during Customs."},null,"Paste in stu msg:",{"$f":"CONCATENATE(\"We enjoyed seeing you at the CBHS Advising Center Customs session today, \",$A$21,\"!  \",IF(E80=\"x\",\"I've attached your Registration Checklist, for your records.\",\"\"),IF(E86<>\"\",CONCATENATE(\"\n\n\",E86),\"\"),IF(E81=\"x\",CONCATENATE(Messages!$C$7&E85&\", before making changes.\"),\"\"),IF(E84=\"x\",Messages!$C$10,\"\"),IF(E82=\"x\",Messages!$C$8,\"\"),IF(E83<>\"\",Messages!$C$9,\"\"),CONCATENATE(\"\n\nIf you have any questions or concerns, please contact \"&E85&\".  You'll also want to plan to come in for an advising appointment around mid-terms each semester, to talk about your classes for the upcoming term.  You can find Instructions and Schedule links at mtsu.edu/cbhsadv. \"),\"\n\nWe look forward to seeing you at MTSU this semester!\n\n\",$B$2,\"\n\",$B$3)","v":{"$error":"#N/A"}},null,null,null,null,null,null,null,null,"Submit change of major form","(If applicable)  Pipeline > Bottom of Advisor menu"]
["\"Registered\" choices: \"a\" to get message re stu registering in lab, \"b\" to get message re helping stu register in office, or type list of classes to be inserted."]
[]
["This is what it will say:",null,null,"This is what it will say:",null,null,null,null,null,null,null,null,null,"Send follow-up emails","(if needed)"]
[{"$f":"B87","v":"Student came for advising during Customs."},null,null,{"$f":"E87","v":{"$error":"#N/A"}},null,null,null,null,null,null,null,null,null,null,"e.g., To new advisor if student changed major during advising session"]

{"sheet":"15","index":16,"n_rows":91,"n_cols":20,"rows_kept":91,"cut":false,"hidden":false,"merged":[[90,0,114,1],[90,3,114,4],[1,6,6,6],[2,9,5,9],[2,12,12,12],[14,0,15,0],[14,1,15,1],[14,3,15,3],[14,4,15,4],[15,6,20,6],[82,12,91,12],[74,12,80,12],[2,13,3,13],[5,13,6,13],[8,6,13,6],[8,13,9,13],[9,9,12,9],[11,13,12,13],[16,13,17,13],[19,13,20,13],[22,6,27,6],[22,13,23,13],[23,9,26,9],[26,12,32,12],[27,13,28,13],[29,6,34,6],[30,9,33,9],[30,13,31,13],[15,12,24,12],[16,9,19,9],[34,12,43,12],[35,13,36,13],[36,6,41,6],[37,9,40,9],[38,13,39,13],[41,13,42,13],[44,6,47,10],[45,12,57,12],[46,13,47,13],[49,6,54,6],[49,13,50,13],[50,9,53,9],[52,13,53,13],[55,13,56,13],[56,6,61,6],[57,9,60,9],[59,12,71,12],[60,13,61,13],[63,13,64,13],[64,6,68,10],[83,13,84,13],[86,13,87,13],[89,13,90,13],[66,13,67,13],[69,13,70,13],[75,13,76,13],[78,13,79,13]]}
["Contact & Demographic Info",null,null,"Academic Info",null,null,"Pre-Customs To-Do List",null,null,{"$f":"CONCATENATE($B$2,\" (\",$B$3,\")\"&\", \"&B21)","v":{"$error":"#N/A"}},null,null,"Pre-Customs Task Guide",null,null,null,null,"M#",{"$f":"'My Students'!B17","v":0}]
["Name",{"$f":"CONCATENATE(A20,\" \",B20)","v":{"$error":"#N/A"}},null,"Transferred hours",{"$f":"INDEX($S:$S,MATCH(\"HrsEarned\",$R:$R,0))","v":{"$error":"#N/A"}},null,"General",null,null,null,null,null,null,"Task","Where to find info / What to check",null,null,"Deleted",{"$f":"INDEX('My Students'!$2:$16,MATCH($S$1,'My Students'!$B$2:$B$16,0),MATCH(R2,'My Students'!$2:$2,0))","v":{"$error":"#N/A"}}]
["M#",{"$f":"S1","v":0},null,"HS GPA",{"$f":"INDEX($S:$S,MATCH(\"HighSchoolGPA\",$R:$R,0))","v":{"$error":"#N/A"}},null,null,null,"Make stu folder in Z drive",null,null,null,"General","Make stu folder in Z drive","Naming scheme: <major> <conc> <last>, <first> <M#>",null,null,"SAcad",{"$f":"INDEX('My Students'!$2:$16,MATCH($S$1,'My Students'!$B$2:$B$16,0),MATCH(R3,'My Students'!$2:$2,0))","v":{"$error":"#N/A"}}]
["MTSUEmail",{"$f":"INDEX($S:$S,MATCH(A4,$R:$R,0))","v":{"$error":"#N/A"}},null,"Inclusive GPA",{"$f":"INDEX($S:$S,MATCH(\"InclusiveGPA\",$R:$R,0))","v":{"$error":"#N/A"}},null,null,null,"Check admit term",null,null,null,null,null,"e.g., CRJU LAEN Smith, John M01234567",null,null,"VetOrDep",{"$f":"INDEX('My Students'!$2:$16,MATCH($S$1,'My Students'!$B$2:$B$16,0),MATCH(R4,'My Students'!$2:$2,0))","v":{"$error":"#N/A"}}]
["PersonalEmail",{"$f":"INDEX($S:$S,MATCH(A5,$R:$R,0))","v":{"$error":"#N/A"}},null,"ACT Math",{"$f":"INDEX($S:$S,MATCH(\"ACTMathScre\",$R:$R,0))","v":{"$error":"#N/A"}},null,null,null,"Major",null,null,null,null,null,null,null,null,"PREN",{"$f":"INDEX('My Students'!$2:$16,MATCH($S$1,'My Students'!$B$2:$B$16,0),MATCH(R5,'My Students'!$2:$2,0))","v":{"$error":"#N/A"}}]
["PermPhone",{"$f":"INDEX($S:$S,MATCH(A6,$R:$R,0))","v":{"$error":"#N/A"}},null,"ACT Science",{"$f":"INDEX($S:$S,MATCH(\"ACTScienceScre\",$R:$R,0))","v":{"$error":"#N/A"}},null,null,null,"Acad standing (TRs only)",null,null,null,null,"Check admit term","SAAADMS, Customs chart--\"Flags\"",null,null,"1stGen",{"$f":"INDEX('My Students'!$2:$16,MATCH($S$1,'My Students'!$B$2:$B$16,0),MATCH(R6,'My Students'!$2:$2,0))","v":{"$error":"#N/A"}}]
["MailingPhone",{"$f":"INDEX($S:$S,MATCH(A7,$R:$R,0))","v":{"$error":"#N/A"}},null,"CustomsPOS",{"$f":"INDEX($S:$S,MATCH(D7,$R:$R,0))","v":{"$error":"#N/A"}},null,null,null,null,null,null,null,null,null,"If summer: Verify w/ stu before Customs",null,null,"ReverseTransfer",{"$f":"INDEX('My Students'!$2:$16,MATCH($S$1,'My Students'!$B$2:$B$16,0),MATCH(R7,'My Students'!$2:$2,0))","v":{"$error":"#N/A"}}]
[null,null,null,null,{"$f":"INDEX($S:$S,MATCH(\"Major\",$R:$R,0))","v":{"$error":"#N/A"}},null,null,null,null,null,null,null,null,null,null,null,null,"FR/TR",{"$f":"INDEX('My Students'!$2:$16,MATCH($S$1,'My Students'!$B$2:$B$16,0),MATCH(R8,'My Students'!$2:$2,0))","v":{"$error":"#N/A"}}]
["Customs Info",null,null,"BannerPOS",{"$f":"INDEX($S:$S,MATCH(D9,$R:$R,0))","v":{"$error":"#N/A"}},null,"Special Pops",null,null,null,null,null,null,"Major","SGASTDN, Customs chart--\"Academic\" (& updates from stu)",null,null,"StudentName",{"$f":"INDEX('My Students'!$2:$16,MATCH($S$1,'My Students'!$B$2:$B$16,0),MATCH(R9,'My Students'!$2:$2,0))","v":{"$error":"#N/A"}}]
["CountrySlot",{"$f":"INDEX(S:S,MATCH(A10,R:R,0))","v":{"$error":"#N/A"}},null,"Majors match?",{"$f":"IF(AND(E11=\"\",E7=E9),\"Y\",\"N, Submit change of major\")","v":{"$error":"#N/A"}},null,null,null,"Vet benefits",null,null,null,null,null,null,null,null,"Major",{"$f":"INDEX('My Students'!$2:$16,MATCH($S$1,'My Students'!$B$2:$B$16,0),MATCH(R10,'My Students'!$2:$2,0))","v":{"$error":"#N/A"}}]
["Order/Time",{"$f":"CONCATENATE(INDEX(S:S,MATCH(A11,R:R,0)),\" (\",LEFT(S23,2),\")\")","v":{"$error":"#N/A"}},null,"Override major",null,null,null,null,"Student athlete",null,null,null,null,null,null,null,null,"Order/Time",{"$f":"INDEX('My Students'!$2:$16,MATCH($S$1,'My Students'!$B$2:$B$16,0),MATCH(R11,'My Students'!$2:$2,0))","v":{"$error":"#N/A"}}]
["Acad Advisor",{"$f":"INDEX($S:$S,MATCH(\"Assigned Advisor\",$R:$R,0))","v":{"$error":"#N/A"}},null,null,null,null,null,null,"Pre-Professional",null,null,null,null,"Acad standing (TRs only)","SHATERM, SAAADMS, Transcript",null,null,"PrescribedCrsMath",{"$f":"INDEX('My Students'!$2:$16,MATCH($S$1,'My Students'!$B$2:$B$16,0),MATCH(R12,'My Students'!$2:$2,0))","v":{"$error":"#N/A"}},{"$f":"IF(S12=\"college level\",\"n\",IF(S12=0,\"blank--check\",\"y\"))","v":{"$error":"#N/A"}}]
["Customs Advisor",{"$f":"INDEX($S:$S,MATCH(\"Customs Advisor\",$R:$R,0))","v":{"$error":"#N/A"}},null,"Factors in Choosing Classes",null,null,null,null,null,null,null,null,null,null,"Probation on SHATERM? Must take U2020, meet GPA reqs 1st sem.",null,null,"PrescribedCrsWriting",{"$f":"INDEX('My Students'!$2:$16,MATCH($S$1,'My Students'!$B$2:$B$16,0),MATCH(R13,'My Students'!$2:$2,0))","v":{"$error":"#N/A"}},{"$f":"IF(S13=\"college level\",\"n\",IF(S13=0,\"blank--check\",\"y\"))","v":{"$error":"#N/A"}}]
[null,null,null,"Honors",{"$f":"INDEX($S:$S,MATCH(\"HonorsElig\",$R:$R,0))","v":{"$error":"#N/A"}},null,null,null,null,null,null,null,null,null,null,null,null,"PrescribedCrsReading",{"$f":"INDEX('My Students'!$2:$16,MATCH($S$1,'My Students'!$B$2:$B$16,0),MATCH(R14,'My Students'!$2:$2,0))","v":{"$error":"#N/A"}},{"$f":"IF(S14=\"college level\",\"n\",IF(S14=0,\"blank--check\",\"y\"))","v":{"$error":"#N/A"}}]
["Emily's Notes",{"$f":"INDEX($S:$S,MATCH(\"Notes\",$R:$R,0))","v":{"$error":"#N/A"}},null,"Prescribeds",{"$f":"IF(AND(T12=\"n\",T13=\"n\",T14=\"n\"),\"\",\nCONCATENATE(\"Ks: \"&IF(T12=\"y\",S12,\"\")&IF(T13=\"y\",\", \",\"\")&IF(T12=\"blank--check\",\"Math--check; \",\"\")&\nIF(T13=\"y\",\"ENGL\",\"\")&IF(T14=\"y\",\", \",\"\")&IF(T13=\"blank--check\",\"Engl--check; \",\"\")&\nIF(T14=\"y\",\"READ\",\"\")&IF(T15=\"y\",\", \",\"\")&IF(T14=\"blank--check\",\"Read--check; \",\"\")&\nIF(T15=\"y\",\"U1010\",\"\")))","v":{"$error":"#N/A"}},null,null,null,null,null,null,null,null,null,null,null,null,"PrescribedCrsStudySkills",{"$f":"INDEX('My Students'!$2:$16,MATCH($S$1,'My Students'!$B$2:$B$16,0),MATCH(R15,'My Students'!$2:$2,0))","v":{"$error":"#N/A"}},{"$f":"IF((T12<>\"n\")+(T13=\"y\")+(T14=\"y\")>=2,\"y\",\"n\")","v":{"$error":"#N/A"}}]
[null,null,null,null,null,null,"Reg Issues",null,null,null,null,null,"Special Pops","Task","Where to find info / What to check",null,null,"HonorsElig",{"$f":"INDEX('My Students'!$2:$16,MATCH($S$1,'My Students'!$B$2:$B$16,0),MATCH(R16,'My Students'!$2:$2,0))","v":{"$error":"#N/A"}}]
[null,null,null,"Scholars Acad",{"$f":"INDEX($S:$S,MATCH(\"Sacad\",$R:$R,0))","v":{"$error":"#N/A"}},null,null,null,"Immunization issues?",null,null,null,null,"Vet benefits","SAAQUAN, SGASTDN, SPAIDEN, Customs chart--\"Flags\", ask student",null,null,"ACTEngl",{"$f":"INDEX('My Students'!$2:$16,MATCH($S$1,'My Students'!$B$2:$B$16,0),MATCH(R17,'My Students'!$2:$2,0))","v":{"$error":"#N/A"}}]
["Copy-Pastes & Folder Links",null,null,"Pre-Nursing",{"$f":"INDEX($S:$S,MATCH(\"PREN\",$R:$R,0))","v":{"$error":"#N/A"}},null,null,null,"Holds",null,null,null,null,null,"Need a BUAF form?  (FYI: Flag on Customs list doesn't always mean getting vet benefits!!)",null,null,"HighSchoolGPA",{"$f":"INDEX('My Students'!$2:$16,MATCH($S$1,'My Students'!$B$2:$B$16,0),MATCH(R18,'My Students'!$2:$2,0))","v":{"$error":"#N/A"}}]
[{"$f":"INDEX(S:S,MATCH(\"StudentName\",R:R,0))","v":{"$error":"#N/A"}},{"$f":"S1","v":0},null,"ACTEngl",{"$f":"INDEX($S:$S,MATCH(\"ACTEngl\",$R:$R,0))","v":{"$error":"#N/A"}},null,null,null,null,null,null,null,null,null,null,null,null,"ACTCompositeScore",{"$f":"INDEX('My Students'!$2:$16,MATCH($S$1,'My Students'!$B$2:$B$16,0),MATCH(R19,'My Students'!$2:$2,0))","v":{"$error":"#N/A"}}]
[{"$f":"IFERROR(MID(A19,SEARCH(\" \",A19,1)+1,SEARCH(\" \",A19,SEARCH(\" \",A19,1)+1)-SEARCH(\" \",A19,1)-1),MID(A19,FIND(\" \",A19)+1,256))","v":{"$error":"#N/A"}},{"$f":"CONCATENATE(LEFT(A19,FIND(\", \",A19,1)-1))","v":{"$error":"#N/A"}},null,null,null,null,null,null,null,null,null,null,null,"Student athlete","SGASPRT (Also on main Customs spreadsheet but not sure if accurate)",null,null,"InclusiveGPA",{"$f":"INDEX('My Students'!$2:$16,MATCH($S$1,'My Students'!$B$2:$B$16,0),MATCH(R20,'My Students'!$2:$2,0))","v":{"$error":"#N/A"}}]
["Major name",{"$f":"CONCATENATE(IF(E11=\"\",INDEX('Data Lists'!$B:$B,MATCH($E$7,'Data Lists'!$A:$A,0)),INDEX('Data Lists'!$B:$B,MATCH($E$11,'Data Lists'!$B:$B,0)))&IF(E18=\"Y\",\" (PREN)\",\"\"))","v":{"$error":"#N/A"}},null,"Flags",null,null,null,null,null,null,null,null,null,null,"Stu meet with SAEC advisor; Scheduling challenges; Major changes approved through SAEC",null,null,"HrsEarned",{"$f":"INDEX('My Students'!$2:$16,MATCH($S$1,'My Students'!$B$2:$B$16,0),MATCH(R21,'My Students'!$2:$2,0))","v":{"$error":"#N/A"}}]
["Folder name",{"$f":"IF(E11=\"\",CONCATENATE(INDEX('Data Lists'!$E:$E,MATCH($E$7,'Data Lists'!$A:$A,0)),\" \",B20,\", \",A20,\" \",B3),CONCATENATE(INDEX('Data Lists'!$E:$E,MATCH($E$11,'Data Lists'!$B:$B,0)),\" \",B20,\", \",A20,\" \",B3))","v":{"$error":"#N/A"}},null,"Holds",{"$f":"INDEX($S:$S,MATCH(D22,$R:$R,0))","v":{"$error":"#N/A"}},null,null,null,null,null,null,null,null,null,null,null,null,"CountrySlot",{"$f":"INDEX('My Students'!$2:$16,MATCH($S$1,'My Students'!$B$2:$B$16,0),MATCH(R22,'My Students'!$2:$2,0))","v":{"$error":"#N/A"}}]
["Dept folders",{"$f":"HYPERLINK(CONCATENATE(\"Z:\\CoBHS Advising\\Departments\\\",IF(E11=\"\",INDEX('Data Lists'!D:D,MATCH(E7,'Data Lists'!A:A,0)),INDEX('Data Lists'!D:D,MATCH(E11,'Data Lists'!B:B,0))),\"\\Student Forms\\\"))","v":{"$error":"#N/A"}},null,"Reg Restrictions",{"$f":"INDEX($S:$S,MATCH(\"RegistrationRestrictions\",$R:$R,0))","v":{"$error":"#N/A"}},null,"Transcripts",null,null,null,null,null,null,"Pre-Professional","May not know until stu or CBAS reports to us; ask in welcome email!",null,null,"CUSTOMSGrp",{"$f":"INDEX('My Students'!$2:$16,MATCH($S$1,'My Students'!$B$2:$B$16,0),MATCH(R23,'My Students'!$2:$2,0))","v":{"$error":"#N/A"}}]
["Stu folder",{"$f":"HYPERLINK(CONCATENATE(\"Z:\\CoBHS Advising\\Departments\\\",IF(E11=\"\",INDEX('Data Lists'!D:D,MATCH(E7,'Data Lists'!A:A,0)),INDEX('Data Lists'!D:D,MATCH(E11,'Data Lists'!B:B,0))),\"\\Student Forms\\\",B22))","v":{"$error":"#N/A"}},null,"Immunizations",{"$f":"INDEX($S:$S,MATCH(\"RegistrationRestrictions\",$R:$R,0))","v":{"$error":"#N/A"}},null,null,null,"Prior schools",null,null,null,null,null,"Provide Pre-Prof info packet and info session flyer",null,null,"CustomsPOS",{"$f":"INDEX('My Students'!$2:$16,MATCH($S$1,'My Students'!$B$2:$B$16,0),MATCH(R24,'My Students'!$2:$2,0))","v":{"$error":"#N/A"}}]
[null,null,{"$f":"YEARFRAC(S33,NOW())","v":{"$error":"#N/A"}},"Under 18 & Imm",{"$f":"IF(C25>=18,\"OK--over 18\",\"If need imms, will need parent sig\")","v":{"$error":"#N/A"}},null,null,null,"Missing classes/transcripts",null,null,null,null,null,null,null,null,"BannerPOS",{"$f":"INDEX('My Students'!$2:$16,MATCH($S$1,'My Students'!$B$2:$B$16,0),MATCH(R25,'My Students'!$2:$2,0))","v":{"$error":"#N/A"}}]
[null,null,null,"Missing Items",{"$f":"INDEX($S:$S,MATCH(\"MissingChecklistItems\",$R:$R,0))","v":{"$error":"#N/A"}},null,null,null,"Subs needed",null,null,null,null,null,null,null,null,"Assigned Advisor",{"$f":"INDEX('My Students'!$2:$16,MATCH($S$1,'My Students'!$B$2:$B$16,0),MATCH(R26,'My Students'!$2:$2,0))","v":{"$error":"#N/A"}}]
[null,null,null,"Term",{"$f":"INDEX($S:$S,MATCH(\"TermDesc\",$R:$R,0))","v":{"$error":"#N/A"}},null,null,null,null,null,null,null,"Reg Issues","Task","Where to find info / What to check",null,null,"Customs Advisor",{"$f":"INDEX('My Students'!$2:$16,MATCH($S$1,'My Students'!$B$2:$B$16,0),MATCH(R27,'My Students'!$2:$2,0))","v":{"$error":"#N/A"}}]
[null,null,null,"Might need BUAF",{"$f":"INDEX($S:$S,MATCH(\"VetOrDep\",$R:$R,0))","v":{"$error":"#N/A"}},null,null,null,null,null,null,null,null,"Immunization issues?","Banner: SZAITRK",null,null,"Holds",{"$f":"INDEX('My Students'!$2:$16,MATCH($S$1,'My Students'!$B$2:$B$16,0),MATCH(R28,'My Students'!$2:$2,0))","v":{"$error":"#N/A"}}]
[null,null,null,"Reverse Transfer",{"$f":"INDEX($S:$S,MATCH(\"ReverseTransfer\",$R:$R,0))","v":{"$error":"#N/A"}},null,null,null,null,null,null,null,null,null,"Missing imm docs, under 18--need parent form",null,null,"RegistrationRestrictions",{"$f":"INDEX('My Students'!$2:$16,MATCH($S$1,'My Students'!$B$2:$B$16,0),MATCH(R29,'My Students'!$2:$2,0))","v":{"$error":"#N/A"}}]
[null,null,null,"First Generation",{"$f":"INDEX($S:$S,MATCH(\"1stGen\",$R:$R,0))","v":{"$error":"#N/A"}},null,"Course Types",null,null,null,null,null,null,null,null,null,null,"MissingChecklistItems",{"$f":"INDEX('My Students'!$2:$16,MATCH($S$1,'My Students'!$B$2:$B$16,0),MATCH(R30,'My Students'!$2:$2,0))","v":{"$error":"#N/A"}}]
["Want to add a link to the student's folder? ",null,null,null,null,null,null,null,"Prescribeds",null,null,null,null,"Holds","SOAHOLD, Customs chart--\"Factors\"",null,null,"AdmissionDecision",{"$f":"INDEX('My Students'!$2:$16,MATCH($S$1,'My Students'!$B$2:$B$16,0),MATCH(R31,'My Students'!$2:$2,0))","v":{"$error":"#N/A"}}]
["--Click on the \"Stu folder\" field above (B21).",null,null,null,null,null,null,null,"Check RLC options",null,null,null,null,null,null,null,null,"TermDesc",{"$f":"INDEX('My Students'!$2:$16,MATCH($S$1,'My Students'!$B$2:$B$16,0),MATCH(R32,'My Students'!$2:$2,0))","v":{"$error":"#N/A"}}]
["--Control-K to start the process of creating a link.",null,null,null,null,null,null,null,"Honors",null,null,null,null,null,null,null,null,"DateofBirth",{"$f":"INDEX('My Students'!$2:$16,MATCH($S$1,'My Students'!$B$2:$B$16,0),MATCH(R33,'My Students'!$2:$2,0))","v":{"$error":"#N/A"}}]
["--Browse to the student's folder.",null,null,null,null,null,null,null,"Pre-Nursing",null,null,null,null,null,null,null,null,"Notes",{"$f":"INDEX('My Students'!$2:$16,MATCH($S$1,'My Students'!$B$2:$B$16,0),MATCH(R34,'My Students'!$2:$2,0))","v":{"$error":"#N/A"}}]
["--Choose any file in the folder and double-click on it.",null,null,null,null,null,null,null,null,null,null,null,"Check Transcripts","Task","Where to find info / What to check",null,null,"MTSUEmail",{"$f":"INDEX('My Students'!$2:$16,MATCH($S$1,'My Students'!$B$2:$B$16,0),MATCH(R35,'My Students'!$2:$2,0))","v":{"$error":"#N/A"}}]
["--In the Address box, delete the file name (back to the \\ after the folder name).",null,null,null,null,null,null,null,null,null,null,null,null,"Prior schools","Banner: SOAPCOL / Pipeline: Prior College Info",null,null,"PersonalEmail",{"$f":"INDEX('My Students'!$2:$16,MATCH($S$1,'My Students'!$B$2:$B$16,0),MATCH(R36,'My Students'!$2:$2,0))","v":{"$error":"#N/A"}}]
["--Click OK.",null,null,null,null,null,"Major-Specific",null,null,null,null,null,null,null,null,null,null,"PermPhone",{"$f":"INDEX('My Students'!$2:$16,MATCH($S$1,'My Students'!$B$2:$B$16,0),MATCH(R37,'My Students'!$2:$2,0))","v":{"$error":"#N/A"}}]
["--Now you should see the path to the folder, underlined as a link.",null,null,null,null,null,null,null,null,null,null,null,null,null,null,null,null,"MailingPhone",{"$f":"INDEX('My Students'!$2:$16,MATCH($S$1,'My Students'!$B$2:$B$16,0),MATCH(R38,'My Students'!$2:$2,0))","v":{"$error":"#N/A"}}]
["--When you click on your link, the folder should open in a separate window.",null,null,null,null,null,null,null,null,null,null,null,null,"Missing classes/ transcripts","BDMS (Banner: SAAADMS, click search icon) / Pline: Transfer Eval / Ask stu in welcome email",null,null,"NursElig",{"$f":"INDEX('My Students'!$2:$16,MATCH($S$1,'My Students'!$B$2:$B$16,0),MATCH(R39,'My Students'!$2:$2,0))","v":{"$error":"#N/A"}}]
[null,null,null,null,null,null,null,null,null,null,null,null,null,null,"FRs: AP, IB, DE, Dual Credit, Cambridge  /  TRs: Sems in progress or missing from MT transcript",null,null,"ACTMathScre",{"$f":"INDEX('My Students'!$2:$16,MATCH($S$1,'My Students'!$B$2:$B$16,0),MATCH(R40,'My Students'!$2:$2,0))","v":{"$error":"#N/A"}}]
[null,null,null,null,null,null,null,null,null,null,null,null,null,null,null,null,null,"ACTScienceScre",{"$f":"INDEX('My Students'!$2:$16,MATCH($S$1,'My Students'!$B$2:$B$16,0),MATCH(R41,'My Students'!$2:$2,0))","v":{"$error":"#N/A"}}]
[null,null,null,null,null,null,null,null,null,null,null,null,null,"Subs needed","By comparing transcript, transfer eval, & UD form.  Use TES for course descriptions.",null,null,"A&P?",{"$f":"IF(S1<>\"\",IF(OR(AND(S40=21,S41>21),AND(S40>21,S41=21)),\"maybe\",IF(AND(S31>=21,S41>=21),\"Y\",\"N\")),\"\")","v":{"$error":"#N/A"}}]
[null,null,null,null,null,null,null,null,null,null,null,null,null,null,"Any classes that might/should count but aren't?",null,null,"Major by Look-up",{"$f":"INDEX('Data Lists'!B:B,MATCH(S24,'Data Lists'!A:A,0))","v":{"$error":"#N/A"}}]
[null,null,null,null,null,null,"Notes:",null,null,null,null,null,null,null,null,null,null,"NameM#",{"$f":"CONCATENATE(S47,\", \",S46,\" \",S45)","v":{"$error":"#N/A"}}]
[null,null,null,null,null,null,null,null,null,null,null,null,"Pre-Customs Task Guide--Page 2",null,null,null,null,"M# copy",{"$f":"S1","v":0}]
[null,null,null,null,null,null,null,null,null,null,null,null,"Specific Course Types","Task","Where to find info / What to check",null,null,"Fname",{"$f":"IF(1<>\"\",IFERROR(MID(S9,SEARCH(\" \",S9,1)+1,SEARCH(\" \",S9,SEARCH(\" \",S9,1)+1)-SEARCH(\" \",S9,1)-1),MID(S9,FIND(\" \",S9)+1,256)),\"\")","v":{"$error":"#N/A"}}]
[null,null,null,null,null,null,null,null,null,null,null,null,null,"Prescribeds","Compare SZAADEF and SOATEST scores",null,null,"Lname",{"$f":"IF(S1<>\"\",CONCATENATE(LEFT(S9,FIND(\", \",S9,1)-1)),\"\")","v":{"$error":"#N/A"}}]
[null,null,null,null,null,null,null,null,null,null,null,null,null,null,"Do they match? What K classes are required?  (\"SAILS Math\"=1010 or 1530 non-K or 1710K)"]
[null,null,null,null,null,null,"Post-Customs To-Do List",null,null,{"$f":"CONCATENATE($B$2,\" (\",$B$3,\")\")","v":{"$error":"#N/A"}}]
[null,null,null,null,null,null,"General",null,null,null,null,null,null,"Check RLC options","Based on class list"]
[null,null,null,null,null,null,null,null,"Assign advisor in Banner",null,null,null,null,null,"Must use for students who need READ 1000K/HIST 2020. May recommend for other students."]
[null,null,null,null,null,null,null,null,"Submit appointment report"]
[null,null,null,null,null,null,null,null,null,null,null,null,null,"Honors","Customs chart--\"Factors\" box"]
[null,null,null,null,null,null,null,null,null,null,null,null,null,null,"Is the student eligible to take honors classes? If TR, email Judy Albakry to add honors code."]
[]
[null,null,null,null,null,null,null,null,null,null,null,null,null,"Pre-Nursing","Customs chart--\"Factors\" box"]
[null,null,null,null,null,null,"Special Pops",null,null,null,null,null,null,null,"Do they need different gen eds for PREN vs major?"]
[null,null,null,null,null,null,null,null,"Vet benefits"]
[null,null,null,null,null,null,null,null,"Submit change of major form"]
[null,null,null,null,null,null,null,null,"Send follow-up emails, if needed",null,null,null,"Major-Specific Checks","Task","Where to find info / What to check"]
[null,null,null,null,null,null,null,null,null,null,null,null,null,"Check advising folder","Should have UD form, Reg checklist, anything else specific to major"]
[]
[]
[null,null,null,null,null,null,"Notes:"]
[]
[]
["Copy-Pastes & Folder Links",null,null,"MTSUEmail",{"$f":"B4","v":{"$error":"#N/A"}}]
[{"$f":"A19","v":{"$error":"#N/A"}},{"$f":"$S$1","v":0},null,"PersonalEmail",{"$f":"B5","v":{"$error":"#N/A"}}]
[{"$f":"A20","v":{"$error":"#N/A"}},{"$f":"B20","v":{"$error":"#N/A"}},null,"CustomsPOS",{"$f":"E7","v":{"$error":"#N/A"}}]
["Major name",{"$f":"B21","v":{"$error":"#N/A"}},null,null,{"$f":"E8","v":{"$error":"#N/A"}}]
["Folder name",{"$error":"#N/A"},null,"BannerPOS",{"$f":"E9","v":{"$error":"#N/A"}}]
["Dept folders",{"$f":"HYPERLINK(B24)","v":{"$error":"#N/A"}},null,"Majors match?",{"$f":"E10","v":{"$error":"#N/A"}}]
["Stu folder",{"$f":"HYPERLINK(B25)","v":""},null,"Override major",{"$f":"E11","v":0}]
[null,null,null,"Might need BUAF",{"$f":"E28","v":{"$error":"#N/A"}},null,null,null,null,null,null,null,"Post-Customs Task Guide"]
[null,null,null,null,null,null,null,null,null,null,null,null,"General","Task","Where to find info / What to check"]
["Start",null,null,"Change major",null,null,null,null,null,null,null,null,null,"Assign advisor in Banner","SGAADVR"]
["Stop",null,null,"Notes for advisor",null,null,null,null,null,null,null,null,null,null,"Our type is COLL; We generally are the primary advisor."]
[]
[null,"Report Builder",null,null,"Student Message Builder",null,null,null,null,null,null,null,null,"Submit appointment report","Navigate (SSC)"]
["Registered",null,"see below","Docs attached",null,"x (to say that you've attached docs for the student)"]
["Attaching Scan",null,"x","Drop/Add info",null,"x (to give info on switching classes & steps to do so)"]
["Submitted COM",null,"x","Acad success tips",null,"x (to give acad tips, tutoring & SI websites, & \"ask for help\")"]
["Supp Instructn",null,"x","NURS Info Session",null,"x (to refer student to nursing info webpage and session)",null,null,null,null,null,null,"Special Pops","Task","Where to find info / What to check"]
["RTTP",null,"x","Check phone #",null,"x (to tell stu their listed ph #s are wrong, & how to fix)",null,null,null,null,null,null,null,"Vet benefits","Submit BUAF"]
["Note 1",null,"x","Advisor info",{"$f":"INDEX('Data Lists'!$J:$J,MATCH($B$12,'Data Lists'!$H:$H,0))","v":{"$error":"#N/A"}},"(leave formula, or type \"me <email>\")",null,null,null,null,null,null,null,null,"Form: Z:> Advising> Advising Forms> \"VA Benefit User Adv Form\"; Submit: V drive along w/ UD form"]
["Other",null,"[notes]","Other",null,"[type any notes to student]"]
["Paste in advising report:",{"$f":"CONCATENATE(\"Student came for advising during Customs.\",IF(B81<>\"\",\"  Attaching scanned copy of notes.\",\"\"),IF(B80=\"a\",Messages!$C$2,IF(B80=\"b\",Messages!$C$3,IF(B80<>\"\",CONCATENATE(\"  Registered student for classes for upcoming semester: \",B80),\"\"))),IF(B86<>\"\",CONCATENATE(\"\n\n\",B86),\"\"),IF(B82<>\"\",\"\n\nSubmitted change of major form. \",\"\"),IF(B83<>\"\",Messages!$C$4,\"\"),IF(B84<>\"\",Messages!$C$5,\"\"),IF(B85<>\"\",Messages!$C$6,\"\"))","v":"Student came for advising during Customs."},null,"Paste in stu msg:",{"$f":"CONCATENATE(\"We enjoyed seeing you at the CBHS Advising Center Customs session today, \",$A$21,\"!  \",IF(E80=\"x\",\"I've attached your Registration Checklist, for your records.\",\"\"),IF(E86<>\"\",CONCATENATE(\"\n\n\",E86),\"\"),IF(E81=\"x\",CONCATENATE(Messages!$C$7&E85&\", before making changes.\"),\"\"),IF(E84=\"x\",Messages!$C$10,\"\"),IF(E82=\"x\",Messages!$C$8,\"\"),IF(E83<>\"\",Messages!$C$9,\"\"),CONCATENATE(\"\n\nIf you have any questions or concerns, please contact \"&E85&\".  You'll also want to plan to come in for an advising appointment around mid-terms each semester, to talk about your classes for the upcoming term.  You can find Instructions and Schedule links at mtsu.edu/cbhsadv. \"),\"\n\nWe look forward to seeing you at MTSU this semester!\n\n\",$B$2,\"\n\",$B$3)","v":{"$error":"#N/A"}},null,null,null,null,null,null,null,null,"Submit change of major form","(If applicable)  Pipeline > Bottom of Advisor menu"]
["\"Registered\" choices: \"a\" to get message re stu registering in lab, \"b\" to get message re helping stu register in office, or type list of classes to be inserted."]
[]
["This is what it will say:",null,null,"This is what it will say:",null,null,null,null,null,null,null,null,null,"Send follow-up emails","(if needed)"]
[{"$f":"B87","v":"Student came for advising during Customs."},null,null,{"$f":"E87","v":{"$error":"#N/A"}},null,null,null,null,null,null,null,null,null,null,"e.g., To new advisor if student changed major during advising session"]

{"sheet":"Printable Task List","index":17,"n_rows":60,"n_cols":4,"rows_kept":60,"cut":false,"hidden":false,"merged":[[52,0,57,0],[53,3,56,3],[22,0,27,0],[23,3,26,3],[29,0,34,0],[30,3,33,3],[36,0,41,0],[37,3,40,3],[15,0,20,0],[16,3,19,3],[0,3,0,4],[44,3,44,4],[45,0,50,0],[46,3,49,3],[1,0,6,0],[2,3,5,3],[8,0,13,0],[9,3,12,3]]}
["Pre-Customs To-Do List",null,null,"Name: _______________________ M#: ____________"]
["General"]
[null,null,"Make stu folder in Z drive"]
[null,null,"Check admit term"]
[null,null,"Major"]
[null,null,"Acad standing (TRs only)"]
[]
[]
["Special Pops"]
[null,null,"Vet benefits"]
[null,null,"Student athlete"]
[null,null,"Pre-Professional"]
[]
[]
[]
["Reg Issues"]
[null,null,"Immunization issues?"]
[null,null,"Holds"]
[]
[]
[]
[]
["Transcripts"]
[null,null,"Prior schools"]
[null,null,"Missing classes/transcripts"]
[null,null,"Subs needed"]
[]
[]
[]
["Course Types"]
[null,null,"Prescribeds"]
[null,null,"Check RLC options"]
[null,null,"Honors"]
[null,null,"Pre-Nursing"]
[]
[]
["Major-Specific"]
[]
[]
[]
[]
[]
[]
["Notes:"]
["Post-Customs To-Do List",null,null,"Name: _______________________ M#: ____________"]
["General"]
[null,null,"Assign advisor in Banner"]
[null,null,"Submit appointment report"]
[]
[]
[]
[]
["Special Pops"]
[null,null,"Vet benefits"]
[null,null,"Submit change of major form"]
[null,null,"Send follow-up emails, if needed"]
[]
[]
[]
["Notes:"]

{"sheet":"Day 1 Notes","index":18,"n_rows":29,"n_cols":7,"rows_kept":29,"cut":false,"hidden":false,"merged":[]}
[{"$f":"CONCATENATE(\"Advisor: \",'My Students'!$Z$3)","v":"Advisor: Amy"},null,null,null,null,null,{"$f":"LEFT(MID(CELL(\"filename\"), SEARCH(\"[\",CELL(\"filename\"))+1,SEARCH(\"]\",CELL(\"filename\"))-SEARCH(\"[\",CELL(\"filename\"))-1),11)","v":"Copy of Cus"}]
["Caseload Students"]
["M#","Student Name","Country","Major","Caseload Adv","Customs Adv","Notes"]
[{"$f":"IF('My Students'!B3<>\"\",'My Students'!B3,\"\")","v":"M00000001"},{"$f":"IFERROR(INDEX('My Students'!$1:$17,MATCH('Day 1 Notes'!$A4,'My Students'!$B:$B,0),MATCH(\"StudentName\",'My Students'!$2:$2,0)),\"\")","v":"Smith, Brenda"},{"$f":"IFERROR(INDEX('Data Lists'!O:O,MATCH(LEFT(INDEX('My Students'!$1:$17,MATCH('Day 1 Notes'!$A4,'My Students'!$B:$B,0),MATCH(\"CountrySlot\",'My Students'!$2:$2,0)),2),'Data Lists'!N:N,0)),\"\")","v":"France"},{"$f":"IFERROR(INDEX('My Students'!$1:$17,MATCH('Day 1 Notes'!$A4,'My Students'!$B:$B,0),MATCH(D$3,'My Students'!$2:$2,0)),\"\")","v":"Psychology (Pre-Grad)"},{"$f":"IFERROR(INDEX('My Students'!$1:$17,MATCH('Day 1 Notes'!$A4,'My Students'!$B:$B,0),MATCH(E$3,'My Students'!$2:$2,0)),\"\")","v":""},{"$f":"IFERROR(INDEX('My Students'!$1:$17,MATCH('Day 1 Notes'!$A4,'My Students'!$B:$B,0),MATCH(F$3,'My Students'!$2:$2,0)),\"\")","v":""}]
[{"$f":"IF('My Students'!B4<>\"\",'My Students'!B4,\"\")","v":"M00000002"},{"$f":"IFERROR(INDEX('My Students'!$1:$17,MATCH('Day 1 Notes'!$A5,'My Students'!$B:$B,0),MATCH(\"StudentName\",'My Students'!$2:$2,0)),\"\")","v":"Cook, Alan"},{"$f":"IFERROR(INDEX('Data Lists'!O:O,MATCH(LEFT(INDEX('My Students'!$1:$17,MATCH('Day 1 Notes'!$A5,'My Students'!$B:$B,0),MATCH(\"CountrySlot\",'My Students'!$2:$2,0)),2),'Data Lists'!N:N,0)),\"\")","v":"France"},{"$f":"IFERROR(INDEX('My Students'!$1:$17,MATCH('Day 1 Notes'!$A5,'My Students'!$B:$B,0),MATCH(D$3,'My Students'!$2:$2,0)),\"\")","v":"Pre-Social Work"},{"$f":"IFERROR(INDEX('My Students'!$1:$17,MATCH('Day 1 Notes'!$A5,'My Students'!$B:$B,0),MATCH(E$3,'My Students'!$2:$2,0)),\"\")","v":""},{"$f":"IFERROR(INDEX('My Students'!$1:$17,MATCH('Day 1 Notes'!$A5,'My Students'!$B:$B,0),MATCH(F$3,'My Students'!$2:$2,0)),\"\")","v":""}]
[{"$f":"IF('My Students'!B5<>\"\",'My Students'!B5,\"\")","v":"M00000003"},{"$f":"IFERROR(INDEX('My Students'!$1:$17,MATCH('Day 1 Notes'!$A6,'My Students'!$B:$B,0),MATCH(\"StudentName\",'My Students'!$2:$2,0)),\"\")","v":"Jones, Abigail"},{"$f":"IFERROR(INDEX('Data Lists'!O:O,MATCH(LEFT(INDEX('My Students'!$1:$17,MATCH('Day 1 Notes'!$A6,'My Students'!$B:$B,0),MATCH(\"CountrySlot\",'My Students'!$2:$2,0)),2),'Data Lists'!N:N,0)),\"\")","v":"Portugal"},{"$f":"IFERROR(INDEX('My Students'!$1:$17,MATCH('Day 1 Notes'!$A6,'My Students'!$B:$B,0),MATCH(D$3,'My Students'!$2:$2,0)),\"\")","v":"Nursing Candidate"},{"$f":"IFERROR(INDEX('My Students'!$1:$17,MATCH('Day 1 Notes'!$A6,'My Students'!$B:$B,0),MATCH(E$3,'My Students'!$2:$2,0)),\"\")","v":""},{"$f":"IFERROR(INDEX('My Students'!$1:$17,MATCH('Day 1 Notes'!$A6,'My Students'!$B:$B,0),MATCH(F$3,'My Students'!$2:$2,0)),\"\")","v":""}]
[{"$f":"IF('My Students'!B6<>\"\",'My Students'!B6,\"\")","v":"M00000004"},{"$f":"IFERROR(INDEX('My Students'!$1:$17,MATCH('Day 1 Notes'!$A7,'My Students'!$B:$B,0),MATCH(\"StudentName\",'My Students'!$2:$2,0)),\"\")","v":"Jones, Briana"},{"$f":"IFERROR(INDEX('Data Lists'!O:O,MATCH(LEFT(INDEX('My Students'!$1:$17,MATCH('Day 1 Notes'!$A7,'My Students'!$B:$B,0),MATCH(\"CountrySlot\",'My Students'!$2:$2,0)),2),'Data Lists'!N:N,0)),\"\")","v":"Venezuela"},{"$f":"IFERROR(INDEX('My Students'!$1:$17,MATCH('Day 1 Notes'!$A7,'My Students'!$B:$B,0),MATCH(D$3,'My Students'!$2:$2,0)),\"\")","v":"PREN--Psychology"},{"$f":"IFERROR(INDEX('My Students'!$1:$17,MATCH('Day 1 Notes'!$A7,'My Students'!$B:$B,0),MATCH(E$3,'My Students'!$2:$2,0)),\"\")","v":""},{"$f":"IFERROR(INDEX('My Students'!$1:$17,MATCH('Day 1 Notes'!$A7,'My Students'!$B:$B,0),MATCH(F$3,'My Students'!$2:$2,0)),\"\")","v":""}]
[{"$f":"IF('My Students'!B7<>\"\",'My Students'!B7,\"\")","v":"M00000005"},{"$f":"IFERROR(INDEX('My Students'!$1:$17,MATCH('Day 1 Notes'!$A8,'My Students'!$B:$B,0),MATCH(\"StudentName\",'My Students'!$2:$2,0)),\"\")","v":"Jones, Christina"},{"$f":"IFERROR(INDEX('Data Lists'!O:O,MATCH(LEFT(INDEX('My Students'!$1:$17,MATCH('Day 1 Notes'!$A8,'My Students'!$B:$B,0),MATCH(\"CountrySlot\",'My Students'!$2:$2,0)),2),'Data Lists'!N:N,0)),\"\")","v":"Belize"},{"$f":"IFERROR(INDEX('My Students'!$1:$17,MATCH('Day 1 Notes'!$A8,'My Students'!$B:$B,0),MATCH(D$3,'My Students'!$2:$2,0)),\"\")","v":"LSTS"},{"$f":"IFERROR(INDEX('My Students'!$1:$17,MATCH('Day 1 Notes'!$A8,'My Students'!$B:$B,0),MATCH(E$3,'My Students'!$2:$2,0)),\"\")","v":""},{"$f":"IFERROR(INDEX('My Students'!$1:$17,MATCH('Day 1 Notes'!$A8,'My Students'!$B:$B,0),MATCH(F$3,'My Students'!$2:$2,0)),\"\")","v":""}]
[{"$f":"IF('My Students'!B8<>\"\",'My Students'!B8,\"\")","v":""},{"$f":"IFERROR(INDEX('My Students'!$1:$17,MATCH('Day 1 Notes'!$A9,'My Students'!$B:$B,0),MATCH(\"StudentName\",'My Students'!$2:$2,0)),\"\")","v":""},{"$f":"IFERROR(INDEX('Data Lists'!O:O,MATCH(LEFT(INDEX('My Students'!$1:$17,MATCH('Day 1 Notes'!$A9,'My Students'!$B:$B,0),MATCH(\"CountrySlot\",'My Students'!$2:$2,0)),2),'Data Lists'!N:N,0)),\"\")","v":""},{"$f":"IFERROR(INDEX('My Students'!$1:$17,MATCH('Day 1 Notes'!$A9,'My Students'!$B:$B,0),MATCH(D$3,'My Students'!$2:$2,0)),\"\")","v":""},{"$f":"IFERROR(INDEX('My Students'!$1:$17,MATCH('Day 1 Notes'!$A9,'My Students'!$B:$B,0),MATCH(E$3,'My Students'!$2:$2,0)),\"\")","v":""},{"$f":"IFERROR(INDEX('My Students'!$1:$17,MATCH('Day 1 Notes'!$A9,'My Students'!$B:$B,0),MATCH(F$3,'My Students'!$2:$2,0)),\"\")","v":""}]
[{"$f":"IF('My Students'!B9<>\"\",'My Students'!B9,\"\")","v":""},{"$f":"IFERROR(INDEX('My Students'!$1:$17,MATCH('Day 1 Notes'!$A10,'My Students'!$B:$B,0),MATCH(\"StudentName\",'My Students'!$2:$2,0)),\"\")","v":""},{"$f":"IFERROR(INDEX('Data Lists'!O:O,MATCH(LEFT(INDEX('My Students'!$1:$17,MATCH('Day 1 Notes'!$A10,'My Students'!$B:$B,0),MATCH(\"CountrySlot\",'My Students'!$2:$2,0)),2),'Data Lists'!N:N,0)),\"\")","v":""},{"$f":"IFERROR(INDEX('My Students'!$1:$17,MATCH('Day 1 Notes'!$A10,'My Students'!$B:$B,0),MATCH(D$3,'My Students'!$2:$2,0)),\"\")","v":""},{"$f":"IFERROR(INDEX('My Students'!$1:$17,MATCH('Day 1 Notes'!$A10,'My Students'!$B:$B,0),MATCH(E$3,'My Students'!$2:$2,0)),\"\")","v":""},{"$f":"IFERROR(INDEX('My Students'!$1:$17,MATCH('Day 1 Notes'!$A10,'My Students'!$B:$B,0),MATCH(F$3,'My Students'!$2:$2,0)),\"\")","v":""}]
[{"$f":"IF('My Students'!B10<>\"\",'My Students'!B10,\"\")","v":""},{"$f":"IFERROR(INDEX('My Students'!$1:$17,MATCH('Day 1 Notes'!$A11,'My Students'!$B:$B,0),MATCH(\"StudentName\",'My Students'!$2:$2,0)),\"\")","v":""},{"$f":"IFERROR(INDEX('Data Lists'!O:O,MATCH(LEFT(INDEX('My Students'!$1:$17,MATCH('Day 1 Notes'!$A11,'My Students'!$B:$B,0),MATCH(\"CountrySlot\",'My Students'!$2:$2,0)),2),'Data Lists'!N:N,0)),\"\")","v":""},{"$f":"IFERROR(INDEX('My Students'!$1:$17,MATCH('Day 1 Notes'!$A11,'My Students'!$B:$B,0),MATCH(D$3,'My Students'!$2:$2,0)),\"\")","v":""},{"$f":"IFERROR(INDEX('My Students'!$1:$17,MATCH('Day 1 Notes'!$A11,'My Students'!$B:$B,0),MATCH(E$3,'My Students'!$2:$2,0)),\"\")","v":""},{"$f":"IFERROR(INDEX('My Students'!$1:$17,MATCH('Day 1 Notes'!$A11,'My Students'!$B:$B,0),MATCH(F$3,'My Students'!$2:$2,0)),\"\")","v":""}]
[{"$f":"IF('My Students'!B11<>\"\",'My Students'!B11,\"\")","v":""},{"$f":"IFERROR(INDEX('My Students'!$1:$17,MATCH('Day 1 Notes'!$A12,'My Students'!$B:$B,0),MATCH(\"StudentName\",'My Students'!$2:$2,0)),\"\")","v":""},{"$f":"IFERROR(INDEX('Data Lists'!O:O,MATCH(LEFT(INDEX('My Students'!$1:$17,MATCH('Day 1 Notes'!$A12,'My Students'!$B:$B,0),MATCH(\"CountrySlot\",'My Students'!$2:$2,0)),2),'Data Lists'!N:N,0)),\"\")","v":""},{"$f":"IFERROR(INDEX('My Students'!$1:$17,MATCH('Day 1 Notes'!$A12,'My Students'!$B:$B,0),MATCH(D$3,'My Students'!$2:$2,0)),\"\")","v":""},{"$f":"IFERROR(INDEX('My Students'!$1:$17,MATCH('Day 1 Notes'!$A12,'My Students'!$B:$B,0),MATCH(E$3,'My Students'!$2:$2,0)),\"\")","v":""},{"$f":"IFERROR(INDEX('My Students'!$1:$17,MATCH('Day 1 Notes'!$A12,'My Students'!$B:$B,0),MATCH(F$3,'My Students'!$2:$2,0)),\"\")","v":""}]
[{"$f":"IF('My Students'!B12<>\"\",'My Students'!B12,\"\")","v":""},{"$f":"IFERROR(INDEX('My Students'!$1:$17,MATCH('Day 1 Notes'!$A13,'My Students'!$B:$B,0),MATCH(\"StudentName\",'My Students'!$2:$2,0)),\"\")","v":""},{"$f":"IFERROR(INDEX('Data Lists'!O:O,MATCH(LEFT(INDEX('My Students'!$1:$17,MATCH('Day 1 Notes'!$A13,'My Students'!$B:$B,0),MATCH(\"CountrySlot\",'My Students'!$2:$2,0)),2),'Data Lists'!N:N,0)),\"\")","v":""},{"$f":"IFERROR(INDEX('My Students'!$1:$17,MATCH('Day 1 Notes'!$A13,'My Students'!$B:$B,0),MATCH(D$3,'My Students'!$2:$2,0)),\"\")","v":""},{"$f":"IFERROR(INDEX('My Students'!$1:$17,MATCH('Day 1 Notes'!$A13,'My Students'!$B:$B,0),MATCH(E$3,'My Students'!$2:$2,0)),\"\")","v":""},{"$f":"IFERROR(INDEX('My Students'!$1:$17,MATCH('Day 1 Notes'!$A13,'My Students'!$B:$B,0),MATCH(F$3,'My Students'!$2:$2,0)),\"\")","v":""}]
[{"$f":"IF('My Students'!B13<>\"\",'My Students'!B13,\"\")","v":""},{"$f":"IFERROR(INDEX('My Students'!$1:$17,MATCH('Day 1 Notes'!$A14,'My Students'!$B:$B,0),MATCH(\"StudentName\",'My Students'!$2:$2,0)),\"\")","v":""},{"$f":"IFERROR(INDEX('Data Lists'!O:O,MATCH(LEFT(INDEX('My Students'!$1:$17,MATCH('Day 1 Notes'!$A14,'My Students'!$B:$B,0),MATCH(\"CountrySlot\",'My Students'!$2:$2,0)),2),'Data Lists'!N:N,0)),\"\")","v":""},{"$f":"IFERROR(INDEX('My Students'!$1:$17,MATCH('Day 1 Notes'!$A14,'My Students'!$B:$B,0),MATCH(D$3,'My Students'!$2:$2,0)),\"\")","v":""},{"$f":"IFERROR(INDEX('My Students'!$1:$17,MATCH('Day 1 Notes'!$A14,'My Students'!$B:$B,0),MATCH(E$3,'My Students'!$2:$2,0)),\"\")","v":""},{"$f":"IFERROR(INDEX('My Students'!$1:$17,MATCH('Day 1 Notes'!$A14,'My Students'!$B:$B,0),MATCH(F$3,'My Students'!$2:$2,0)),\"\")","v":""}]
[{"$f":"IF('My Students'!B14<>\"\",'My Students'!B14,\"\")","v":""},{"$f":"IFERROR(INDEX('My Students'!$1:$17,MATCH('Day 1 Notes'!$A15,'My Students'!$B:$B,0),MATCH(\"StudentName\",'My Students'!$2:$2,0)),\"\")","v":""},{"$f":"IFERROR(INDEX('Data Lists'!O:O,MATCH(LEFT(INDEX('My Students'!$1:$17,MATCH('Day 1 Notes'!$A15,'My Students'!$B:$B,0),MATCH(\"CountrySlot\",'My Students'!$2:$2,0)),2),'Data Lists'!N:N,0)),\"\")","v":""},{"$f":"IFERROR(INDEX('My Students'!$1:$17,MATCH('Day 1 Notes'!$A15,'My Students'!$B:$B,0),MATCH(D$3,'My Students'!$2:$2,0)),\"\")","v":""},{"$f":"IFERROR(INDEX('My Students'!$1:$17,MATCH('Day 1 Notes'!$A15,'My Students'!$B:$B,0),MATCH(E$3,'My Students'!$2:$2,0)),\"\")","v":""},{"$f":"IFERROR(INDEX('My Students'!$1:$17,MATCH('Day 1 Notes'!$A15,'My Students'!$B:$B,0),MATCH(F$3,'My Students'!$2:$2,0)),\"\")","v":""}]
[{"$f":"IF('My Students'!B15<>\"\",'My Students'!B15,\"\")","v":""},{"$f":"IFERROR(INDEX('My Students'!$1:$17,MATCH('Day 1 Notes'!$A16,'My Students'!$B:$B,0),MATCH(\"StudentName\",'My Students'!$2:$2,0)),\"\")","v":""},{"$f":"IFERROR(INDEX('Data Lists'!O:O,MATCH(LEFT(INDEX('My Students'!$1:$17,MATCH('Day 1 Notes'!$A16,'My Students'!$B:$B,0),MATCH(\"CountrySlot\",'My Students'!$2:$2,0)),2),'Data Lists'!N:N,0)),\"\")","v":""},{"$f":"IFERROR(INDEX('My Students'!$1:$17,MATCH('Day 1 Notes'!$A16,'My Students'!$B:$B,0),MATCH(D$3,'My Students'!$2:$2,0)),\"\")","v":""},{"$f":"IFERROR(INDEX('My Students'!$1:$17,MATCH('Day 1 Notes'!$A16,'My Students'!$B:$B,0),MATCH(E$3,'My Students'!$2:$2,0)),\"\")","v":""},{"$f":"IFERROR(INDEX('My Students'!$1:$17,MATCH('Day 1 Notes'!$A16,'My Students'!$B:$B,0),MATCH(F$3,'My Students'!$2:$2,0)),\"\")","v":""}]
[{"$f":"IF('My Students'!B16<>\"\",'My Students'!B16,\"\")","v":""},{"$f":"IFERROR(INDEX('My Students'!$1:$17,MATCH('Day 1 Notes'!$A17,'My Students'!$B:$B,0),MATCH(\"StudentName\",'My Students'!$2:$2,0)),\"\")","v":""},{"$f":"IFERROR(INDEX('Data Lists'!O:O,MATCH(LEFT(INDEX('My Students'!$1:$17,MATCH('Day 1 Notes'!$A17,'My Students'!$B:$B,0),MATCH(\"CountrySlot\",'My Students'!$2:$2,0)),2),'Data Lists'!N:N,0)),\"\")","v":""},{"$f":"IFERROR(INDEX('My Students'!$1:$17,MATCH('Day 1 Notes'!$A17,'My Students'!$B:$B,0),MATCH(D$3,'My Students'!$2:$2,0)),\"\")","v":""},{"$f":"IFERROR(INDEX('My Students'!$1:$17,MATCH('Day 1 Notes'!$A17,'My Students'!$B:$B,0),MATCH(E$3,'My Students'!$2:$2,0)),\"\")","v":""},{"$f":"IFERROR(INDEX('My Students'!$1:$17,MATCH('Day 1 Notes'!$A17,'My Students'!$B:$B,0),MATCH(F$3,'My Students'!$2:$2,0)),\"\")","v":""}]
[{"$f":"IF('My Students'!B17<>\"\",'My Students'!B17,\"\")","v":""},{"$f":"IFERROR(INDEX('My Students'!$1:$17,MATCH('Day 1 Notes'!$A18,'My Students'!$B:$B,0),MATCH(\"StudentName\",'My Students'!$2:$2,0)),\"\")","v":""},{"$f":"IFERROR(INDEX('Data Lists'!O:O,MATCH(LEFT(INDEX('My Students'!$1:$17,MATCH('Day 1 Notes'!$A18,'My Students'!$B:$B,0),MATCH(\"CountrySlot\",'My Students'!$2:$2,0)),2),'Data Lists'!N:N,0)),\"\")","v":""},{"$f":"IFERROR(INDEX('My Students'!$1:$17,MATCH('Day 1 Notes'!$A18,'My Students'!$B:$B,0),MATCH(D$3,'My Students'!$2:$2,0)),\"\")","v":""},{"$f":"IFERROR(INDEX('My Students'!$1:$17,MATCH('Day 1 Notes'!$A18,'My Students'!$B:$B,0),MATCH(E$3,'My Students'!$2:$2,0)),\"\")","v":""},{"$f":"IFERROR(INDEX('My Students'!$1:$17,MATCH('Day 1 Notes'!$A18,'My Students'!$B:$B,0),MATCH(F$3,'My Students'!$2:$2,0)),\"\")","v":""}]
[]
["Customs Students"]
["M#","StudentName","Country","Major","Caseload Adv","Customs Adv","Notes"]
[{"$f":"IF('My Students'!B21<>\"\",'My Students'!B21,\"\")","v":"M00000002"},{"$f":"IFERROR(INDEX('My Students'!$1:$17,MATCH('Day 1 Notes'!$A22,'My Students'!$B:$B,0),MATCH(\"StudentName\",'My Students'!$2:$2,0)),\"\")","v":"Cook, Alan"},{"$f":"IFERROR(INDEX('Data Lists'!O:O,MATCH(LEFT(INDEX('My Students'!$1:$17,MATCH('Day 1 Notes'!$A22,'My Students'!$B:$B,0),MATCH(\"CountrySlot\",'My Students'!$2:$2,0)),2),'Data Lists'!N:N,0)),\"\")","v":"France"},{"$f":"IFERROR(INDEX('My Students'!$1:$17,MATCH('Day 1 Notes'!$A22,'My Students'!$B:$B,0),MATCH(D$3,'My Students'!$2:$2,0)),\"\")","v":"Pre-Social Work"},{"$f":"IFERROR(INDEX('My Students'!$1:$17,MATCH('Day 1 Notes'!$A22,'My Students'!$B:$B,0),MATCH(E$3,'My Students'!$2:$2,0)),\"\")","v":""},{"$f":"IFERROR(INDEX('My Students'!$1:$17,MATCH('Day 1 Notes'!$A22,'My Students'!$B:$B,0),MATCH(F$3,'My Students'!$2:$2,0)),\"\")","v":""}]
[{"$f":"IF('My Students'!B22<>\"\",'My Students'!B22,\"\")","v":"M00000003"},{"$f":"IFERROR(INDEX('My Students'!$1:$17,MATCH('Day 1 Notes'!$A23,'My Students'!$B:$B,0),MATCH(\"StudentName\",'My Students'!$2:$2,0)),\"\")","v":"Jones, Abigail"},{"$f":"IFERROR(INDEX('Data Lists'!O:O,MATCH(LEFT(INDEX('My Students'!$1:$17,MATCH('Day 1 Notes'!$A23,'My Students'!$B:$B,0),MATCH(\"CountrySlot\",'My Students'!$2:$2,0)),2),'Data Lists'!N:N,0)),\"\")","v":"Portugal"},{"$f":"IFERROR(INDEX('My Students'!$1:$17,MATCH('Day 1 Notes'!$A23,'My Students'!$B:$B,0),MATCH(D$3,'My Students'!$2:$2,0)),\"\")","v":"Nursing Candidate"},{"$f":"IFERROR(INDEX('My Students'!$1:$17,MATCH('Day 1 Notes'!$A23,'My Students'!$B:$B,0),MATCH(E$3,'My Students'!$2:$2,0)),\"\")","v":""},{"$f":"IFERROR(INDEX('My Students'!$1:$17,MATCH('Day 1 Notes'!$A23,'My Students'!$B:$B,0),MATCH(F$3,'My Students'!$2:$2,0)),\"\")","v":""}]
[{"$f":"IF('My Students'!B23<>\"\",'My Students'!B23,\"\")","v":"M00000004"},{"$f":"IFERROR(INDEX('My Students'!$1:$17,MATCH('Day 1 Notes'!$A24,'My Students'!$B:$B,0),MATCH(\"StudentName\",'My Students'!$2:$2,0)),\"\")","v":"Jones, Briana"},{"$f":"IFERROR(INDEX('Data Lists'!O:O,MATCH(LEFT(INDEX('My Students'!$1:$17,MATCH('Day 1 Notes'!$A24,'My Students'!$B:$B,0),MATCH(\"CountrySlot\",'My Students'!$2:$2,0)),2),'Data Lists'!N:N,0)),\"\")","v":"Venezuela"},{"$f":"IFERROR(INDEX('My Students'!$1:$17,MATCH('Day 1 Notes'!$A24,'My Students'!$B:$B,0),MATCH(D$3,'My Students'!$2:$2,0)),\"\")","v":"PREN--Psychology"},{"$f":"IFERROR(INDEX('My Students'!$1:$17,MATCH('Day 1 Notes'!$A24,'My Students'!$B:$B,0),MATCH(E$3,'My Students'!$2:$2,0)),\"\")","v":""},{"$f":"IFERROR(INDEX('My Students'!$1:$17,MATCH('Day 1 Notes'!$A24,'My Students'!$B:$B,0),MATCH(F$3,'My Students'!$2:$2,0)),\"\")","v":""}]
[{"$f":"IF('My Students'!B24<>\"\",'My Students'!B24,\"\")","v":""},{"$f":"IFERROR(INDEX('My Students'!$1:$17,MATCH('Day 1 Notes'!$A25,'My Students'!$B:$B,0),MATCH(\"StudentName\",'My Students'!$2:$2,0)),\"\")","v":""},{"$f":"IFERROR(INDEX('Data Lists'!O:O,MATCH(LEFT(INDEX('My Students'!$1:$17,MATCH('Day 1 Notes'!$A25,'My Students'!$B:$B,0),MATCH(\"CountrySlot\",'My Students'!$2:$2,0)),2),'Data Lists'!N:N,0)),\"\")","v":""},{"$f":"IFERROR(INDEX('My Students'!$1:$17,MATCH('Day 1 Notes'!$A25,'My Students'!$B:$B,0),MATCH(D$3,'My Students'!$2:$2,0)),\"\")","v":""},{"$f":"IFERROR(INDEX('My Students'!$1:$17,MATCH('Day 1 Notes'!$A25,'My Students'!$B:$B,0),MATCH(E$3,'My Students'!$2:$2,0)),\"\")","v":""},{"$f":"IFERROR(INDEX('My Students'!$1:$17,MATCH('Day 1 Notes'!$A25,'My Students'!$B:$B,0),MATCH(F$3,'My Students'!$2:$2,0)),\"\")","v":""}]
[{"$f":"IF('My Students'!B25<>\"\",'My Students'!B25,\"\")","v":""},{"$f":"IFERROR(INDEX('My Students'!$1:$17,MATCH('Day 1 Notes'!$A26,'My Students'!$B:$B,0),MATCH(\"StudentName\",'My Students'!$2:$2,0)),\"\")","v":""},{"$f":"IFERROR(INDEX('Data Lists'!O:O,MATCH(LEFT(INDEX('My Students'!$1:$17,MATCH('Day 1 Notes'!$A26,'My Students'!$B:$B,0),MATCH(\"CountrySlot\",'My Students'!$2:$2,0)),2),'Data Lists'!N:N,0)),\"\")","v":""},{"$f":"IFERROR(INDEX('My Students'!$1:$17,MATCH('Day 1 Notes'!$A26,'My Students'!$B:$B,0),MATCH(D$3,'My Students'!$2:$2,0)),\"\")","v":""},{"$f":"IFERROR(INDEX('My Students'!$1:$17,MATCH('Day 1 Notes'!$A26,'My Students'!$B:$B,0),MATCH(E$3,'My Students'!$2:$2,0)),\"\")","v":""},{"$f":"IFERROR(INDEX('My Students'!$1:$17,MATCH('Day 1 Notes'!$A26,'My Students'!$B:$B,0),MATCH(F$3,'My Students'!$2:$2,0)),\"\")","v":""}]
[{"$f":"IF('My Students'!B26<>\"\",'My Students'!B26,\"\")","v":""},{"$f":"IFERROR(INDEX('My Students'!$1:$17,MATCH('Day 1 Notes'!$A27,'My Students'!$B:$B,0),MATCH(\"StudentName\",'My Students'!$2:$2,0)),\"\")","v":""},{"$f":"IFERROR(INDEX('Data Lists'!O:O,MATCH(LEFT(INDEX('My Students'!$1:$17,MATCH('Day 1 Notes'!$A27,'My Students'!$B:$B,0),MATCH(\"CountrySlot\",'My Students'!$2:$2,0)),2),'Data Lists'!N:N,0)),\"\")","v":""},{"$f":"IFERROR(INDEX('My Students'!$1:$17,MATCH('Day 1 Notes'!$A27,'My Students'!$B:$B,0),MATCH(D$3,'My Students'!$2:$2,0)),\"\")","v":""},{"$f":"IFERROR(INDEX('My Students'!$1:$17,MATCH('Day 1 Notes'!$A27,'My Students'!$B:$B,0),MATCH(E$3,'My Students'!$2:$2,0)),\"\")","v":""},{"$f":"IFERROR(INDEX('My Students'!$1:$17,MATCH('Day 1 Notes'!$A27,'My Students'!$B:$B,0),MATCH(F$3,'My Students'!$2:$2,0)),\"\")","v":""}]
[{"$f":"IF('My Students'!B27<>\"\",'My Students'!B27,\"\")","v":""},{"$f":"IFERROR(INDEX('My Students'!$1:$17,MATCH('Day 1 Notes'!$A28,'My Students'!$B:$B,0),MATCH(\"StudentName\",'My Students'!$2:$2,0)),\"\")","v":""},{"$f":"IFERROR(INDEX('Data Lists'!O:O,MATCH(LEFT(INDEX('My Students'!$1:$17,MATCH('Day 1 Notes'!$A28,'My Students'!$B:$B,0),MATCH(\"CountrySlot\",'My Students'!$2:$2,0)),2),'Data Lists'!N:N,0)),\"\")","v":""},{"$f":"IFERROR(INDEX('My Students'!$1:$17,MATCH('Day 1 Notes'!$A28,'My Students'!$B:$B,0),MATCH(D$3,'My Students'!$2:$2,0)),\"\")","v":""},{"$f":"IFERROR(INDEX('My Students'!$1:$17,MATCH('Day 1 Notes'!$A28,'My Students'!$B:$B,0),MATCH(E$3,'My Students'!$2:$2,0)),\"\")","v":""},{"$f":"IFERROR(INDEX('My Students'!$1:$17,MATCH('Day 1 Notes'!$A28,'My Students'!$B:$B,0),MATCH(F$3,'My Students'!$2:$2,0)),\"\")","v":""}]
[{"$f":"IF('My Students'!B28<>\"\",'My Students'!B28,\"\")","v":""},{"$f":"IFERROR(INDEX('My Students'!$1:$17,MATCH('Day 1 Notes'!$A29,'My Students'!$B:$B,0),MATCH(\"StudentName\",'My Students'!$2:$2,0)),\"\")","v":""},{"$f":"IFERROR(INDEX('Data Lists'!O:O,MATCH(LEFT(INDEX('My Students'!$1:$17,MATCH('Day 1 Notes'!$A29,'My Students'!$B:$B,0),MATCH(\"CountrySlot\",'My Students'!$2:$2,0)),2),'Data Lists'!N:N,0)),\"\")","v":""},{"$f":"IFERROR(INDEX('My Students'!$1:$17,MATCH('Day 1 Notes'!$A29,'My Students'!$B:$B,0),MATCH(D$3,'My Students'!$2:$2,0)),\"\")","v":""},{"$f":"IFERROR(INDEX('My Students'!$1:$17,MATCH('Day 1 Notes'!$A29,'My Students'!$B:$B,0),MATCH(E$3,'My Students'!$2:$2,0)),\"\")","v":""},{"$f":"IFERROR(INDEX('My Students'!$1:$17,MATCH('Day 1 Notes'!$A29,'My Students'!$B:$B,0),MATCH(F$3,'My Students'!$2:$2,0)),\"\")","v":""}]

{"sheet":"Day 1 Notes--v2","index":19,"n_rows":136,"n_cols":9,"rows_kept":136,"cut":false,"hidden":false,"merged":[[103,0,110,1],[103,5,110,6],[55,0,62,1],[55,5,62,6],[71,0,78,1],[71,5,78,6],[87,0,94,1],[87,5,94,6],[0,8,14,8],[16,8,30,8],[32,8,46,8],[7,0,14,1],[7,5,14,6],[23,0,30,1],[23,5,30,6],[39,0,46,1],[39,5,46,6],[0,3,14,3],[16,3,30,3],[32,3,46,3],[96,8,110,8],[112,8,126,8],[128,8,142,8],[48,3,62,3],[64,3,78,3],[80,3,94,3],[48,8,62,8],[64,8,78,8],[80,8,94,8],[96,3,110,3],[119,0,126,1],[119,5,126,6],[135,0,142,1],[135,5,142,6],[112,3,126,3],[128,3,142,3]]}
["1. Name",{"$f":"IF(B2=0,\"\",INDEX('My Students'!2:17,MATCH($B$2,'My Students'!$B$2:$B$17,0),MATCH(\"StudentName\",'My Students'!2:2,0)))","v":"Smith, Brenda"},null,"Do you expect to receive vet benefits?\n\nDo you have (or expect to get) any college credits that aren't on your MTSU transcript, and that you haven't talked about with your advisor?\n\n\n\nAre you in a pre-professional program?  (Pre-Med, Pre-Dental, etc.)  What program?",null,"2. Name",{"$f":"IF(G2=0,\"\",INDEX('My Students'!$2:$17,MATCH($G$2,'My Students'!$B$2:$B$17,0),MATCH(\"StudentName\",'My Students'!$2:$2,0)))","v":"Cook, Alan"},null,"Do you expect to receive vet benefits?\n\nDo you have (or expect to get) any college credits that aren't on your MTSU transcript, and that you haven't talked about with your advisor?\n\n\n\nAre you in a pre-professional program?  (Pre-Med, Pre-Dental, etc.)  What program?"]
["M#",{"$f":"'My Students'!$B$3","v":"M00000001"},null,null,null,"M#",{"$f":"'My Students'!$B$4","v":"M00000002"}]
["Country",{"$f":"IF(B2=0,\"\",INDEX('My Students'!$2:$17,MATCH($B$2,'My Students'!$B$2:$B$17,0),MATCH(\"CountrySlot\",'My Students'!$2:$2,0)))","v":"FR - France (s756)"},null,null,null,"Country",{"$f":"IF(G2=0,\"\",INDEX('My Students'!$2:$17,MATCH($G$2,'My Students'!$B$2:$B$17,0),MATCH(\"CountrySlot\",'My Students'!$2:$2,0)))","v":"FR - France (s756)"}]
["Order/Time",{"$f":"IF(B2=0,\"\",INDEX('My Students'!$2:$17,MATCH($B$2,'My Students'!$B$2:$B$17,0),MATCH(\"Order/Time\",'My Students'!$2:$2,0)))","v":"2/10:30 AM"},null,null,null,"Order/Time",{"$f":"IF(G2=0,\"\",INDEX('My Students'!$2:$17,MATCH($G$2,'My Students'!$B$2:$B$17,0),MATCH($A$4,'My Students'!$2:$2,0)))","v":"4/11:30 AM"}]
["Acad Adv",{"$f":"IF(B2=0,\"\",INDEX('My Students'!$2:$17,MATCH($B$2,'My Students'!$B$2:$B$17,0),MATCH(\"Assigned advisor\",'My Students'!$2:$2,0)))","v":"Amy"},null,null,null,"Acad Adv",{"$f":"IF(G2=0,\"\",INDEX('My Students'!$2:$17,MATCH($G$2,'My Students'!$B$2:$B$17,0),MATCH(\"Assigned advisor\",'My Students'!$2:$2,0)))","v":"Chloe"}]
["Cust Adv",{"$f":"IF(B2=0,\"\",INDEX('My Students'!$2:$17,MATCH($B$2,'My Students'!$B$2:$B$17,0),MATCH(\"Customs Advisor\",'My Students'!$2:$2,0)))","v":"Jennifer"},null,null,null,"Cust Adv",{"$f":"IF(G2=0,\"\",INDEX('My Students'!$2:$17,MATCH($G$2,'My Students'!$B$2:$B$17,0),MATCH(\"Customs Advisor\",'My Students'!$2:$2,0)))","v":"Amy"}]
["PREN Grp",{"$f":"IF(B2=0,\"\",IF(INDEX('My Students'!$2:$17,MATCH(B2,'My Students'!$B$2:$B$17,0),MATCH(\"PREN\",'My Students'!$2:$2,0))=\"Y\",INDEX('Data Lists'!$R:$R,MATCH(LEFT(B1,1),'Data Lists'!$Q:$Q,0)),\"n/a\"))","v":"n/a"},null,null,null,"PREN Grp",{"$f":"IF(G2=0,\"\",IF(INDEX('My Students'!$2:$17,MATCH(G2,'My Students'!$B$2:$B$17,0),MATCH(\"PREN\",'My Students'!$2:$2,0))=\"Y\",INDEX('Data Lists'!$R:$R,MATCH(LEFT(G1,1),'Data Lists'!$Q:$Q,0)),\"n/a\"))","v":"n/a"}]
["Notes",null,null,null,null,"Notes"]
[]
[]
[]
[]
[]
[]
[]
[]
["3. Name",{"$f":"IF(B18=0,\"\",INDEX('My Students'!$2:$17,MATCH($B$18,'My Students'!$B$2:$B$17,0),MATCH(\"StudentName\",'My Students'!$2:$2,0)))","v":"Jones, Abigail"},null,"Do you expect to receive vet benefits?\n\nDo you have (or expect to get) any college credits that aren't on your MTSU transcript, and that you haven't talked about with your advisor?\n\n\n\nAre you in a pre-professional program?  (Pre-Med, Pre-Dental, etc.)  What program?",null,"4. Name",{"$f":"IF(G18=0,\"\",INDEX('My Students'!$2:$17,MATCH($G$18,'My Students'!$B$2:$B$17,0),MATCH(\"StudentName\",'My Students'!$2:$2,0)))","v":"Jones, Briana"},null,"Do you expect to receive vet benefits?\n\nDo you have (or expect to get) any college credits that aren't on your MTSU transcript, and that you haven't talked about with your advisor?\n\n\n\nAre you in a pre-professional program?  (Pre-Med, Pre-Dental, etc.)  What program?"]
["M#",{"$f":"'My Students'!$B$5","v":"M00000003"},null,null,null,"M#",{"$f":"'My Students'!$B$6","v":"M00000004"}]
["Country",{"$f":"IF(B18=0,\"\",INDEX('My Students'!$2:$17,MATCH($B$18,'My Students'!$B$2:$B$17,0),MATCH(\"CountrySlot\",'My Students'!$2:$2,0)))","v":"PO - Portugal (s751)"},null,null,null,"Country",{"$f":"IF(G18=0,\"\",INDEX('My Students'!$2:$17,MATCH($G$18,'My Students'!$B$2:$B$17,0),MATCH(\"CountrySlot\",'My Students'!$2:$2,0)))","v":"VE - Venezuela (s759)"}]
["Order/Time",{"$f":"IF(B18=0,\"\",INDEX('My Students'!$2:$17,MATCH($B$18,'My Students'!$B$2:$B$17,0),MATCH($A$4,'My Students'!$2:$2,0)))","v":"2/10:30 AM"},null,null,null,"Order/Time",{"$f":"IF(G18=0,\"\",INDEX('My Students'!$2:$17,MATCH($G$18,'My Students'!$B$2:$B$17,0),MATCH($A$4,'My Students'!$2:$2,0)))","v":"3/11:00 AM"}]
["Acad Adv",{"$f":"IF(B18=0,\"\",INDEX('My Students'!$2:$17,MATCH($B$18,'My Students'!$B$2:$B$17,0),MATCH(\"Assigned advisor\",'My Students'!$2:$2,0)))","v":"Eileen"},null,null,null,"Acad Adv",{"$f":"IF(G18=0,\"\",INDEX('My Students'!$2:$17,MATCH($G$18,'My Students'!$B$2:$B$17,0),MATCH(\"Assigned advisor\",'My Students'!$2:$2,0)))","v":"Chloe"}]
["Cust Adv",{"$f":"IF(B18=0,\"\",INDEX('My Students'!$2:$17,MATCH($B$18,'My Students'!$B$2:$B$17,0),MATCH(\"Customs Advisor\",'My Students'!$2:$2,0)))","v":"Chloe"},null,null,null,"Cust Adv",{"$f":"IF(G18=0,\"\",INDEX('My Students'!$2:$17,MATCH($G$18,'My Students'!$B$2:$B$17,0),MATCH(\"Customs Advisor\",'My Students'!$2:$2,0)))","v":"Stacey"}]
["PREN Grp",{"$f":"IF(B18=0,\"\",IF(INDEX('My Students'!$2:$17,MATCH(B18,'My Students'!$B$2:$B$17,0),MATCH(\"PREN\",'My Students'!$2:$2,0))=\"Y\",INDEX('Data Lists'!$R:$R,MATCH(LEFT(B17,1),'Data Lists'!$Q:$Q,0)),\"n/a\"))","v":"Eileen"},null,null,null,"PREN Grp",{"$f":"IF(G18=0,\"\",IF(INDEX('My Students'!$2:$17,MATCH(G18,'My Students'!$B$2:$B$17,0),MATCH(\"PREN\",'My Students'!$2:$2,0))=\"Y\",INDEX('Data Lists'!$R:$R,MATCH(LEFT(G17,1),'Data Lists'!$Q:$Q,0)),\"n/a\"))","v":"n/a"}]
["Notes",null,null,null,null,"Notes"]
[]
[]
[]
[]
[]
[]
[]
[]
["5. Name",{"$f":"IF(B34=0,\"\",INDEX('My Students'!$2:$17,MATCH($B$34,'My Students'!$B$2:$B$17,0),MATCH(\"StudentName\",'My Students'!$2:$2,0)))","v":"Jones, Christina"},null,"Do you expect to receive vet benefits?\n\nDo you have (or expect to get) any college credits that aren't on your MTSU transcript, and that you haven't talked about with your advisor?\n\n\n\nAre you in a pre-professional program?  (Pre-Med, Pre-Dental, etc.)  What program?",null,"6. Name",{"$f":"IF(G34=0,\"\",INDEX('My Students'!$2:$17,MATCH($G$34,'My Students'!$B$2:$B$17,0),MATCH(\"StudentName\",'My Students'!$2:$2,0)))","v":""},null,"Do you expect to receive vet benefits?\n\nDo you have (or expect to get) any college credits that aren't on your MTSU transcript, and that you haven't talked about with your advisor?\n\n\n\nAre you in a pre-professional program?  (Pre-Med, Pre-Dental, etc.)  What program?"]
["M#",{"$f":"'My Students'!$B$7","v":"M00000005"},null,null,null,"M#",{"$f":"'My Students'!$B$8","v":0}]
["Country",{"$f":"IF(B34=0,\"\",INDEX('My Students'!$2:$17,MATCH($B$34,'My Students'!$B$2:$B$17,0),MATCH(\"CountrySlot\",'My Students'!$2:$2,0)))","v":"BZ - Belize (s139)"},null,null,null,"Country",{"$f":"IF(G34=0,\"\",INDEX('My Students'!$2:$17,MATCH($G$34,'My Students'!$B$2:$B$17,0),MATCH(\"CountrySlot\",'My Students'!$2:$2,0)))","v":""}]
["Order/Time",{"$f":"IF(B34=0,\"\",INDEX('My Students'!$2:$17,MATCH($B$34,'My Students'!$B$2:$B$17,0),MATCH($A$4,'My Students'!$2:$2,0)))","v":"1/10:00 AM"},null,null,null,"Order/Time",{"$f":"IF(G34=0,\"\",INDEX('My Students'!$2:$17,MATCH($G$34,'My Students'!$B$2:$B$17,0),MATCH($A$4,'My Students'!$2:$2,0)))","v":""}]
["Acad Adv",{"$f":"IF(B34=0,\"\",INDEX('My Students'!$2:$17,MATCH($B$34,'My Students'!$B$2:$B$17,0),MATCH(\"Assigned advisor\",'My Students'!$2:$2,0)))","v":"Dauthan"},null,null,null,"Acad Adv",{"$f":"IF(G34=0,\"\",INDEX('My Students'!$2:$17,MATCH($G$34,'My Students'!$B$2:$B$17,0),MATCH(\"Assigned advisor\",'My Students'!$2:$2,0)))","v":""}]
["Cust Adv",{"$f":"INDEX('My Students'!$2:$17,MATCH($B$34,'My Students'!$B$2:$B$17,0),MATCH(\"Customs Advisor\",'My Students'!$2:$2,0))","v":"Amy"},null,null,null,"Cust Adv",{"$f":"IF(G34=0,\"\",INDEX('My Students'!$2:$17,MATCH($G$34,'My Students'!$B$2:$B$17,0),MATCH(\"Customs Advisor\",'My Students'!$2:$2,0)))","v":""}]
["PREN Grp",{"$f":"IF(B34=0,\"\",IF(INDEX('My Students'!$2:$17,MATCH(B34,'My Students'!$B$2:$B$17,0),MATCH(\"PREN\",'My Students'!$2:$2,0))=\"Y\",INDEX('Data Lists'!$R:$R,MATCH(LEFT(B33,1),'Data Lists'!$Q:$Q,0)),\"n/a\"))","v":"n/a"},null,null,null,"PREN Grp",{"$f":"IF(G34=0,\"\",IF(INDEX('My Students'!$2:$17,MATCH(G34,'My Students'!$B$2:$B$17,0),MATCH(\"PREN\",'My Students'!$2:$2,0))=\"Y\",INDEX('Data Lists'!$R:$R,MATCH(LEFT(G33,1),'Data Lists'!$Q:$Q,0)),\"n/a\"))","v":""}]
["Notes",null,null,null,null,"Notes"]
[]
[]
[]
[]
[]
[]
[]
[]
["7. Name",{"$f":"IF($B$50=0,\"\",INDEX('My Students'!$2:$17,MATCH($B$50,'My Students'!$B$2:$B$17,0),MATCH(\"StudentName\",'My Students'!$2:$2,0)))","v":""},null,"Do you expect to receive vet benefits?\n\nDo you have (or expect to get) any college credits that aren't on your MTSU transcript, and that you haven't talked about with your advisor?\n\n\n\nAre you in a pre-professional program?  (Pre-Med, Pre-Dental, etc.)  What program?",null,"8. Name",{"$f":"IF($G$50=0,\"\",INDEX('My Students'!$2:$17,MATCH($G$50,'My Students'!$B$2:$B$17,0),MATCH(\"StudentName\",'My Students'!$2:$2,0)))","v":""},null,"Do you expect to receive vet benefits?\n\nDo you have (or expect to get) any college credits that aren't on your MTSU transcript, and that you haven't talked about with your advisor?\n\n\n\nAre you in a pre-professional program?  (Pre-Med, Pre-Dental, etc.)  What program?"]
["M#",{"$f":"'My Students'!$B$9","v":0},null,null,null,"M#",{"$f":"'My Students'!$B$10","v":0}]
["Country",{"$f":"IF($B$50=0,\"\",INDEX('My Students'!$2:$17,MATCH($B$50,'My Students'!$B$2:$B$17,0),MATCH(\"CountrySlot\",'My Students'!$2:$2,0)))","v":""},null,null,null,"Country",{"$f":"IF($G$50=0,\"\",INDEX('My Students'!$2:$17,MATCH($G$50,'My Students'!$B$2:$B$17,0),MATCH(\"CountrySlot\",'My Students'!$2:$2,0)))","v":""}]
["Order/Time",{"$f":"IF($B$50=0,\"\",INDEX('My Students'!$2:$17,MATCH($B$50,'My Students'!$B$2:$B$17,0),MATCH($A$4,'My Students'!$2:$2,0)))","v":""},null,null,null,"Order/Time",{"$f":"IF($G$50=0,\"\",INDEX('My Students'!$2:$17,MATCH($G$50,'My Students'!$B$2:$B$17,0),MATCH($A$4,'My Students'!$2:$2,0)))","v":""}]
["Acad Adv",{"$f":"IF($B$50=0,\"\",INDEX('My Students'!$2:$17,MATCH($B$50,'My Students'!$B$2:$B$17,0),MATCH(\"Assigned advisor\",'My Students'!$2:$2,0)))","v":""},null,null,null,"Acad Adv",{"$f":"IF($G$50=0,\"\",INDEX('My Students'!$2:$17,MATCH($G$50,'My Students'!$B$2:$B$17,0),MATCH(\"Assigned advisor\",'My Students'!$2:$2,0)))","v":""}]
["Cust Adv",{"$f":"IF($B$50=0,\"\",INDEX('My Students'!$2:$17,MATCH($B$50,'My Students'!$B$2:$B$17,0),MATCH(\"Customs Advisor\",'My Students'!$2:$2,0)))","v":""},null,null,null,"Cust Adv",{"$f":"IF($G$50=0,\"\",INDEX('My Students'!$2:$17,MATCH($G$50,'My Students'!$B$2:$B$17,0),MATCH(\"Customs Advisor\",'My Students'!$2:$2,0)))","v":""}]
["PREN Grp",{"$f":"IF(B50=0,\"\",IF(INDEX('My Students'!$2:$17,MATCH(B50,'My Students'!$B$2:$B$17,0),MATCH(\"PREN\",'My Students'!$2:$2,0))=\"Y\",INDEX('Data Lists'!$R:$R,MATCH(LEFT(B49,1),'Data Lists'!$Q:$Q,0)),\"n/a\"))","v":""},null,null,null,"PREN Grp",{"$f":"IF(G50=0,\"\",IF(INDEX('My Students'!$2:$17,MATCH(G50,'My Students'!$B$2:$B$17,0),MATCH(\"PREN\",'My Students'!$2:$2,0))=\"Y\",INDEX('Data Lists'!$R:$R,MATCH(LEFT(G49,1),'Data Lists'!$Q:$Q,0)),\"n/a\"))","v":""}]
["Notes",null,null,null,null,"Notes"]
[]
[]
[]
[]
[]
[]
[]
[]
["9. Name",{"$f":"IF($B$66=0,\"\",INDEX('My Students'!$2:$17,MATCH($B$66,'My Students'!$B$2:$B$17,0),MATCH(\"StudentName\",'My Students'!$2:$2,0)))","v":""},null,"Do you expect to receive vet benefits?\n\nDo you have (or expect to get) any college credits that aren't on your MTSU transcript, and that you haven't talked about with your advisor?\n\n\n\nAre you in a pre-professional program?  (Pre-Med, Pre-Dental, etc.)  What program?",null,"10. Name",{"$f":"IF(G66=0,\"\",INDEX('My Students'!$2:$17,MATCH($G$66,'My Students'!$B$2:$B$17,0),MATCH(\"StudentName\",'My Students'!$2:$2,0)))","v":""},null,"Do you expect to receive vet benefits?\n\nDo you have (or expect to get) any college credits that aren't on your MTSU transcript, and that you haven't talked about with your advisor?\n\n\n\nAre you in a pre-professional program?  (Pre-Med, Pre-Dental, etc.)  What program?"]
["M#",{"$f":"'My Students'!$B$11","v":0},null,null,null,"M#",{"$f":"'My Students'!$B$12","v":0}]
["Country",{"$f":"IF(B66=0,\"\",INDEX('My Students'!$2:$17,MATCH($B$66,'My Students'!$B$2:$B$17,0),MATCH(\"CountrySlot\",'My Students'!$2:$2,0)))","v":""},null,null,null,"Country",{"$f":"IF(G66=0,\"\",INDEX('My Students'!$2:$17,MATCH($G$66,'My Students'!$B$2:$B$17,0),MATCH(\"CountrySlot\",'My Students'!$2:$2,0)))","v":""}]
["Order/Time",{"$f":"IF(B66=0,\"\",INDEX('My Students'!$2:$17,MATCH($B$66,'My Students'!$B$2:$B$17,0),MATCH($A$4,'My Students'!$2:$2,0)))","v":""},null,null,null,"Order/Time",{"$f":"IF(G66=0,\"\",INDEX('My Students'!$2:$17,MATCH($G$66,'My Students'!$B$2:$B$17,0),MATCH($A$4,'My Students'!$2:$2,0)))","v":""}]
["Acad Adv",{"$f":"IF(B66=0,\"\",INDEX('My Students'!$2:$17,MATCH($B$66,'My Students'!$B$2:$B$17,0),MATCH(\"Assigned advisor\",'My Students'!$2:$2,0)))","v":""},null,null,null,"Acad Adv",{"$f":"IF(G66=0,\"\",INDEX('My Students'!$2:$17,MATCH($G$66,'My Students'!$B$2:$B$17,0),MATCH(\"Assigned advisor\",'My Students'!$2:$2,0)))","v":""}]
["Cust Adv",{"$f":"IF(B66=0,\"\",INDEX('My Students'!$2:$17,MATCH($B$66,'My Students'!$B$2:$B$17,0),MATCH(\"Customs Advisor\",'My Students'!$2:$2,0)))","v":""},null,null,null,"Cust Adv",{"$f":"IF(G66=0,\"\",INDEX('My Students'!$2:$17,MATCH($G$66,'My Students'!$B$2:$B$17,0),MATCH(\"Customs Advisor\",'My Students'!$2:$2,0)))","v":""}]
["PREN Grp",{"$f":"IF(B66=0,\"\",IF(INDEX('My Students'!$2:$17,MATCH(B66,'My Students'!$B$2:$B$17,0),MATCH(\"PREN\",'My Students'!$2:$2,0))=\"Y\",INDEX('Data Lists'!$R:$R,MATCH(LEFT(B65,1),'Data Lists'!$Q:$Q,0)),\"n/a\"))","v":""},null,null,null,"PREN Grp",{"$f":"IF(G66=0,\"\",IF(INDEX('My Students'!$2:$17,MATCH(G66,'My Students'!$B$2:$B$17,0),MATCH(\"PREN\",'My Students'!$2:$2,0))=\"Y\",INDEX('Data Lists'!$R:$R,MATCH(LEFT(G65,1),'Data Lists'!$Q:$Q,0)),\"n/a\"))","v":""}]
["Notes",null,null,null,null,"Notes"]
[]
[]
[]
[]
[]
[]
[]
[]
["11. Name",{"$f":"IF(B82=0,\"\",INDEX('My Students'!$2:$17,MATCH($B$82,'My Students'!$B$2:$B$17,0),MATCH(\"StudentName\",'My Students'!$2:$2,0)))","v":""},null,"Do you expect to receive vet benefits?\n\nDo you have (or expect to get) any college credits that aren't on your MTSU transcript, and that you haven't talked about with your advisor?\n\n\n\nAre you in a pre-professional program?  (Pre-Med, Pre-Dental, etc.)  What program?",null,"12. Name",{"$f":"IF(G82=0,\"\",INDEX('My Students'!$2:$17,MATCH($G$82,'My Students'!$B$2:$B$17,0),MATCH(\"StudentName\",'My Students'!$2:$2,0)))","v":""},null,"Do you expect to receive vet benefits?\n\nDo you have (or expect to get) any college credits that aren't on your MTSU transcript, and that you haven't talked about with your advisor?\n\n\n\nAre you in a pre-professional program?  (Pre-Med, Pre-Dental, etc.)  What program?"]
["M#",{"$f":"'My Students'!$B$13","v":0},null,null,null,"M#",{"$f":"'My Students'!$B$14","v":0}]
["Country",{"$f":"IF(B82=0,\"\",INDEX('My Students'!$2:$17,MATCH($B$82,'My Students'!$B$2:$B$17,0),MATCH(\"CountrySlot\",'My Students'!$2:$2,0)))","v":""},null,null,null,"Country",{"$f":"IF(G82=0,\"\",INDEX('My Students'!$2:$17,MATCH($G$82,'My Students'!$B$2:$B$17,0),MATCH(\"CountrySlot\",'My Students'!$2:$2,0)))","v":""}]
["Order/Time",{"$f":"IF(B82=0,\"\",INDEX('My Students'!$2:$17,MATCH($B$82,'My Students'!$B$2:$B$17,0),MATCH($A$4,'My Students'!$2:$2,0)))","v":""},null,null,null,"Order/Time",{"$f":"IF(G82=0,\"\",INDEX('My Students'!$2:$17,MATCH($G$82,'My Students'!$B$2:$B$17,0),MATCH($A$4,'My Students'!$2:$2,0)))","v":""}]
["Acad Adv",{"$f":"IF(B82=0,\"\",INDEX('My Students'!$2:$17,MATCH($B$82,'My Students'!$B$2:$B$17,0),MATCH(\"Assigned advisor\",'My Students'!$2:$2,0)))","v":""},null,null,null,"Acad Adv",{"$f":"IF(G82=0,\"\",INDEX('My Students'!$2:$17,MATCH($G$82,'My Students'!$B$2:$B$17,0),MATCH(\"Assigned advisor\",'My Students'!$2:$2,0)))","v":""}]
["Cust Adv",{"$f":"IF(B82=0,\"\",INDEX('My Students'!$2:$17,MATCH($B$82,'My Students'!$B$2:$B$17,0),MATCH(\"Customs Advisor\",'My Students'!$2:$2,0)))","v":""},null,null,null,"Cust Adv",{"$f":"IF(G82=0,\"\",INDEX('My Students'!$2:$17,MATCH($G$66,'My Students'!$B$2:$B$17,0),MATCH(\"Customs Advisor\",'My Students'!$2:$2,0)))","v":""}]
["PREN Grp",{"$f":"IF(B82=0,\"\",IF(INDEX('My Students'!$2:$17,MATCH(B82,'My Students'!$B$2:$B$17,0),MATCH(\"PREN\",'My Students'!$2:$2,0))=\"Y\",INDEX('Data Lists'!$R:$R,MATCH(LEFT(B81,1),'Data Lists'!$Q:$Q,0)),\"n/a\"))","v":""},null,null,null,"PREN Grp",{"$f":"IF(G82=0,\"\",IF(INDEX('My Students'!$2:$17,MATCH(G82,'My Students'!$B$2:$B$17,0),MATCH(\"PREN\",'My Students'!$2:$2,0))=\"Y\",INDEX('Data Lists'!$R:$R,MATCH(LEFT(G81,1),'Data Lists'!$Q:$Q,0)),\"n/a\"))","v":""}]
["Notes",null,null,null,null,"Notes"]
[]
[]
[]
[]
[]
[]
[]
[]
["13. Name",{"$f":"IF(B98=0,\"\",INDEX('My Students'!$2:$17,MATCH($B$98,'My Students'!$B$2:$B$17,0),MATCH(\"StudentName\",'My Students'!$2:$2,0)))","v":""},null,"Do you expect to receive vet benefits?\n\nDo you have (or expect to get) any college credits that aren't on your MTSU transcript, and that you haven't talked about with your advisor?\n\n\n\nAre you in a pre-professional program?  (Pre-Med, Pre-Dental, etc.)  What program?",null,"14. Name",{"$f":"IF(G98=0,\"\",INDEX('My Students'!$2:$17,MATCH($G$98,'My Students'!$B$2:$B$17,0),MATCH(\"StudentName\",'My Students'!$2:$2,0)))","v":""},null,"Do you expect to receive vet benefits?\n\nDo you have (or expect to get) any college credits that aren't on your MTSU transcript, and that you haven't talked about with your advisor?\n\n\n\nAre you in a pre-professional program?  (Pre-Med, Pre-Dental, etc.)  What program?"]
["M#",{"$f":"'My Students'!$B$15","v":0},null,null,null,"M#",{"$f":"'My Students'!$B$16","v":0}]
["Country",{"$f":"IF(B98=0,\"\",INDEX('My Students'!$2:$17,MATCH($B$98,'My Students'!$B$2:$B$17,0),MATCH(\"CountrySlot\",'My Students'!$2:$2,0)))","v":""},null,null,null,"Country",{"$f":"IF(G98=0,\"\",INDEX('My Students'!$2:$17,MATCH($G$98,'My Students'!$B$2:$B$17,0),MATCH(\"CountrySlot\",'My Students'!$2:$2,0)))","v":""}]
["Order/Time",{"$f":"IF(B98=0,\"\",INDEX('My Students'!$2:$17,MATCH($B$98,'My Students'!$B$2:$B$17,0),MATCH($A$4,'My Students'!$2:$2,0)))","v":""},null,null,null,"Order/Time",{"$f":"IF(G98=0,\"\",INDEX('My Students'!$2:$17,MATCH($G$98,'My Students'!$B$2:$B$17,0),MATCH($A$4,'My Students'!$2:$2,0)))","v":""}]
["Acad Adv",{"$f":"IF(B98=0,\"\",INDEX('My Students'!$2:$17,MATCH($B$98,'My Students'!$B$2:$B$17,0),MATCH(\"Assigned advisor\",'My Students'!$2:$2,0)))","v":""},null,null,null,"Acad Adv",{"$f":"IF(G98=0,\"\",INDEX('My Students'!$2:$17,MATCH($G$98,'My Students'!$B$2:$B$17,0),MATCH(\"Assigned advisor\",'My Students'!$2:$2,0)))","v":""}]
["Cust Adv",{"$f":"IF(B98=0,\"\",INDEX('My Students'!$2:$17,MATCH($B$98,'My Students'!$B$2:$B$17,0),MATCH(\"Customs Advisor\",'My Students'!$2:$2,0)))","v":""},null,null,null,"Cust Adv",{"$f":"IF(G98=0,\"\",INDEX('My Students'!$2:$17,MATCH($G$98,'My Students'!$B$2:$B$17,0),MATCH(\"Customs Advisor\",'My Students'!$2:$2,0)))","v":""}]
["PREN Grp",{"$f":"IF(B98=0,\"\",IF(INDEX('My Students'!$2:$17,MATCH(B98,'My Students'!$B$2:$B$17,0),MATCH(\"PREN\",'My Students'!$2:$2,0))=\"Y\",INDEX('Data Lists'!$R:$R,MATCH(LEFT(B97,1),'Data Lists'!$Q:$Q,0)),\"n/a\"))","v":""},null,null,null,"PREN Grp",{"$f":"IF(G98=0,\"\",IF(INDEX('My Students'!$2:$17,MATCH(G98,'My Students'!$B$2:$B$17,0),MATCH(\"PREN\",'My Students'!$2:$2,0))=\"Y\",INDEX('Data Lists'!$R:$R,MATCH(LEFT(G97,1),'Data Lists'!$Q:$Q,0)),\"n/a\"))","v":""}]
["Notes",null,null,null,null,"Notes"]
[]
[]
[]
[]
[]
[]
[]
[]
["15. Name",{"$f":"IF(B114=0,\"\",INDEX('My Students'!$2:$17,MATCH($G$114,'My Students'!$B$2:$B$17,0),MATCH(\"StudentName\",'My Students'!$2:$2,0)))","v":""},null,"Do you expect to receive vet benefits?\n\nDo you have (or expect to get) any college credits that aren't on your MTSU transcript, and that you haven't talked about with your advisor?\n\n\n\nAre you in a pre-professional program?  (Pre-Med, Pre-Dental, etc.)  What program?",null,"(Add on) Name",{"$f":"IF(G114=0,\"\",INDEX('My Students'!$2:$17,MATCH($G$98,'My Students'!$B$2:$B$17,0),MATCH(\"StudentName\",'My Students'!$2:$2,0)))","v":""},null,"Do you expect to receive vet benefits?\n\nDo you have (or expect to get) any college credits that aren't on your MTSU transcript, and that you haven't talked about with your advisor?\n\n\n\nAre you in a pre-professional program?  (Pre-Med, Pre-Dental, etc.)  What program?"]
["M#",{"$f":"'My Students'!$B$17","v":0},null,null,null,"M#"]
["Country",{"$f":"IF(B114=0,\"\",INDEX('My Students'!$2:$17,MATCH($G$114,'My Students'!$B$2:$B$17,0),MATCH(\"CountrySlot\",'My Students'!$2:$2,0)))","v":""},null,null,null,"Country"]
["Order/Time",{"$f":"IF(B114=0,\"\",INDEX('My Students'!$2:$17,MATCH($G$114,'My Students'!$B$2:$B$17,0),MATCH($A$4,'My Students'!$2:$2,0)))","v":""},null,null,null,"Order/Time"]
["Acad Adv",{"$f":"IF(B114=0,\"\",INDEX('My Students'!$2:$17,MATCH($G$114,'My Students'!$B$2:$B$17,0),MATCH(\"Assigned advisor\",'My Students'!$2:$2,0)))","v":""},null,null,null,"Acad Adv"]
["Cust Adv",{"$f":"IF(B114=0,\"\",INDEX('My Students'!$2:$17,MATCH($G$114,'My Students'!$B$2:$B$17,0),MATCH(\"Customs Advisor\",'My Students'!$2:$2,0)))","v":""},null,null,null,"Cust Adv"]
["PREN Grp",{"$f":"IF(B114=0,\"\",IF(INDEX('My Students'!$2:$17,MATCH(B114,'My Students'!$B$2:$B$17,0),MATCH(\"PREN\",'My Students'!$2:$2,0))=\"Y\",INDEX('Data Lists'!$R:$R,MATCH(LEFT(B113,1),'Data Lists'!$Q:$Q,0)),\"n/a\"))","v":""},null,null,null,"PREN Grp"]
["Notes",null,null,null,null,"Notes"]
[]
[]
[]
[]
[]
[]
[]
[]
["(Add on) Name",{"$f":"IF(B130=0,\"\",INDEX('My Students'!$2:$17,MATCH($G$98,'My Students'!$B$2:$B$17,0),MATCH(\"StudentName\",'My Students'!$2:$2,0)))","v":""},null,"Do you expect to receive vet benefits?\n\nDo you have (or expect to get) any college credits that aren't on your MTSU transcript, and that you haven't talked about with your advisor?\n\n\n\nAre you in a pre-professional program?  (Pre-Med, Pre-Dental, etc.)  What program?",null,"(Add on) Name",{"$f":"IF(G130=0,\"\",INDEX('My Students'!$2:$17,MATCH($G$98,'My Students'!$B$2:$B$17,0),MATCH(\"StudentName\",'My Students'!$2:$2,0)))","v":""},null,"Do you expect to receive vet benefits?\n\nDo you have (or expect to get) any college credits that aren't on your MTSU transcript, and that you haven't talked about with your advisor?\n\n\n\nAre you in a pre-professional program?  (Pre-Med, Pre-Dental, etc.)  What program?"]
["M#",null,null,null,null,"M#"]
["Country",null,null,null,null,"Country"]
["Order/Time",null,null,null,null,"Order/Time"]
["Acad Adv",null,null,null,null,"Acad Adv"]
["Cust Adv",null,null,null,null,"Cust Adv"]
["PREN Grp",null,null,null,null,"PREN Grp"]
["Notes",null,null,null,null,"Notes"]

{"sheet":"Task Guide","index":20,"n_rows":91,"n_cols":3,"rows_kept":91,"cut":false,"hidden":false,"merged":[[82,0,91,0],[83,1,84,1],[86,1,87,1],[89,1,90,1],[59,0,71,0],[60,1,61,1],[63,1,64,1],[66,1,67,1],[69,1,70,1],[74,0,80,0],[75,1,76,1],[78,1,79,1],[34,0,43,0],[35,1,36,1],[38,1,39,1],[41,1,42,1],[45,0,57,0],[46,1,47,1],[49,1,50,1],[52,1,53,1],[55,1,56,1],[15,0,24,0],[16,1,17,1],[19,1,20,1],[22,1,23,1],[26,0,32,0],[27,1,28,1],[30,1,31,1],[2,0,12,0],[2,1,3,1],[5,1,6,1],[8,1,9,1],[11,1,12,1]]}
["Pre-Customs Task Guide"]
[null,"Task","Where to find info / What to check"]
["General","Make stu folder in Z drive","Naming scheme: <major> <conc> <last>, <first> <M#>"]
[null,null,"e.g., CRJU LAEN Smith, John M01234567"]
[]
[null,"Check admit term","SAAADMS, Customs chart--\"Flags\""]
[null,null,"If summer: Verify w/ stu before Customs"]
[]
[null,"Major","SGASTDN, Customs chart--\"Academic\" (& updates from stu)"]
[]
[]
[null,"Acad standing (TRs only)","SHATERM, SAAADMS, Transcript"]
[null,null,"Probation on SHATERM? Must take U2020, meet GPA reqs 1st sem."]
[]
[]
["Special Pops","Task","Where to find info / What to check"]
[null,"Vet benefits","SAAQUAN, SGASTDN, SPAIDEN, Customs chart--\"Flags\", ask student"]
[null,null,"Need a BUAF form?  (FYI: Flag on Customs list doesn't always mean getting vet benefits!!)"]
[]
[null,"Student athlete","SGASPRT (Also on main Customs spreadsheet but not sure if accurate)"]
[null,null,"Stu meet with SAEC advisor; Scheduling challenges; Major changes approved through SAEC"]
[]
[null,"Pre-Professional","May not know until stu or CBAS reports to us; ask in welcome email!"]
[null,null,"Provide Pre-Prof info packet and info session flyer"]
[]
[]
["Reg Issues","Task","Where to find info / What to check"]
[null,"Immunization issues?","Banner: SZAITRK"]
[null,null,"Missing imm docs, under 18--need parent form"]
[]
[null,"Holds","SOAHOLD, Customs chart--\"Factors\""]
[]
[]
[]
["Check Transcripts","Task","Where to find info / What to check"]
[null,"Prior schools","Banner: SOAPCOL / Pipeline: Prior College Info"]
[]
[]
[null,"Missing classes/ transcripts","BDMS (Banner: SAAADMS, click search icon) / Pline: Transfer Eval / Ask stu in welcome email"]
[null,null,"FRs: AP, IB, DE, Dual Credit, Cambridge  /  TRs: Sems in progress or missing from MT transcript"]
[]
[null,"Subs needed","By comparing transcript, transfer eval, & UD form.  Use TES for course descriptions."]
[null,null,"Any classes that might/should count but aren't?"]
[]
["Pre-Customs Task Guide--Page 2"]
["Specific Course Types","Task","Where to find info / What to check"]
[null,"Prescribeds","Compare SZAADEF and SOATEST scores"]
[null,null,"Do they match? What K classes are required?  (\"SAILS Math\"=1010 or 1530 non-K or 1710K)"]
[]
[null,"Check RLC options","Based on class list"]
[null,null,"Must use for students who need READ 1000K/HIST 2020. May recommend for other students."]
[]
[null,"Honors","Customs chart--\"Factors\" box"]
[null,null,"Is the student eligible to take honors classes? If TR, email Judy Albakry to add honors code."]
[]
[null,"Pre-Nursing","Customs chart--\"Factors\" box"]
[null,null,"Do they need different gen eds for PREN vs major?"]
[]
[]
["Major-Specific Checks","Task","Where to find info / What to check"]
[null,"Check advising folder","Should have UD form, Reg checklist, anything else specific to major"]
[]
[]
[]
[]
[]
[]
[]
[]
[]
[]
[]
[]
["Post-Customs Task Guide"]
["General","Task","Where to find info / What to check"]
[null,"Assign advisor in Banner","SGAADVR"]
[null,null,"Our type is COLL; We generally are the primary advisor."]
[]
[null,"Submit appointment report","Navigate (SSC)"]
[]
[]
[]
["Special Pops","Task","Where to find info / What to check"]
[null,"Vet benefits","Submit BUAF"]
[null,null,"Form: Z:> Advising> Advising Forms> \"VA Benefit User Adv Form\"; Submit: V drive along w/ UD form"]
[]
[null,"Submit change of major form","(If applicable)  Pipeline > Bottom of Advisor menu"]
[]
[]
[null,"Send follow-up emails","(if needed)"]
[null,null,"e.g., To new advisor if student changed major during advising session"]

{"sheet":"Helpful links","index":21,"n_rows":35,"n_cols":3,"rows_kept":35,"cut":false,"hidden":false,"merged":[]}
["Helpful Links"]
["Student Handouts"]
["How-To Tips (stand-alone)","..\\Advising Forms\\Helpful Forms\\How To Tips handouts\\How to Tips Fall 2019.docx"]
["How-To Tips & Prescribeds","Student Handouts\\FR How-To and Prescribeds handout--Fall 2019.pdf"]
["Next Steps & Dates (FR version)","..\\Advising Forms\\Helpful Forms\\Tips and Dates handouts\\Freshman Tips and Dates--Fall 2019.pdf"]
["Pre-Professional packet","Z:\\CoBHS Advising\\Advising Forms\\Helpful Forms\\Info from other depts & colleges\\MTSU Pre Health Handbook Supplement.pdf"]
["Pre-Prof website (class lists)","http://www.mtsu.edu/chemistry/pre_prof/index.php","(Currently under update, no handouts available on site)"]
["Customs folder content:","Z:\\CoBHS Advising\\Tech Team\\Website Docs\\Advising Center\\ADV_AdvisingFolder.pdf"]
["AP, CLEP, etc:","http://www.mtsu.edu/how-to-apply/credit-by-examination.php"]
[]
["Planning Tools"]
["FR Customs agenda:","https://www.mtsu.edu/customs/documents/freshman-customs-agenda.pdf"]
["TR Customs agenda:","https://www.mtsu.edu/customs/transfer/docs/transfer-customs-agenda.pdf"]
[]
["Info about/for specific majors or programs"]
["Fr Nurs candidacy:","Teacher Nursing Recommendation form"]
["Majors Comparison:","Z:\\CoBHS Advising\\Comparisons of majors"]
["Scholars Acad/STARS","http://www.mtsu.edu/studentsuccess/scholars-academy.php"]
[]
["Administrative tools"]
["TRs: Reg Checklist","..\\Advising Forms\\Helpful Forms\\Registration Checklists\\Registration Checklist Sum-Fall 2019.xlsx"]
["FRs: Major templates","\\\\acadfs\\cobhs_depts\\CoBHS Advising\\Advising Forms\\Helpful Forms\\Registration Checklists\\Freshman Registration Checklist Sum-Fall 2019.xlsx"]
["Sub form:","http://w1.mtsu.edu/resources/faculty/docs/REGsub.pdf"]
["RLC list:","Forms & Administrative Tools\\Fall 2019 RLC Handout.pdf"]
[]
["Helpful Reminders"]
["Univ Studies/Prescribeds:"]
["If a transfer student is admitted on probation, UNIV2020 is required to be taken."]
["If a student has a hold on SOAHOLD because they have not taken the required prescribed course, please do not remove the hold, but call our office.  I keep a record of these holds.  I check to make sure the student did in fact register for the required class."]
["Betsy Taylor--ext 2017"]
[]
["Military Science:"]
["During the Freshman and/or Transfer Student CUSTOMS class registration periods, the only class that does not require Military Science Department permission is the Mil Sci 1010 class. "]
["Students wishing to sign up for any other Military Science class should send an email request with their M number and the class they wish to add to John Bautch, at john.bautch@mtsu.edu.  "]
["Advisors or students with general or specific questions are welcome to contact John at 615 - 898 - 2470."]

{"sheet":"Dept-specific reqs","index":22,"n_rows":78,"n_cols":9,"rows_kept":78,"cut":false,"hidden":false,"merged":[[47,0,54,0],[47,1,48,1],[47,3,47,4],[48,2,48,4],[50,1,51,1],[50,3,50,4],[51,2,51,4],[53,1,54,1],[53,3,53,4],[54,2,54,4],[17,1,18,1],[16,0,28,0],[20,1,21,1],[20,3,20,4],[21,2,21,4],[26,1,27,1],[26,3,26,4],[18,2,18,4],[17,3,17,4],[32,0,39,0],[38,1,39,1],[38,3,38,4],[24,2,24,4],[32,1,33,1],[32,3,32,4],[33,2,33,4],[35,1,36,1],[35,3,35,4],[36,2,36,4],[23,1,24,1],[23,3,23,4],[39,2,39,4],[27,2,27,4],[62,0,69,0],[62,1,63,1],[62,3,62,4],[63,2,63,4],[65,1,66,1],[65,3,65,4],[66,2,66,4],[68,1,69,1],[68,3,68,4],[69,2,69,4],[77,0,84,0],[77,1,78,1],[77,3,77,4],[78,2,78,4],[80,1,81,1],[80,3,80,4],[81,2,81,4],[83,1,84,1],[83,3,83,4],[84,2,84,4],[1,0,13,0],[2,1,3,1],[2,3,2,4],[3,2,3,4],[5,1,6,1],[5,3,5,4],[6,2,6,4],[8,1,9,1],[8,3,8,4],[9,2,9,4],[11,1,12,1],[11,3,11,4],[12,2,12,4]]}
["Criminal Justice"]
["Major-Specific Checks","Done","To-Do","Where to find info / Bottom row: What to check"]
[null,null,"Check advising folder","Should have UD form, Reg checklist, anything else specific to major"]
[]
[]
[]
[]
[]
[]
[]
[]
[]
[]
[]
[]
["Health & Human Performance"]
["Major-Specific Checks","Done","To-Do","Where to find info / Bottom row: What to check"]
[null,null,"Check advising folder","Should have UD form, Reg checklist, anything else specific to major"]
[]
[]
[]
[]
[]
[]
[]
[]
[]
[]
[]
[]
["Human Sciences"]
[null,"Done","To-Do","Where to find info / Bottom row: What to check",null,null,null,null,"Finish setting up!!"]
["Major-Specific Checks"]
[]
[]
[]
[]
[]
[]
[]
[]
[]
[]
[]
[]
["Nursing"]
[null,"Done","To-Do","Where to find info / Bottom row: What to check"]
["Major-Specific Checks"]
[]
[]
[]
[]
[]
[]
[]
[]
[]
[]
[]
[]
["Psychology"]
[null,"Done","To-Do","Where to find info / Bottom row: What to check"]
["Major-Specific Checks"]
[]
[]
[]
[]
[]
[]
[]
[]
[]
[]
[]
[]
["Social Work"]
[null,"Done","To-Do","Where to find info / Bottom row: What to check"]
["Major-Specific Checks"]

{"sheet":"A","index":23,"n_rows":47,"n_cols":16,"rows_kept":47,"cut":false,"hidden":false,"merged":[[15,9,39,10],[15,6,39,7],[14,4,15,4],[14,3,15,3],[14,0,15,0],[14,1,15,1]]}
["Contact & Demographic Info",null,null,"Academic Info",null,null,"Start",null,null,"Change major",null,null,null,"M#",{"$f":"'My Students'!B21","v":"M00000002"}]
["Name",{"$f":"CONCATENATE(A20,\" \",B20)","v":"Alan Cook"},null,"Transferred hours",{"$f":"INDEX($O:$O,MATCH(\"HrsEarned\",$N:$N,0))","v":13},null,"Stop",null,null,"Notes for advisor",null,null,null,"Deleted",{"$f":"INDEX('My Students'!$20:$28,MATCH($O$1,'My Students'!$B$20:$B$28,0),MATCH(N2,'My Students'!$20:$20,0))","v":"This is sample data. The purple button will paste over it. Just ignore it for now!"}]
["M#",{"$f":"O1","v":"M00000002"},null,"HS GPA",{"$f":"INDEX($O:$O,MATCH(\"HighSchoolGPA\",$N:$N,0))","v":3.8},null,null,null,null,null,null,null,null,"SAcad",{"$f":"INDEX('My Students'!$20:$28,MATCH($O$1,'My Students'!$B$20:$B$28,0),MATCH(N3,'My Students'!$20:$20,0))","v":""}]
["MTSUEmail",{"$f":"INDEX($O:$O,MATCH(A4,$N:$N,0))","v":"3@mtmail.mtsu.edu"},null,"Inclusive GPA",{"$f":"INDEX($O:$O,MATCH(\"InclusiveGPA\",$N:$N,0))","v":4},null,null,"Report Builder",null,null,"Student Message Builder",null,null,"VetOrDep",{"$f":"INDEX('My Students'!$20:$28,MATCH($O$1,'My Students'!$B$20:$B$28,0),MATCH(N4,'My Students'!$20:$20,0))","v":""}]
["PersonalEmail",{"$f":"INDEX($O:$O,MATCH(A5,$N:$N,0))","v":"3@gmail.com"},null,"ACT Math",{"$f":"INDEX($O:$O,MATCH(\"ACTMathScre\",$N:$N,0))","v":29},null,"Registered",null,"see below","Docs attached",null,"x (to say that you've attached docs for the student)",null,"PREN",{"$f":"INDEX('My Students'!$20:$28,MATCH($O$1,'My Students'!$B$20:$B$28,0),MATCH(N5,'My Students'!$20:$20,0))","v":""}]
["PermPhone",{"$f":"INDEX($O:$O,MATCH(A6,$N:$N,0))","v":"(423) 618-0000"},null,"ACT Science",{"$f":"INDEX($O:$O,MATCH(\"ACTScienceScre\",$N:$N,0))","v":34},null,"Attaching Scan",null,"x","Drop/Add info",null,"x (to give info on switching classes & steps to do so)",null,"1stGen",{"$f":"INDEX('My Students'!$20:$28,MATCH($O$1,'My Students'!$B$20:$B$28,0),MATCH(N6,'My Students'!$20:$20,0))","v":"N"}]
["MailingPhone",{"$f":"INDEX($O:$O,MATCH(A7,$N:$N,0))","v":"(423) 618-0000"},null,"CustomsPOS",{"$f":"INDEX($O:$O,MATCH(D7,$N:$N,0))","v":"BS_PSYPGSC"},null,"Submitted COM",null,"x","Acad success tips",null,"x (to give acad tips, tutoring & SI websites, & \"ask for help\")",null,"ReverseTransfer",{"$f":"INDEX('My Students'!$20:$28,MATCH($O$1,'My Students'!$B$20:$B$28,0),MATCH(N7,'My Students'!$20:$20,0))","v":""}]
[null,null,null,null,{"$f":"INDEX($O:$O,MATCH(\"Major\",$N:$N,0))","v":"Psychology (Pre-Grad)"},null,"Supp Instructn",null,"x","NURS Info Session",null,"x (to refer student to nursing info webpage and session)",null,"FR/TR",{"$f":"INDEX('My Students'!$20:$28,MATCH($O$1,'My Students'!$B$20:$B$28,0),MATCH(N8,'My Students'!$20:$20,0))","v":"F"}]
["Customs Info",null,null,"BannerPOS",{"$f":"INDEX($O:$O,MATCH(D9,$N:$N,0))","v":"BS_PSYPGSC"},null,"RTTP",null,"x","Check phone #",null,"x (to tell stu their listed ph #s are wrong, & how to fix)",null,"StudentName",{"$f":"INDEX('My Students'!$20:$28,MATCH($O$1,'My Students'!$B$20:$B$28,0),MATCH(N9,'My Students'!$20:$20,0))","v":"Cook, Alan"}]
["CountrySlot",{"$f":"INDEX($O:$O,MATCH(A10,$N:$N,0))","v":"FR - France (s756)"},null,"Majors match?",{"$f":"IF(E7=E9,\"Y\",\"N, Submit change of major\")","v":"Y"},null,"Note 1",null,"x","Advisor info",{"$f":"INDEX('Data Lists'!$J:$J,MATCH($B$12,'Data Lists'!$H:$H,0))","v":"your advisor, Chloe (Chloe.Calhoun@mtsu.edu)"},"(leave formula, or type \"me <email>\")",null,"Major",{"$f":"INDEX('My Students'!$20:$28,MATCH($O$1,'My Students'!$B$20:$B$28,0),MATCH(N10,'My Students'!$20:$20,0))","v":"Psychology (Pre-Grad)"}]
["Order/Time",{"$f":"INDEX($O:$O,MATCH(A11,$N:$N,0))","v":"4/11:30 AM"},null,"Override major",null,null,"Other",null,"[notes]","Other",null,"[type any notes to student]",null,"Order/Time",{"$f":"INDEX('My Students'!$20:$28,MATCH($O$1,'My Students'!$B$20:$B$28,0),MATCH(N11,'My Students'!$20:$20,0))","v":"4/11:30 AM"}]
["Acad Advisor",{"$f":"INDEX($O:$O,MATCH(\"Assigned Advisor\",$N:$N,0))","v":"Chloe"},null,null,null,null,"Paste in advising report:",{"$f":"CONCATENATE(\"Student came for advising during Customs.\",IF(H6<>\"\",\"  Attaching scanned copy of notes.\",\"\"),IF(H5=\"a\",Messages!$C$2,IF(H5=\"b\",Messages!$C$3,IF(H5<>\"\",CONCATENATE(\"  Registered student for classes for upcoming semester: \",H5),\"\"))),IF(H11<>\"\",CONCATENATE(\"\n\n\",H11),\"\"),IF(H7<>\"\",\"\n\nSubmitted change of major form. \",\"\"),IF(H8<>\"\",Messages!$C$4,\"\"),IF(H9<>\"\",Messages!$C$5,\"\"),IF(H10<>\"\",Messages!$C$6,\"\"))","v":"Student came for advising during Customs."},null,"Paste in stu msg:",{"$f":"CONCATENATE(\"We enjoyed seeing you at the CBHS Advising Center Customs session today, \",$A$21,\"!  \",IF(K5=\"x\",\"I've attached your Registration Checklist, for your records.\",\"\"),IF(K11<>\"\",CONCATENATE(\"\n\n\",K11),\"\"),IF(K6=\"x\",CONCATENATE(Messages!$C$7&K10&\", before making changes.\"),\"\"),IF(K9=\"x\",Messages!$C$10,\"\"),IF(K7=\"x\",Messages!$C$8,\"\"),IF(K8<>\"\",Messages!$C$9,\"\"),CONCATENATE(\"\n\nIf you have any questions or concerns, please contact \"&K10&\".  You'll also want to plan to come in for an advising appointment around mid-terms each semester, to talk about your classes for the upcoming term.  You can find Instructions and Schedule links at mtsu.edu/cbhsadv. \"),\"\n\nWe look forward to seeing you at MTSU this semester!\n\n\",$B$2,\"\n\",$B$3)","v":"We enjoyed seeing you at the CBHS Advising Center Customs session today, Major name!  \n\nIf you have any questions or concerns, please contact your advisor, Chloe (Chloe.Calhoun@mtsu.edu).  You'll also want to plan to come in for an advising appointment around mid-terms each semester, to talk about your classes for the upcoming term.  You can find Instructions and Schedule links at mtsu.edu/cbhsadv. \n\nWe look forward to seeing you at MTSU this semester!\n\nAlan Cook\nM00000002"},null,null,"PrescribedCrsMath",{"$f":"INDEX('My Students'!$20:$28,MATCH($O$1,'My Students'!$B$20:$B$28,0),MATCH(N12,'My Students'!$20:$20,0))","v":"College level"},{"$f":"IF(O12=\"college level\",\"n\",IF(O12=0,\"blank--check\",\"y\"))","v":"n"}]
["Customs Advisor",{"$f":"INDEX($O:$O,MATCH(A13,$N:$N,0))","v":"Amy"},null,"Factors in Choosing Classes",null,null,"\"Registered\" choices: \"a\" to get message re stu registering in lab, \"b\" to get message re helping stu register in office, or type list of classes to be inserted.",null,null,null,null,null,null,"PrescribedCrsWriting",{"$f":"INDEX('My Students'!$20:$28,MATCH($O$1,'My Students'!$B$20:$B$28,0),MATCH(N13,'My Students'!$20:$20,0))","v":"College level"},{"$f":"IF(O13=\"college level\",\"n\",IF(O13=0,\"blank--check\",\"y\"))","v":"n"}]
[null,null,null,"Honors",{"$f":"INDEX($O:$O,MATCH(\"HonorsElig\",$N:$N,0))","v":"UH: elig"},null,null,null,null,null,null,null,null,"PrescribedCrsReading",{"$f":"INDEX('My Students'!$20:$28,MATCH($O$1,'My Students'!$B$20:$B$28,0),MATCH(N14,'My Students'!$20:$20,0))","v":"College level"},{"$f":"IF(O14=\"college level\",\"n\",IF(O14=0,\"blank--check\",\"y\"))","v":"n"}]
["Emily's Notes",{"$f":"INDEX($O:$O,MATCH(\"Notes\",$N:$N,0))","v":""},null,"Prescribeds",{"$f":"IF(AND(P12=\"n\",P13=\"n\",P14=\"n\"),\"\",\nCONCATENATE(\"Ks: \"&IF(P12=\"y\",O12,\"\")&IF(P12=\"y\",\", \",\"\")&IF(P12=\"blank--check\",\"Math--check; \",\"\")&\nIF(P13=\"y\",\"ENGL\",\"\")&IF(P13=\"y\",\", \",\"\")&IF(P13=\"blank--check\",\"Engl--check; \",\"\")&\nIF(P14=\"y\",\"READ\",\"\")&IF(T14=\"y\",\", \",\"\")&IF(P14=\"blank--check\",\"Read--check; \",\"\")&\nIF(P15=\"y\",\"U1010\",\"\")))","v":""},null,"This is what it will say:",null,null,"This is what it will say:",null,null,null,"PrescribedCrsStudySkills",{"$f":"INDEX('My Students'!$20:$28,MATCH($O$1,'My Students'!$B$20:$B$28,0),MATCH(N15,'My Students'!$20:$20,0))","v":0},{"$f":"IF((P12<>\"n\")+(P13=\"y\")+(P14=\"y\")>=2,\"y\",\"n\")","v":"n"}]
[null,null,null,null,null,null,{"$f":"H12","v":"Student came for advising during Customs."},null,null,{"$f":"K12","v":"We enjoyed seeing you at the CBHS Advising Center Customs session today, Major name!  \n\nIf you have any questions or concerns, please contact your advisor, Chloe (Chloe.Calhoun@mtsu.edu).  You'll also want to plan to come in for an advising appointment around mid-terms each semester, to talk about your classes for the upcoming term.  You can find Instructions and Schedule links at mtsu.edu/cbhsadv. \n\nWe look forward to seeing you at MTSU this semester!\n\nAlan Cook\nM00000002"},null,null,null,"HonorsElig",{"$f":"INDEX('My Students'!$20:$28,MATCH($O$1,'My Students'!$B$20:$B$28,0),MATCH(N16,'My Students'!$20:$20,0))","v":"UH: elig"}]
[null,null,null,"Scholars Acad",{"$f":"INDEX($O:$O,MATCH(\"Sacad\",$N:$N,0))","v":""},null,null,null,null,null,null,null,null,"ACTEngl",{"$f":"INDEX('My Students'!$20:$28,MATCH($O$1,'My Students'!$B$20:$B$28,0),MATCH(N17,'My Students'!$20:$20,0))","v":"Waiver"}]
[null,null,null,"Pre-Nursing",{"$f":"INDEX($O:$O,MATCH(\"PREN\",$N:$N,0))","v":""},null,null,null,null,null,null,null,null,"HighSchoolGPA",{"$f":"INDEX('My Students'!$20:$28,MATCH($O$1,'My Students'!$B$20:$B$28,0),MATCH(N18,'My Students'!$20:$20,0))","v":3.8}]
[{"$f":"INDEX(O:O,MATCH(\"StudentName\",N:N,0))","v":"Cook, Alan"},{"$f":"O1","v":"M00000002"},null,"ACTEngl",{"$f":"INDEX($O:$O,MATCH(\"ACTEngl\",$N:$N,0))","v":"Waiver"},null,null,null,null,null,null,null,null,"ACTCompositeScore",{"$f":"INDEX('My Students'!$20:$28,MATCH($O$1,'My Students'!$B$20:$B$28,0),MATCH(N19,'My Students'!$20:$20,0))","v":33}]
[{"$f":"IFERROR(MID(A19,SEARCH(\" \",A19,1)+1,SEARCH(\" \",A19,SEARCH(\" \",A19,1)+1)-SEARCH(\" \",A19,1)-1),MID(A19,FIND(\" \",A19)+1,256))","v":"Alan"},{"$f":"CONCATENATE(LEFT(A19,FIND(\", \",A19,1)-1))","v":"Cook"},null,null,null,null,null,null,null,null,null,null,null,"InclusiveGPA",{"$f":"INDEX('My Students'!$20:$28,MATCH($O$1,'My Students'!$B$20:$B$28,0),MATCH(N20,'My Students'!$20:$20,0))","v":4}]
["Major name",{"$f":"IF(E11=\"\",INDEX('Data Lists'!B:B,MATCH(E7,'Data Lists'!A:A,0)),INDEX('Data Lists'!B:B,MATCH(E11,'Data Lists'!B:B,0)))","v":"Psychology--Pre-Grad"},null,"Flags",null,null,null,null,null,null,null,null,null,"HrsEarned",{"$f":"INDEX('My Students'!$20:$28,MATCH($O$1,'My Students'!$B$20:$B$28,0),MATCH(N21,'My Students'!$20:$20,0))","v":13}]
["Folder name",{"$f":"IF(E11=\"\",CONCATENATE(INDEX('Data Lists'!E:E,MATCH(E7,'Data Lists'!A:A,0)),\" \",B20,\", \",A20,\" \",B3),CONCATENATE(INDEX('Data Lists'!E:E,MATCH(E11,'Data Lists'!B:B,0)),\" \",B20,\", \",A20,\" \",B3))","v":"PSY PGSC Cook, Alan M00000002"},null,"Holds",{"$f":"INDEX($O:$O,MATCH(D22,$N:$N,0))","v":"None"},null,null,null,null,null,null,null,null,"CountrySlot",{"$f":"INDEX('My Students'!$20:$28,MATCH($O$1,'My Students'!$B$20:$B$28,0),MATCH(N22,'My Students'!$20:$20,0))","v":"FR - France (s756)"}]
["Dept folders",{"$f":"HYPERLINK(CONCATENATE(\"Z:\\CoBHS Advising\\Departments\\\",IF(E11=\"\",INDEX('Data Lists'!D:D,MATCH(E7,'Data Lists'!A:A,0)),INDEX('Data Lists'!D:D,MATCH(E11,'Data Lists'!B:B,0))),\"\\Student Forms\\\"))","v":"Z:\\CoBHS Advising\\Departments\\Psychology\\Student Forms\\"},null,"Reg Restrictions",{"$f":"INDEX($O:$O,MATCH(\"RegistrationRestrictions\",$N:$N,0))","v":0},null,null,null,null,null,null,null,null,"CUSTOMSGrp",{"$f":"INDEX('My Students'!$20:$28,MATCH($O$1,'My Students'!$B$20:$B$28,0),MATCH(N23,'My Students'!$20:$20,0))","v":"PSY"}]
["Stu folder",{"$f":"HYPERLINK(CONCATENATE(\"Z:\\CoBHS Advising\\Departments\\\",IF(E11=\"\",INDEX('Data Lists'!D:D,MATCH(E7,'Data Lists'!A:A,0)),INDEX('Data Lists'!D:D,MATCH(E11,'Data Lists'!B:B,0))),\"\\Student Forms\\\",B22))","v":"Z:\\CoBHS Advising\\Departments\\Psychology\\Student Forms\\PSY PGSC Cook, Alan M00000002"},null,"Immunizations",{"$f":"INDEX($O:$O,MATCH(\"RegistrationRestrictions\",$N:$N,0))","v":0},null,null,null,null,null,null,null,null,"CustomsPOS",{"$f":"INDEX('My Students'!$20:$28,MATCH($O$1,'My Students'!$B$20:$B$28,0),MATCH(N24,'My Students'!$20:$20,0))","v":"BS_PSYPGSC"}]
[null,null,{"$f":"YEARFRAC(O33,NOW())","v":19.083333333333332},"Under 18 & Imm",{"$f":"IF(C25>=18,\"OK--over 18\",\"If need imms, will need parent sig\")","v":"OK--over 18"},null,null,null,null,null,null,null,null,"BannerPOS",{"$f":"INDEX('My Students'!$20:$28,MATCH($O$1,'My Students'!$B$20:$B$28,0),MATCH(N25,'My Students'!$20:$20,0))","v":"BS_PSYPGSC"}]
[null,null,null,"Missing Items",{"$f":"INDEX($O:$O,MATCH(\"MissingChecklistItems\",$N:$N,0))","v":"Final HS Tran upon Graduation"},null,null,null,null,null,null,null,null,"Assigned Advisor",{"$f":"INDEX('My Students'!$20:$28,MATCH($O$1,'My Students'!$B$20:$B$28,0),MATCH(N26,'My Students'!$20:$20,0))","v":"Chloe"}]
[null,null,null,"Term",{"$f":"INDEX($O:$O,MATCH(\"TermDesc\",$N:$N,0))","v":"Fall 2019"},null,null,null,null,null,null,null,null,"Customs Advisor",{"$f":"INDEX('My Students'!$20:$28,MATCH($O$1,'My Students'!$B$20:$B$28,0),MATCH(N27,'My Students'!$20:$20,0))","v":"Amy"}]
[null,null,null,"Might need BUAF",{"$f":"INDEX($O:$O,MATCH(\"VetOrDep\",$N:$N,0))","v":""},null,null,null,null,null,null,null,null,"Holds",{"$f":"INDEX('My Students'!$20:$28,MATCH($O$1,'My Students'!$B$20:$B$28,0),MATCH(N28,'My Students'!$20:$20,0))","v":"None"}]
[null,null,null,"Reverse Transfer",{"$f":"INDEX($O:$O,MATCH(\"ReverseTransfer\",$N:$N,0))","v":""},null,null,null,null,null,null,null,null,"RegistrationRestrictions",{"$f":"INDEX('My Students'!$20:$28,MATCH($O$1,'My Students'!$B$20:$B$28,0),MATCH(N29,'My Students'!$20:$20,0))","v":0}]
[null,null,null,"First Generation",{"$f":"INDEX($O:$O,MATCH(\"1stGen\",$N:$N,0))","v":"N"},null,null,null,null,null,null,null,null,"MissingChecklistItems",{"$f":"INDEX('My Students'!$20:$28,MATCH($O$1,'My Students'!$B$20:$B$28,0),MATCH(N30,'My Students'!$20:$20,0))","v":"Final HS Tran upon Graduation"}]
[null,null,null,null,null,null,null,null,null,null,null,null,null,"AdmissionDecision",{"$f":"INDEX('My Students'!$20:$28,MATCH($O$1,'My Students'!$B$20:$B$28,0),MATCH(N31,'My Students'!$20:$20,0))","v":"FC-Freshman Tentative Accept"}]
["Want to add a link to the student's folder? ",null,null,null,null,null,null,null,null,null,null,null,null,"TermDesc",{"$f":"INDEX('My Students'!$20:$28,MATCH($O$1,'My Students'!$B$20:$B$28,0),MATCH(N32,'My Students'!$20:$20,0))","v":"Fall 2019"}]
["--Click on the \"Stu folder\" field above (B21).",null,null,null,null,null,null,null,null,null,null,null,null,"DateofBirth",{"$f":"INDEX('My Students'!$20:$28,MATCH($O$1,'My Students'!$B$20:$B$28,0),MATCH(N33,'My Students'!$20:$20,0))","v":"2000-12-31"}]
["--Control-K to start the process of creating a link.",null,null,null,null,null,null,null,null,null,null,null,null,"Notes",{"$f":"INDEX('My Students'!$20:$28,MATCH($O$1,'My Students'!$B$20:$B$28,0),MATCH(N34,'My Students'!$20:$20,0))","v":""}]
["--Browse to the student's folder.",null,null,null,null,null,null,null,null,null,null,null,null,"MTSUEmail",{"$f":"INDEX('My Students'!$20:$28,MATCH($O$1,'My Students'!$B$20:$B$28,0),MATCH(N35,'My Students'!$20:$20,0))","v":"3@mtmail.mtsu.edu"}]
["--Choose any file in the folder and double-click on it.",null,null,null,null,null,null,null,null,null,null,null,null,"PersonalEmail",{"$f":"INDEX('My Students'!$20:$28,MATCH($O$1,'My Students'!$B$20:$B$28,0),MATCH(N36,'My Students'!$20:$20,0))","v":"3@gmail.com"}]
["--In the Address box, delete the file name (back to the \\ after the folder name).",null,null,null,null,null,null,null,null,null,null,null,null,"PermPhone",{"$f":"INDEX('My Students'!$20:$28,MATCH($O$1,'My Students'!$B$20:$B$28,0),MATCH(N37,'My Students'!$20:$20,0))","v":"(423) 618-0000"}]
["--Click OK.",null,null,null,null,null,null,null,null,null,null,null,null,"MailingPhone",{"$f":"INDEX('My Students'!$20:$28,MATCH($O$1,'My Students'!$B$20:$B$28,0),MATCH(N38,'My Students'!$20:$20,0))","v":"(423) 618-0000"}]
["--Now you should see the path to the folder, underlined as a link.",null,null,null,null,null,null,null,null,null,null,null,null,"NursElig",{"$f":"INDEX('My Students'!$20:$28,MATCH($O$1,'My Students'!$B$20:$B$28,0),MATCH(N39,'My Students'!$20:$20,0))","v":""}]
["--When you click on your link, the folder should open in a separate window.",null,null,null,null,null,null,null,null,null,null,null,null,"ACTMathScre",{"$f":"INDEX('My Students'!$20:$28,MATCH($O$1,'My Students'!$B$20:$B$28,0),MATCH(N40,'My Students'!$20:$20,0))","v":29}]
[null,null,null,null,null,null,null,null,null,null,null,null,null,"ACTScienceScre",{"$f":"INDEX('My Students'!$20:$28,MATCH($O$1,'My Students'!$B$20:$B$28,0),MATCH(N41,'My Students'!$20:$20,0))","v":34}]
[null,null,null,null,null,null,null,null,null,null,null,null,null,"A&P?",{"$f":"IF(O1<>\"\",IF(OR(AND(O40=21,O41>21),AND(O40>21,O41=21)),\"maybe\",IF(AND(O31>=21,O41>=21),\"Y\",\"N\")),\"\")","v":"Y"}]
[null,null,null,null,null,null,null,null,null,null,null,null,null,"Major",{"$f":"INDEX('Data Lists'!B:B,MATCH(O24,'Data Lists'!A:A,0))","v":"Psychology--Pre-Grad"}]
[null,null,null,null,null,null,null,null,null,null,null,null,null,"NameM#",{"$f":"CONCATENATE(O47,\", \",O46,\" \",O45)","v":"Cook, Alan M00000002"}]
[null,null,null,null,null,null,null,null,null,null,null,null,null,"M# copy",{"$f":"O1","v":"M00000002"}]
[null,null,null,null,null,null,null,null,null,null,null,null,null,"Fname",{"$f":"IF(1<>\"\",IFERROR(MID(O9,SEARCH(\" \",O9,1)+1,SEARCH(\" \",O9,SEARCH(\" \",O9,1)+1)-SEARCH(\" \",O9,1)-1),MID(O9,FIND(\" \",O9)+1,256)),\"\")","v":"Alan"}]
[null,null,null,null,null,null,null,null,null,null,null,null,null,"Lname",{"$f":"IF(O1<>\"\",CONCATENATE(LEFT(O9,FIND(\", \",O9,1)-1)),\"\")","v":"Cook"}]

{"sheet":"B","index":24,"n_rows":47,"n_cols":16,"rows_kept":47,"cut":false,"hidden":false,"merged":[[15,6,39,7],[15,9,39,10],[14,3,15,3],[14,4,15,4],[14,0,15,0],[14,1,15,1]]}
["Contact & Demographic Info",null,null,"Academic Info",null,null,"Start",null,null,"Change major",null,null,null,"M#",{"$f":"'My Students'!B22","v":"M00000003"}]
["Name",{"$f":"CONCATENATE(A21,\" \",B21)","v":"Abigail Jones"},null,"Transferred hours",{"$f":"INDEX($O:$O,MATCH(\"HrsEarned\",$N:$N,0))","v":6},null,"Stop",null,null,"Notes for advisor",null,null,null,"Deleted",{"$f":"INDEX('My Students'!$20:$28,MATCH($O$1,'My Students'!$B$20:$B$28,0),MATCH(N2,'My Students'!$20:$20,0))","v":"This is sample data. The purple button will paste over it. Just ignore it for now!"}]
["M#",{"$f":"O1","v":"M00000003"},null,"HS GPA",{"$f":"INDEX($O:$O,MATCH(\"HighSchoolGPA\",$N:$N,0))","v":4},null,null,null,null,null,null,null,null,"SAcad",{"$f":"INDEX('My Students'!$20:$28,MATCH($O$1,'My Students'!$B$20:$B$28,0),MATCH(N3,'My Students'!$20:$20,0))","v":""}]
["MTSUEmail",{"$f":"INDEX($O:$O,MATCH(A4,$N:$N,0))","v":"4@mtmail.mtsu.edu"},null,"Inclusive GPA",{"$f":"INDEX($O:$O,MATCH(\"InclusiveGPA\",$N:$N,0))","v":3.33},null,null,"Report Builder",null,null,"Student Message Builder",null,null,"VetOrDep",{"$f":"INDEX('My Students'!$20:$28,MATCH($O$1,'My Students'!$B$20:$B$28,0),MATCH(N4,'My Students'!$20:$20,0))","v":""}]
["PersonalEmail",{"$f":"INDEX($O:$O,MATCH(A5,$N:$N,0))","v":"4@gmail.com"},null,"ACT Math",{"$f":"INDEX($O:$O,MATCH(\"ACTMathScre\",$N:$N,0))","v":17},null,"Registered",null,"see below","Docs attached",null,"x (to say that you've attached docs for the student)",null,"PREN",{"$f":"INDEX('My Students'!$20:$28,MATCH($O$1,'My Students'!$B$20:$B$28,0),MATCH(N5,'My Students'!$20:$20,0))","v":"Y"}]
["PermPhone",{"$f":"INDEX($O:$O,MATCH(A6,$N:$N,0))","v":"(615) 822-0000"},null,"ACT Science",{"$f":"INDEX($O:$O,MATCH(\"ACTScienceScre\",$N:$N,0))","v":22},null,"Attaching Scan",null,"x","Drop/Add info",null,"x (to give info on switching classes & steps to do so)",null,"1stGen",{"$f":"INDEX('My Students'!$20:$28,MATCH($O$1,'My Students'!$B$20:$B$28,0),MATCH(N6,'My Students'!$20:$20,0))","v":"N"}]
["MailingPhone",{"$f":"INDEX($O:$O,MATCH(A7,$N:$N,0))","v":0},null,"CustomsPOS",{"$f":"INDEX($O:$O,MATCH(D7,$N:$N,0))","v":"BSN_NURSPREN"},null,"Submitted COM",null,"x","Acad success tips",null,"x (to give acad tips, tutoring & SI websites, & \"ask for help\")",null,"ReverseTransfer",{"$f":"INDEX('My Students'!$20:$28,MATCH($O$1,'My Students'!$B$20:$B$28,0),MATCH(N7,'My Students'!$20:$20,0))","v":""}]
[null,null,null,null,{"$f":"INDEX($O:$O,MATCH(\"Major\",$N:$N,0))","v":"Nursing Candidate"},null,"Supp Instructn",null,"x","NURS Info Session",null,"x (to refer student to nursing info webpage and session)",null,"FR/TR",{"$f":"INDEX('My Students'!$20:$28,MATCH($O$1,'My Students'!$B$20:$B$28,0),MATCH(N8,'My Students'!$20:$20,0))","v":"F"}]
["Customs Info",null,null,"BannerPOS",{"$f":"INDEX($O:$O,MATCH(D9,$N:$N,0))","v":"BSN_NURSPREN"},null,"RTTP",null,"x","Check phone #",null,"x (to tell stu their listed ph #s are wrong, & how to fix)",null,"StudentName",{"$f":"INDEX('My Students'!$20:$28,MATCH($O$1,'My Students'!$B$20:$B$28,0),MATCH(N9,'My Students'!$20:$20,0))","v":"Jones, Abigail"}]
["CountrySlot",{"$f":"INDEX($O:$O,MATCH(A10,$N:$N,0))","v":"PO - Portugal (s751)"},null,"Majors match?",{"$f":"IF(E7=E9,\"Y\",\"N, Submit change of major\")","v":"Y"},null,"Note 1",null,"x","Advisor info",{"$f":"INDEX('Data Lists'!$J:$J,MATCH($B$12,'Data Lists'!$H:$H,0))","v":"your advisor, Eileen (Eileen.Chalmers@mtsu.edu)"},"(leave formula, or type \"me <email>\")",null,"Major",{"$f":"INDEX('My Students'!$20:$28,MATCH($O$1,'My Students'!$B$20:$B$28,0),MATCH(N10,'My Students'!$20:$20,0))","v":"Nursing Candidate"}]
["Order/Time",{"$f":"INDEX($O:$O,MATCH(A11,$N:$N,0))","v":"2/10:30 AM"},null,"Override major",null,null,"Other",null,"[notes]","Other",null,"[type any notes to student]",null,"Order/Time",{"$f":"INDEX('My Students'!$20:$28,MATCH($O$1,'My Students'!$B$20:$B$28,0),MATCH(N11,'My Students'!$20:$20,0))","v":"2/10:30 AM"}]
["Acad Advisor",{"$f":"INDEX($O:$O,MATCH(\"Assigned Advisor\",$N:$N,0))","v":"Eileen"},null,null,null,null,"Paste in advising report:",{"$f":"CONCATENATE(\"Student came for advising during Customs.\",IF(H6<>\"\",\"  Attaching scanned copy of notes.\",\"\"),IF(H5=\"a\",Messages!$C$2,IF(H5=\"b\",Messages!$C$3,IF(H5<>\"\",CONCATENATE(\"  Registered student for classes for upcoming semester: \",H5),\"\"))),IF(H11<>\"\",CONCATENATE(\"\n\n\",H11),\"\"),IF(H7<>\"\",\"\n\nSubmitted change of major form. \",\"\"),IF(H8<>\"\",Messages!$C$4,\"\"),IF(H9<>\"\",Messages!$C$5,\"\"),IF(H10<>\"\",Messages!$C$6,\"\"))","v":"Student came for advising during Customs."},null,"Paste in stu msg:",{"$f":"CONCATENATE(\"We enjoyed seeing you at the CBHS Advising Center Customs session today, \",$A$21,\"!  \",IF(K5=\"x\",\"I've attached your Registration Checklist, for your records.\",\"\"),IF(K11<>\"\",CONCATENATE(\"\n\n\",K11),\"\"),IF(K6=\"x\",CONCATENATE(Messages!$C$7&K10&\", before making changes.\"),\"\"),IF(K9=\"x\",Messages!$C$10,\"\"),IF(K7=\"x\",Messages!$C$8,\"\"),IF(K8<>\"\",Messages!$C$9,\"\"),CONCATENATE(\"\n\nIf you have any questions or concerns, please contact \"&K10&\".  You'll also want to plan to come in for an advising appointment around mid-terms each semester, to talk about your classes for the upcoming term.  You can find Instructions and Schedule links at mtsu.edu/cbhsadv. \"),\"\n\nWe look forward to seeing you at MTSU this semester!\n\n\",$B$2,\"\n\",$B$3)","v":"We enjoyed seeing you at the CBHS Advising Center Customs session today, Abigail!  \n\nIf you have any questions or concerns, please contact your advisor, Eileen (Eileen.Chalmers@mtsu.edu).  You'll also want to plan to come in for an advising appointment around mid-terms each semester, to talk about your classes for the upcoming term.  You can find Instructions and Schedule links at mtsu.edu/cbhsadv. \n\nWe look forward to seeing you at MTSU this semester!\n\nAbigail Jones\nM00000003"},null,null,"PrescribedCrsMath",{"$f":"INDEX('My Students'!$20:$28,MATCH($O$1,'My Students'!$B$20:$B$28,0),MATCH(N12,'My Students'!$20:$20,0))","v":"MATH 1010K/1530K/1710K"},{"$f":"IF(O12=\"college level\",\"n\",IF(O12=0,\"blank--check\",\"y\"))","v":"y"}]
["Customs Advisor",{"$f":"INDEX($O:$O,MATCH(A13,$N:$N,0))","v":"Chloe"},null,"Factors in Choosing Classes",null,null,"\"Registered\" choices: \"a\" to get message re stu registering in lab, \"b\" to get message re helping stu register in office, or type list of classes to be inserted.",null,null,null,null,null,null,"PrescribedCrsWriting",{"$f":"INDEX('My Students'!$20:$28,MATCH($O$1,'My Students'!$B$20:$B$28,0),MATCH(N13,'My Students'!$20:$20,0))","v":"College level"},{"$f":"IF(O13=\"college level\",\"n\",IF(O13=0,\"blank--check\",\"y\"))","v":"n"}]
[null,null,null,"Honors",{"$f":"INDEX($O:$O,MATCH(\"HonorsElig\",$N:$N,0))","v":"Formula: N"},null,null,null,null,null,null,null,null,"PrescribedCrsReading",{"$f":"INDEX('My Students'!$20:$28,MATCH($O$1,'My Students'!$B$20:$B$28,0),MATCH(N14,'My Students'!$20:$20,0))","v":"College level"},{"$f":"IF(O14=\"college level\",\"n\",IF(O14=0,\"blank--check\",\"y\"))","v":"n"}]
["Emily's Notes",{"$f":"INDEX($O:$O,MATCH(\"Notes\",$N:$N,0))","v":"Assigned advisor based on primary major"},null,"Prescribeds",{"$f":"IF(AND(P12=\"n\",P13=\"n\",P14=\"n\"),\"\",\nCONCATENATE(\"Ks: \"&IF(P12=\"y\",O12,\"\")&IF(P12=\"y\",\", \",\"\")&IF(P12=\"blank--check\",\"Math--check; \",\"\")&\nIF(P13=\"y\",\"ENGL\",\"\")&IF(P13=\"y\",\", \",\"\")&IF(P13=\"blank--check\",\"Engl--check; \",\"\")&\nIF(P14=\"y\",\"READ\",\"\")&IF(T14=\"y\",\", \",\"\")&IF(P14=\"blank--check\",\"Read--check; \",\"\")&\nIF(P15=\"y\",\"U1010\",\"\")))","v":"Ks: MATH 1010K/1530K/1710K, "},null,"This is what it will say:",null,null,"This is what it will say:",null,null,null,"PrescribedCrsStudySkills",{"$f":"INDEX('My Students'!$20:$28,MATCH($O$1,'My Students'!$B$20:$B$28,0),MATCH(N15,'My Students'!$20:$20,0))","v":0},{"$f":"IF((P12<>\"n\")+(P13=\"y\")+(P14=\"y\")>=2,\"y\",\"n\")","v":"n"}]
[null,null,null,null,null,null,{"$f":"H12","v":"Student came for advising during Customs."},null,null,{"$f":"K12","v":"We enjoyed seeing you at the CBHS Advising Center Customs session today, Abigail!  \n\nIf you have any questions or concerns, please contact your advisor, Eileen (Eileen.Chalmers@mtsu.edu).  You'll also want to plan to come in for an advising appointment around mid-terms each semester, to talk about your classes for the upcoming term.  You can find Instructions and Schedule links at mtsu.edu/cbhsadv. \n\nWe look forward to seeing you at MTSU this semester!\n\nAbigail Jones\nM00000003"},null,null,null,"HonorsElig",{"$f":"INDEX('My Students'!$20:$28,MATCH($O$1,'My Students'!$B$20:$B$28,0),MATCH(N16,'My Students'!$20:$20,0))","v":"Formula: N"}]
[null,null,null,"Scholars Acad",{"$f":"INDEX($O:$O,MATCH(\"Sacad\",$N:$N,0))","v":""},null,null,null,null,null,null,null,null,"ACTEngl",{"$f":"INDEX('My Students'!$20:$28,MATCH($O$1,'My Students'!$B$20:$B$28,0),MATCH(N17,'My Students'!$20:$20,0))","v":""}]
[null,null,null,"Pre-Nursing",{"$f":"INDEX($O:$O,MATCH(\"PREN\",$N:$N,0))","v":"Y"},null,null,null,null,null,null,null,null,"HighSchoolGPA",{"$f":"INDEX('My Students'!$20:$28,MATCH($O$1,'My Students'!$B$20:$B$28,0),MATCH(N18,'My Students'!$20:$20,0))","v":4}]
["Copy-Pastes & Folder Links",null,null,"ACTEngl",{"$f":"INDEX($O:$O,MATCH(\"ACTEngl\",$N:$N,0))","v":""},null,null,null,null,null,null,null,null,"ACTCompositeScore",{"$f":"INDEX('My Students'!$20:$28,MATCH($O$1,'My Students'!$B$20:$B$28,0),MATCH(N19,'My Students'!$20:$20,0))","v":21}]
[{"$f":"INDEX(O:O,MATCH(\"StudentName\",N:N,0))","v":"Jones, Abigail"},{"$f":"O1","v":"M00000003"},null,null,null,null,null,null,null,null,null,null,null,"InclusiveGPA",{"$f":"INDEX('My Students'!$20:$28,MATCH($O$1,'My Students'!$B$20:$B$28,0),MATCH(N20,'My Students'!$20:$20,0))","v":3.33}]
[{"$f":"IFERROR(MID(A20,SEARCH(\" \",A20,1)+1,SEARCH(\" \",A20,SEARCH(\" \",A20,1)+1)-SEARCH(\" \",A20,1)-1),MID(A20,FIND(\" \",A20)+1,256))","v":"Abigail"},{"$f":"CONCATENATE(LEFT(A20,FIND(\", \",A20,1)-1))","v":"Jones"},null,"Flags",null,null,null,null,null,null,null,null,null,"HrsEarned",{"$f":"INDEX('My Students'!$20:$28,MATCH($O$1,'My Students'!$B$20:$B$28,0),MATCH(N21,'My Students'!$20:$20,0))","v":6}]
["Major name",{"$f":"IF(E11=\"\",INDEX('Data Lists'!B:B,MATCH(E7,'Data Lists'!A:A,0)),INDEX('Data Lists'!B:B,MATCH(E11,'Data Lists'!B:B,0)))","v":"Pre-Nursing"},null,"Holds",{"$f":"INDEX($O:$O,MATCH(D22,$N:$N,0))","v":"None"},null,null,null,null,null,null,null,null,"CountrySlot",{"$f":"INDEX('My Students'!$20:$28,MATCH($O$1,'My Students'!$B$20:$B$28,0),MATCH(N22,'My Students'!$20:$20,0))","v":"PO - Portugal (s751)"}]
["Folder name",{"$f":"IF(E11=\"\",CONCATENATE(INDEX('Data Lists'!E:E,MATCH(E7,'Data Lists'!A:A,0)),\" \",B21,\", \",A21,\" \",B3),CONCATENATE(INDEX('Data Lists'!E:E,MATCH(E11,'Data Lists'!B:B,0)),\" \",B21,\", \",A21,\" \",B3))","v":"NURS PREN Jones, Abigail M00000003"},null,"Reg Restrictions",{"$f":"INDEX($O:$O,MATCH(\"RegistrationRestrictions\",$N:$N,0))","v":0},null,null,null,null,null,null,null,null,"CUSTOMSGrp",{"$f":"INDEX('My Students'!$20:$28,MATCH($O$1,'My Students'!$B$20:$B$28,0),MATCH(N23,'My Students'!$20:$20,0))","v":"NURS"}]
["Dept folders",{"$f":"HYPERLINK(CONCATENATE(\"Z:\\CoBHS Advising\\Departments\\\",IF(E12=\"\",INDEX('Data Lists'!D:D,MATCH(E8,'Data Lists'!A:A,0)),INDEX('Data Lists'!D:D,MATCH(E12,'Data Lists'!B:B,0))),\"\\Student Forms\\\"))","v":{"$error":"#N/A"}},null,"Immunizations",{"$f":"INDEX($O:$O,MATCH(\"RegistrationRestrictions\",$N:$N,0))","v":0},null,null,null,null,null,null,null,null,"CustomsPOS",{"$f":"INDEX('My Students'!$20:$28,MATCH($O$1,'My Students'!$B$20:$B$28,0),MATCH(N24,'My Students'!$20:$20,0))","v":"BSN_NURSPREN"}]
["Stu folder",{"$f":"HYPERLINK(CONCATENATE(\"Z:\\CoBHS Advising\\Departments\\\",IF(E12=\"\",INDEX('Data Lists'!D:D,MATCH(E8,'Data Lists'!A:A,0)),INDEX('Data Lists'!D:D,MATCH(E12,'Data Lists'!B:B,0))),\"\\Student Forms\\\",B23))","v":{"$error":"#N/A"}},{"$f":"YEARFRAC(O33,NOW())","v":18.427777777777777},"Under 18 & Imm",{"$f":"IF(C25>=18,\"OK--over 18\",\"If need imms, will need parent sig\")","v":"OK--over 18"},null,null,null,null,null,null,null,null,"BannerPOS",{"$f":"INDEX('My Students'!$20:$28,MATCH($O$1,'My Students'!$B$20:$B$28,0),MATCH(N25,'My Students'!$20:$20,0))","v":"BSN_NURSPREN"}]
[null,null,null,"Missing Items",{"$f":"INDEX($O:$O,MATCH(\"MissingChecklistItems\",$N:$N,0))","v":"Final HS Tran upon Graduation"},null,null,null,null,null,null,null,null,"Assigned Advisor",{"$f":"INDEX('My Students'!$20:$28,MATCH($O$1,'My Students'!$B$20:$B$28,0),MATCH(N26,'My Students'!$20:$20,0))","v":"Eileen"}]
[null,null,null,"Term",{"$f":"INDEX($O:$O,MATCH(\"TermDesc\",$N:$N,0))","v":"Fall 2019"},null,null,null,null,null,null,null,null,"Customs Advisor",{"$f":"INDEX('My Students'!$20:$28,MATCH($O$1,'My Students'!$B$20:$B$28,0),MATCH(N27,'My Students'!$20:$20,0))","v":"Chloe"}]
[null,null,null,"Might need BUAF",{"$f":"INDEX($O:$O,MATCH(\"VetOrDep\",$N:$N,0))","v":""},null,null,null,null,null,null,null,null,"Holds",{"$f":"INDEX('My Students'!$20:$28,MATCH($O$1,'My Students'!$B$20:$B$28,0),MATCH(N28,'My Students'!$20:$20,0))","v":"None"}]
[null,null,null,"Reverse Transfer",{"$f":"INDEX($O:$O,MATCH(\"ReverseTransfer\",$N:$N,0))","v":""},null,null,null,null,null,null,null,null,"RegistrationRestrictions",{"$f":"INDEX('My Students'!$20:$28,MATCH($O$1,'My Students'!$B$20:$B$28,0),MATCH(N29,'My Students'!$20:$20,0))","v":0}]
[null,null,null,"First Generation",{"$f":"INDEX($O:$O,MATCH(\"1stGen\",$N:$N,0))","v":"N"},null,null,null,null,null,null,null,null,"MissingChecklistItems",{"$f":"INDEX('My Students'!$20:$28,MATCH($O$1,'My Students'!$B$20:$B$28,0),MATCH(N30,'My Students'!$20:$20,0))","v":"Final HS Tran upon Graduation"}]
[null,null,null,null,null,null,null,null,null,null,null,null,null,"AdmissionDecision",{"$f":"INDEX('My Students'!$20:$28,MATCH($O$1,'My Students'!$B$20:$B$28,0),MATCH(N31,'My Students'!$20:$20,0))","v":"FC-Freshman Tentative Accept"}]
["Want to add a link to the student's folder? ",null,null,null,null,null,null,null,null,null,null,null,null,"TermDesc",{"$f":"INDEX('My Students'!$20:$28,MATCH($O$1,'My Students'!$B$20:$B$28,0),MATCH(N32,'My Students'!$20:$20,0))","v":"Fall 2019"}]
["--Click on the \"Stu folder\" field above (B21).",null,null,null,null,null,null,null,null,null,null,null,null,"DateofBirth",{"$f":"INDEX('My Students'!$20:$28,MATCH($O$1,'My Students'!$B$20:$B$28,0),MATCH(N33,'My Students'!$20:$20,0))","v":"2001-08-26"}]
["--Control-K to start the process of creating a link.",null,null,null,null,null,null,null,null,null,null,null,null,"Notes",{"$f":"INDEX('My Students'!$20:$28,MATCH($O$1,'My Students'!$B$20:$B$28,0),MATCH(N34,'My Students'!$20:$20,0))","v":"Assigned advisor based on primary major"}]
["--Browse to the student's folder.",null,null,null,null,null,null,null,null,null,null,null,null,"MTSUEmail",{"$f":"INDEX('My Students'!$20:$28,MATCH($O$1,'My Students'!$B$20:$B$28,0),MATCH(N35,'My Students'!$20:$20,0))","v":"4@mtmail.mtsu.edu"}]
["--Choose any file in the folder and double-click on it.",null,null,null,null,null,null,null,null,null,null,null,null,"PersonalEmail",{"$f":"INDEX('My Students'!$20:$28,MATCH($O$1,'My Students'!$B$20:$B$28,0),MATCH(N36,'My Students'!$20:$20,0))","v":"4@gmail.com"}]
["--In the Address box, delete the file name (back to the \\ after the folder name).",null,null,null,null,null,null,null,null,null,null,null,null,"PermPhone",{"$f":"INDEX('My Students'!$20:$28,MATCH($O$1,'My Students'!$B$20:$B$28,0),MATCH(N37,'My Students'!$20:$20,0))","v":"(615) 822-0000"}]
["--Click OK.",null,null,null,null,null,null,null,null,null,null,null,null,"MailingPhone",{"$f":"INDEX('My Students'!$20:$28,MATCH($O$1,'My Students'!$B$20:$B$28,0),MATCH(N38,'My Students'!$20:$20,0))","v":0}]
["--Now you should see the path to the folder, underlined as a link.",null,null,null,null,null,null,null,null,null,null,null,null,"NursElig",{"$f":"INDEX('My Students'!$20:$28,MATCH($O$1,'My Students'!$B$20:$B$28,0),MATCH(N39,'My Students'!$20:$20,0))","v":"N"}]
["--When you click on your link, the folder should open in a separate window.",null,null,null,null,null,null,null,null,null,null,null,null,"ACTMathScre",{"$f":"INDEX('My Students'!$20:$28,MATCH($O$1,'My Students'!$B$20:$B$28,0),MATCH(N40,'My Students'!$20:$20,0))","v":17}]
[null,null,null,null,null,null,null,null,null,null,null,null,null,"ACTScienceScre",{"$f":"INDEX('My Students'!$20:$28,MATCH($O$1,'My Students'!$B$20:$B$28,0),MATCH(N41,'My Students'!$20:$20,0))","v":22}]
[null,null,null,null,null,null,null,null,null,null,null,null,null,"A&P?",{"$f":"IF(O1<>\"\",IF(OR(AND(O40=21,O41>21),AND(O40>21,O41=21)),\"maybe\",IF(AND(O31>=21,O41>=21),\"Y\",\"N\")),\"\")","v":"Y"}]
[null,null,null,null,null,null,null,null,null,null,null,null,null,"Major",{"$f":"INDEX('Data Lists'!B:B,MATCH(O24,'Data Lists'!A:A,0))","v":"Pre-Nursing"}]
[null,null,null,null,null,null,null,null,null,null,null,null,null,"NameM#",{"$f":"CONCATENATE(O47,\", \",O46,\" \",O45)","v":"Jones, Abigail M00000003"}]
[null,null,null,null,null,null,null,null,null,null,null,null,null,"M# copy",{"$f":"O1","v":"M00000003"}]
[null,null,null,null,null,null,null,null,null,null,null,null,null,"Fname",{"$f":"IF(1<>\"\",IFERROR(MID(O9,SEARCH(\" \",O9,1)+1,SEARCH(\" \",O9,SEARCH(\" \",O9,1)+1)-SEARCH(\" \",O9,1)-1),MID(O9,FIND(\" \",O9)+1,256)),\"\")","v":"Abigail"}]
[null,null,null,null,null,null,null,null,null,null,null,null,null,"Lname",{"$f":"IF(O1<>\"\",CONCATENATE(LEFT(O9,FIND(\", \",O9,1)-1)),\"\")","v":"Jones"}]

{"sheet":"C","index":25,"n_rows":47,"n_cols":16,"rows_kept":47,"cut":false,"hidden":false,"merged":[[15,6,39,7],[15,9,39,10],[14,3,15,3],[14,4,15,4],[14,0,15,0],[14,1,15,1]]}
["Contact & Demographic Info",null,null,"Academic Info",null,null,"Start",null,null,"Change major",null,null,null,"M#",{"$f":"'My Students'!B23","v":"M00000004"}]
["Name",{"$f":"CONCATENATE(A21,\" \",B21)","v":"Briana Jones"},null,"Transferred hours",{"$f":"INDEX($O:$O,MATCH(\"HrsEarned\",$N:$N,0))","v":""},null,"Stop",null,null,"Notes for advisor",null,null,null,"Deleted",{"$f":"INDEX('My Students'!$20:$28,MATCH($O$1,'My Students'!$B$20:$B$28,0),MATCH(N2,'My Students'!$20:$20,0))","v":"This is sample data. The purple button will paste over it. Just ignore it for now!"}]
["M#",{"$f":"O1","v":"M00000004"},null,"HS GPA",{"$f":"INDEX($O:$O,MATCH(\"HighSchoolGPA\",$N:$N,0))","v":3.29},null,null,null,null,null,null,null,null,"SAcad",{"$f":"INDEX('My Students'!$20:$28,MATCH($O$1,'My Students'!$B$20:$B$28,0),MATCH(N3,'My Students'!$20:$20,0))","v":""}]
["MTSUEmail",{"$f":"INDEX($O:$O,MATCH(A4,$N:$N,0))","v":"5@mtmail.mtsu.edu"},null,"Inclusive GPA",{"$f":"INDEX($O:$O,MATCH(\"InclusiveGPA\",$N:$N,0))","v":""},null,null,"Report Builder",null,null,"Student Message Builder",null,null,"VetOrDep",{"$f":"INDEX('My Students'!$20:$28,MATCH($O$1,'My Students'!$B$20:$B$28,0),MATCH(N4,'My Students'!$20:$20,0))","v":""}]
["PersonalEmail",{"$f":"INDEX($O:$O,MATCH(A5,$N:$N,0))","v":"5@gmail.com"},null,"ACT Math",{"$f":"INDEX($O:$O,MATCH(\"ACTMathScre\",$N:$N,0))","v":21},null,"Registered",null,"see below","Docs attached",null,"x (to say that you've attached docs for the student)",null,"PREN",{"$f":"INDEX('My Students'!$20:$28,MATCH($O$1,'My Students'!$B$20:$B$28,0),MATCH(N5,'My Students'!$20:$20,0))","v":""}]
["PermPhone",{"$f":"INDEX($O:$O,MATCH(A6,$N:$N,0))","v":"(615) 319-0000"},null,"ACT Science",{"$f":"INDEX($O:$O,MATCH(\"ACTScienceScre\",$N:$N,0))","v":19},null,"Attaching Scan",null,"x","Drop/Add info",null,"x (to give info on switching classes & steps to do so)",null,"1stGen",{"$f":"INDEX('My Students'!$20:$28,MATCH($O$1,'My Students'!$B$20:$B$28,0),MATCH(N6,'My Students'!$20:$20,0))","v":"N"}]
["MailingPhone",{"$f":"INDEX($O:$O,MATCH(A7,$N:$N,0))","v":"(615) 594-0000"},null,"CustomsPOS",{"$f":"INDEX($O:$O,MATCH(D7,$N:$N,0))","v":"BS_PSY"},null,"Submitted COM",null,"x","Acad success tips",null,"x (to give acad tips, tutoring & SI websites, & \"ask for help\")",null,"ReverseTransfer",{"$f":"INDEX('My Students'!$20:$28,MATCH($O$1,'My Students'!$B$20:$B$28,0),MATCH(N7,'My Students'!$20:$20,0))","v":""}]
[null,null,null,null,{"$f":"INDEX($O:$O,MATCH(\"Major\",$N:$N,0))","v":"PREN--Psychology"},null,"Supp Instructn",null,"x","NURS Info Session",null,"x (to refer student to nursing info webpage and session)",null,"FR/TR",{"$f":"INDEX('My Students'!$20:$28,MATCH($O$1,'My Students'!$B$20:$B$28,0),MATCH(N8,'My Students'!$20:$20,0))","v":"F"}]
["Customs Info",null,null,"BannerPOS",{"$f":"INDEX($O:$O,MATCH(D9,$N:$N,0))","v":"BS_PSY"},null,"RTTP",null,"x","Check phone #",null,"x (to tell stu their listed ph #s are wrong, & how to fix)",null,"StudentName",{"$f":"INDEX('My Students'!$20:$28,MATCH($O$1,'My Students'!$B$20:$B$28,0),MATCH(N9,'My Students'!$20:$20,0))","v":"Jones, Briana"}]
["CountrySlot",{"$f":"INDEX($O:$O,MATCH(A10,$N:$N,0))","v":"VE - Venezuela (s759)"},null,"Majors match?",{"$f":"IF(E7=E9,\"Y\",\"N, Submit change of major\")","v":"Y"},null,"Note 1",null,"x","Advisor info",{"$f":"INDEX('Data Lists'!$J:$J,MATCH($B$12,'Data Lists'!$H:$H,0))","v":{"$error":"#N/A"}},"(leave formula, or type \"me <email>\")",null,"Major",{"$f":"INDEX('My Students'!$20:$28,MATCH($O$1,'My Students'!$B$20:$B$28,0),MATCH(N10,'My Students'!$20:$20,0))","v":"PREN--Psychology"}]
["Order/Time",{"$f":"INDEX($O:$O,MATCH(A11,$N:$N,0))","v":"3/11:00 AM"},null,"Override major",null,null,"Other",null,"[notes]","Other",null,"[type any notes to student]",null,"Order/Time",{"$f":"INDEX('My Students'!$20:$28,MATCH($O$1,'My Students'!$B$20:$B$28,0),MATCH(N11,'My Students'!$20:$20,0))","v":"3/11:00 AM"}]
["Acad Advisor",{"$f":"INDEX($O:$O,MATCH(\"Assigned Advisor\",$N:$N,0))","v":"Bonnie"},null,null,null,null,"Paste in advising report:",{"$f":"CONCATENATE(\"Student came for advising during Customs.\",IF(H6<>\"\",\"  Attaching scanned copy of notes.\",\"\"),IF(H5=\"a\",Messages!$C$2,IF(H5=\"b\",Messages!$C$3,IF(H5<>\"\",CONCATENATE(\"  Registered student for classes for upcoming semester: \",H5),\"\"))),IF(H11<>\"\",CONCATENATE(\"\n\n\",H11),\"\"),IF(H7<>\"\",\"\n\nSubmitted change of major form. \",\"\"),IF(H8<>\"\",Messages!$C$4,\"\"),IF(H9<>\"\",Messages!$C$5,\"\"),IF(H10<>\"\",Messages!$C$6,\"\"))","v":"Student came for advising during Customs."},null,"Paste in stu msg:",{"$f":"CONCATENATE(\"We enjoyed seeing you at the CBHS Advising Center Customs session today, \",$A$21,\"!  \",IF(K5=\"x\",\"I've attached your Registration Checklist, for your records.\",\"\"),IF(K11<>\"\",CONCATENATE(\"\n\n\",K11),\"\"),IF(K6=\"x\",CONCATENATE(Messages!$C$7&K10&\", before making changes.\"),\"\"),IF(K9=\"x\",Messages!$C$10,\"\"),IF(K7=\"x\",Messages!$C$8,\"\"),IF(K8<>\"\",Messages!$C$9,\"\"),CONCATENATE(\"\n\nIf you have any questions or concerns, please contact \"&K10&\".  You'll also want to plan to come in for an advising appointment around mid-terms each semester, to talk about your classes for the upcoming term.  You can find Instructions and Schedule links at mtsu.edu/cbhsadv. \"),\"\n\nWe look forward to seeing you at MTSU this semester!\n\n\",$B$2,\"\n\",$B$3)","v":{"$error":"#N/A"}},null,null,"PrescribedCrsMath",{"$f":"INDEX('My Students'!$20:$28,MATCH($O$1,'My Students'!$B$20:$B$28,0),MATCH(N12,'My Students'!$20:$20,0))","v":0},{"$f":"IF(O12=\"college level\",\"n\",IF(O12=0,\"blank--check\",\"y\"))","v":"blank--check"}]
["Customs Advisor",{"$f":"INDEX($O:$O,MATCH(A13,$N:$N,0))","v":"Stacey"},null,"Factors in Choosing Classes",null,null,"\"Registered\" choices: \"a\" to get message re stu registering in lab, \"b\" to get message re helping stu register in office, or type list of classes to be inserted.",null,null,null,null,null,null,"PrescribedCrsWriting",{"$f":"INDEX('My Students'!$20:$28,MATCH($O$1,'My Students'!$B$20:$B$28,0),MATCH(N13,'My Students'!$20:$20,0))","v":0},{"$f":"IF(O13=\"college level\",\"n\",IF(O13=0,\"blank--check\",\"y\"))","v":"blank--check"}]
[null,null,null,"Honors",{"$f":"INDEX($O:$O,MATCH(\"HonorsElig\",$N:$N,0))","v":"Formula: N"},null,null,null,null,null,null,null,null,"PrescribedCrsReading",{"$f":"INDEX('My Students'!$20:$28,MATCH($O$1,'My Students'!$B$20:$B$28,0),MATCH(N14,'My Students'!$20:$20,0))","v":0},{"$f":"IF(O14=\"college level\",\"n\",IF(O14=0,\"blank--check\",\"y\"))","v":"blank--check"}]
["Emily's Notes",{"$f":"INDEX($O:$O,MATCH(\"Notes\",$N:$N,0))","v":""},null,"Prescribeds",{"$f":"IF(AND(P12=\"n\",P13=\"n\",P14=\"n\"),\"\",\nCONCATENATE(\"Ks: \"&IF(P12=\"y\",O12,\"\")&IF(P12=\"y\",\", \",\"\")&IF(P12=\"blank--check\",\"Math--check; \",\"\")&\nIF(P13=\"y\",\"ENGL\",\"\")&IF(P13=\"y\",\", \",\"\")&IF(P13=\"blank--check\",\"Engl--check; \",\"\")&\nIF(P14=\"y\",\"READ\",\"\")&IF(T14=\"y\",\", \",\"\")&IF(P14=\"blank--check\",\"Read--check; \",\"\")&\nIF(P15=\"y\",\"U1010\",\"\")))","v":"Ks: Math--check; Engl--check; Read--check; "},null,"This is what it will say:",null,null,"This is what it will say:",null,null,null,"PrescribedCrsStudySkills",{"$f":"INDEX('My Students'!$20:$28,MATCH($O$1,'My Students'!$B$20:$B$28,0),MATCH(N15,'My Students'!$20:$20,0))","v":0},{"$f":"IF((P12<>\"n\")+(P13=\"y\")+(P14=\"y\")>=2,\"y\",\"n\")","v":"n"}]
[null,null,null,null,null,null,{"$f":"H12","v":"Student came for advising during Customs."},null,null,{"$f":"K12","v":{"$error":"#N/A"}},null,null,null,"HonorsElig",{"$f":"INDEX('My Students'!$20:$28,MATCH($O$1,'My Students'!$B$20:$B$28,0),MATCH(N16,'My Students'!$20:$20,0))","v":"Formula: N"}]
[null,null,null,"Scholars Acad",{"$f":"INDEX($O:$O,MATCH(\"Sacad\",$N:$N,0))","v":""},null,null,null,null,null,null,null,null,"ACTEngl",{"$f":"INDEX('My Students'!$20:$28,MATCH($O$1,'My Students'!$B$20:$B$28,0),MATCH(N17,'My Students'!$20:$20,0))","v":""}]
[null,null,null,"Pre-Nursing",{"$f":"INDEX($O:$O,MATCH(\"PREN\",$N:$N,0))","v":""},null,null,null,null,null,null,null,null,"HighSchoolGPA",{"$f":"INDEX('My Students'!$20:$28,MATCH($O$1,'My Students'!$B$20:$B$28,0),MATCH(N18,'My Students'!$20:$20,0))","v":3.29}]
["Copy-Pastes & Folder Links",null,null,"ACTEngl",{"$f":"INDEX($O:$O,MATCH(\"ACTEngl\",$N:$N,0))","v":""},null,null,null,null,null,null,null,null,"ACTCompositeScore",{"$f":"INDEX('My Students'!$20:$28,MATCH($O$1,'My Students'!$B$20:$B$28,0),MATCH(N19,'My Students'!$20:$20,0))","v":22}]
[{"$f":"INDEX(O:O,MATCH(\"StudentName\",N:N,0))","v":"Jones, Briana"},{"$f":"O1","v":"M00000004"},null,null,null,null,null,null,null,null,null,null,null,"InclusiveGPA",{"$f":"INDEX('My Students'!$20:$28,MATCH($O$1,'My Students'!$B$20:$B$28,0),MATCH(N20,'My Students'!$20:$20,0))","v":""}]
[{"$f":"IFERROR(MID(A20,SEARCH(\" \",A20,1)+1,SEARCH(\" \",A20,SEARCH(\" \",A20,1)+1)-SEARCH(\" \",A20,1)-1),MID(A20,FIND(\" \",A20)+1,256))","v":"Briana"},{"$f":"CONCATENATE(LEFT(A20,FIND(\", \",A20,1)-1))","v":"Jones"},null,"Flags",null,null,null,null,null,null,null,null,null,"HrsEarned",{"$f":"INDEX('My Students'!$20:$28,MATCH($O$1,'My Students'!$B$20:$B$28,0),MATCH(N21,'My Students'!$20:$20,0))","v":""}]
["Major name",{"$f":"IF(E11=\"\",INDEX('Data Lists'!B:B,MATCH(E7,'Data Lists'!A:A,0)),INDEX('Data Lists'!B:B,MATCH(E11,'Data Lists'!B:B,0)))","v":"Psychology"},null,"Holds",{"$f":"INDEX($O:$O,MATCH(D22,$N:$N,0))","v":"None"},null,null,null,null,null,null,null,null,"CountrySlot",{"$f":"INDEX('My Students'!$20:$28,MATCH($O$1,'My Students'!$B$20:$B$28,0),MATCH(N22,'My Students'!$20:$20,0))","v":"VE - Venezuela (s759)"}]
["Folder name",{"$f":"IF(E11=\"\",CONCATENATE(INDEX('Data Lists'!E:E,MATCH(E7,'Data Lists'!A:A,0)),\" \",B21,\", \",A21,\" \",B3),CONCATENATE(INDEX('Data Lists'!E:E,MATCH(E11,'Data Lists'!B:B,0)),\" \",B21,\", \",A21,\" \",B3))","v":"PSY Jones, Briana M00000004"},null,"Reg Restrictions",{"$f":"INDEX($O:$O,MATCH(\"RegistrationRestrictions\",$N:$N,0))","v":0},null,null,null,null,null,null,null,null,"CUSTOMSGrp",{"$f":"INDEX('My Students'!$20:$28,MATCH($O$1,'My Students'!$B$20:$B$28,0),MATCH(N23,'My Students'!$20:$20,0))","v":"PSY"}]
["Dept folders",{"$f":"HYPERLINK(CONCATENATE(\"Z:\\CoBHS Advising\\Departments\\\",IF(E12=\"\",INDEX('Data Lists'!D:D,MATCH(E8,'Data Lists'!A:A,0)),INDEX('Data Lists'!D:D,MATCH(E12,'Data Lists'!B:B,0))),\"\\Student Forms\\\"))","v":{"$error":"#N/A"}},null,"Immunizations",{"$f":"INDEX($O:$O,MATCH(\"RegistrationRestrictions\",$N:$N,0))","v":0},null,null,null,null,null,null,null,null,"CustomsPOS",{"$f":"INDEX('My Students'!$20:$28,MATCH($O$1,'My Students'!$B$20:$B$28,0),MATCH(N24,'My Students'!$20:$20,0))","v":"BS_PSY"}]
["Stu folder",{"$f":"HYPERLINK(CONCATENATE(\"Z:\\CoBHS Advising\\Departments\\\",IF(E12=\"\",INDEX('Data Lists'!D:D,MATCH(E8,'Data Lists'!A:A,0)),INDEX('Data Lists'!D:D,MATCH(E12,'Data Lists'!B:B,0))),\"\\Student Forms\\\",B23))","v":{"$error":"#N/A"}},{"$f":"YEARFRAC(O33,NOW())","v":18.891666666666666},"Under 18 & Imm",{"$f":"IF(C25>=18,\"OK--over 18\",\"If need imms, will need parent sig\")","v":"OK--over 18"},null,null,null,null,null,null,null,null,"BannerPOS",{"$f":"INDEX('My Students'!$20:$28,MATCH($O$1,'My Students'!$B$20:$B$28,0),MATCH(N25,'My Students'!$20:$20,0))","v":"BS_PSY"}]
[null,null,null,"Missing Items",{"$f":"INDEX($O:$O,MATCH(\"MissingChecklistItems\",$N:$N,0))","v":"Final HS Tran upon Graduation"},null,null,null,null,null,null,null,null,"Assigned Advisor",{"$f":"INDEX('My Students'!$20:$28,MATCH($O$1,'My Students'!$B$20:$B$28,0),MATCH(N26,'My Students'!$20:$20,0))","v":"Bonnie"}]
[null,null,null,"Term",{"$f":"INDEX($O:$O,MATCH(\"TermDesc\",$N:$N,0))","v":"Fall 2019"},null,null,null,null,null,null,null,null,"Customs Advisor",{"$f":"INDEX('My Students'!$20:$28,MATCH($O$1,'My Students'!$B$20:$B$28,0),MATCH(N27,'My Students'!$20:$20,0))","v":"Stacey"}]
[null,null,null,"Might need BUAF",{"$f":"INDEX($O:$O,MATCH(\"VetOrDep\",$N:$N,0))","v":""},null,null,null,null,null,null,null,null,"Holds",{"$f":"INDEX('My Students'!$20:$28,MATCH($O$1,'My Students'!$B$20:$B$28,0),MATCH(N28,'My Students'!$20:$20,0))","v":"None"}]
[null,null,null,"Reverse Transfer",{"$f":"INDEX($O:$O,MATCH(\"ReverseTransfer\",$N:$N,0))","v":""},null,null,null,null,null,null,null,null,"RegistrationRestrictions",{"$f":"INDEX('My Students'!$20:$28,MATCH($O$1,'My Students'!$B$20:$B$28,0),MATCH(N29,'My Students'!$20:$20,0))","v":0}]
[null,null,null,"First Generation",{"$f":"INDEX($O:$O,MATCH(\"1stGen\",$N:$N,0))","v":"N"},null,null,null,null,null,null,null,null,"MissingChecklistItems",{"$f":"INDEX('My Students'!$20:$28,MATCH($O$1,'My Students'!$B$20:$B$28,0),MATCH(N30,'My Students'!$20:$20,0))","v":"Final HS Tran upon Graduation"}]
[null,null,null,null,null,null,null,null,null,null,null,null,null,"AdmissionDecision",{"$f":"INDEX('My Students'!$20:$28,MATCH($O$1,'My Students'!$B$20:$B$28,0),MATCH(N31,'My Students'!$20:$20,0))","v":"LC-Freshman Tentative Admission"}]
["Want to add a link to the student's folder? ",null,null,null,null,null,null,null,null,null,null,null,null,"TermDesc",{"$f":"INDEX('My Students'!$20:$28,MATCH($O$1,'My Students'!$B$20:$B$28,0),MATCH(N32,'My Students'!$20:$20,0))","v":"Fall 2019"}]
["--Click on the \"Stu folder\" field above (B21).",null,null,null,null,null,null,null,null,null,null,null,null,"DateofBirth",{"$f":"INDEX('My Students'!$20:$28,MATCH($O$1,'My Students'!$B$20:$B$28,0),MATCH(N33,'My Students'!$20:$20,0))","v":"2001-03-09"}]
["--Control-K to start the process of creating a link.",null,null,null,null,null,null,null,null,null,null,null,null,"Notes",{"$f":"INDEX('My Students'!$20:$28,MATCH($O$1,'My Students'!$B$20:$B$28,0),MATCH(N34,'My Students'!$20:$20,0))","v":""}]
["--Browse to the student's folder.",null,null,null,null,null,null,null,null,null,null,null,null,"MTSUEmail",{"$f":"INDEX('My Students'!$20:$28,MATCH($O$1,'My Students'!$B$20:$B$28,0),MATCH(N35,'My Students'!$20:$20,0))","v":"5@mtmail.mtsu.edu"}]
["--Choose any file in the folder and double-click on it.",null,null,null,null,null,null,null,null,null,null,null,null,"PersonalEmail",{"$f":"INDEX('My Students'!$20:$28,MATCH($O$1,'My Students'!$B$20:$B$28,0),MATCH(N36,'My Students'!$20:$20,0))","v":"5@gmail.com"}]
["--In the Address box, delete the file name (back to the \\ after the folder name).",null,null,null,null,null,null,null,null,null,null,null,null,"PermPhone",{"$f":"INDEX('My Students'!$20:$28,MATCH($O$1,'My Students'!$B$20:$B$28,0),MATCH(N37,'My Students'!$20:$20,0))","v":"(615) 319-0000"}]
["--Click OK.",null,null,null,null,null,null,null,null,null,null,null,null,"MailingPhone",{"$f":"INDEX('My Students'!$20:$28,MATCH($O$1,'My Students'!$B$20:$B$28,0),MATCH(N38,'My Students'!$20:$20,0))","v":"(615) 594-0000"}]
["--Now you should see the path to the folder, underlined as a link.",null,null,null,null,null,null,null,null,null,null,null,null,"NursElig",{"$f":"INDEX('My Students'!$20:$28,MATCH($O$1,'My Students'!$B$20:$B$28,0),MATCH(N39,'My Students'!$20:$20,0))","v":""}]
["--When you click on your link, the folder should open in a separate window.",null,null,null,null,null,null,null,null,null,null,null,null,"ACTMathScre",{"$f":"INDEX('My Students'!$20:$28,MATCH($O$1,'My Students'!$B$20:$B$28,0),MATCH(N40,'My Students'!$20:$20,0))","v":21}]
[null,null,null,null,null,null,null,null,null,null,null,null,null,"ACTScienceScre",{"$f":"INDEX('My Students'!$20:$28,MATCH($O$1,'My Students'!$B$20:$B$28,0),MATCH(N41,'My Students'!$20:$20,0))","v":19}]
[null,null,null,null,null,null,null,null,null,null,null,null,null,"A&P?",{"$f":"IF(O1<>\"\",IF(OR(AND(O40=21,O41>21),AND(O40>21,O41=21)),\"maybe\",IF(AND(O31>=21,O41>=21),\"Y\",\"N\")),\"\")","v":"N"}]
[null,null,null,null,null,null,null,null,null,null,null,null,null,"Major",{"$f":"INDEX('Data Lists'!B:B,MATCH(O24,'Data Lists'!A:A,0))","v":"Psychology"}]
[null,null,null,null,null,null,null,null,null,null,null,null,null,"NameM#",{"$f":"CONCATENATE(O47,\", \",O46,\" \",O45)","v":"Jones, Briana M00000004"}]
[null,null,null,null,null,null,null,null,null,null,null,null,null,"M# copy",{"$f":"O1","v":"M00000004"}]
[null,null,null,null,null,null,null,null,null,null,null,null,null,"Fname",{"$f":"IF(1<>\"\",IFERROR(MID(O9,SEARCH(\" \",O9,1)+1,SEARCH(\" \",O9,SEARCH(\" \",O9,1)+1)-SEARCH(\" \",O9,1)-1),MID(O9,FIND(\" \",O9)+1,256)),\"\")","v":"Briana"}]
[null,null,null,null,null,null,null,null,null,null,null,null,null,"Lname",{"$f":"IF(O1<>\"\",CONCATENATE(LEFT(O9,FIND(\", \",O9,1)-1)),\"\")","v":"Jones"}]

{"sheet":"D","index":26,"n_rows":47,"n_cols":16,"rows_kept":47,"cut":false,"hidden":false,"merged":[[15,6,39,7],[15,9,39,10],[14,3,15,3],[14,4,15,4],[14,0,15,0],[14,1,15,1]]}
["Contact & Demographic Info",null,null,"Academic Info",null,null,"Start",null,null,"Change major",null,null,null,"M#",{"$f":"'My Students'!B24","v":0}]
["Name",{"$f":"CONCATENATE(A21,\" \",B21)","v":{"$error":"#N/A"}},null,"Transferred hours",{"$f":"INDEX($O:$O,MATCH(\"HrsEarned\",$N:$N,0))","v":{"$error":"#N/A"}},null,"Stop",null,null,"Notes for advisor",null,null,null,"Deleted",{"$f":"INDEX('My Students'!$20:$28,MATCH($O$1,'My Students'!$B$20:$B$28,0),MATCH(N2,'My Students'!$20:$20,0))","v":{"$error":"#N/A"}}]
["M#",{"$f":"O1","v":0},null,"HS GPA",{"$f":"INDEX($O:$O,MATCH(\"HighSchoolGPA\",$N:$N,0))","v":{"$error":"#N/A"}},null,null,null,null,null,null,null,null,"SAcad",{"$f":"INDEX('My Students'!$20:$28,MATCH($O$1,'My Students'!$B$20:$B$28,0),MATCH(N3,'My Students'!$20:$20,0))","v":{"$error":"#N/A"}}]
["MTSUEmail",{"$f":"INDEX($O:$O,MATCH(A4,$N:$N,0))","v":{"$error":"#N/A"}},null,"Inclusive GPA",{"$f":"INDEX($O:$O,MATCH(\"InclusiveGPA\",$N:$N,0))","v":{"$error":"#N/A"}},null,null,"Report Builder",null,null,"Student Message Builder",null,null,"VetOrDep",{"$f":"INDEX('My Students'!$20:$28,MATCH($O$1,'My Students'!$B$20:$B$28,0),MATCH(N4,'My Students'!$20:$20,0))","v":{"$error":"#N/A"}}]
["PersonalEmail",{"$f":"INDEX($O:$O,MATCH(A5,$N:$N,0))","v":{"$error":"#N/A"}},null,"ACT Math",{"$f":"INDEX($O:$O,MATCH(\"ACTMathScre\",$N:$N,0))","v":{"$error":"#N/A"}},null,"Registered",null,"see below","Docs attached",null,"x (to say that you've attached docs for the student)",null,"PREN",{"$f":"INDEX('My Students'!$20:$28,MATCH($O$1,'My Students'!$B$20:$B$28,0),MATCH(N5,'My Students'!$20:$20,0))","v":{"$error":"#N/A"}}]
["PermPhone",{"$f":"INDEX($O:$O,MATCH(A6,$N:$N,0))","v":{"$error":"#N/A"}},null,"ACT Science",{"$f":"INDEX($O:$O,MATCH(\"ACTScienceScre\",$N:$N,0))","v":{"$error":"#N/A"}},null,"Attaching Scan",null,"x","Drop/Add info",null,"x (to give info on switching classes & steps to do so)",null,"1stGen",{"$f":"INDEX('My Students'!$20:$28,MATCH($O$1,'My Students'!$B$20:$B$28,0),MATCH(N6,'My Students'!$20:$20,0))","v":{"$error":"#N/A"}}]
["MailingPhone",{"$f":"INDEX($O:$O,MATCH(A7,$N:$N,0))","v":{"$error":"#N/A"}},null,"CustomsPOS",{"$f":"INDEX($O:$O,MATCH(D7,$N:$N,0))","v":{"$error":"#N/A"}},null,"Submitted COM",null,"x","Acad success tips",null,"x (to give acad tips, tutoring & SI websites, & \"ask for help\")",null,"ReverseTransfer",{"$f":"INDEX('My Students'!$20:$28,MATCH($O$1,'My Students'!$B$20:$B$28,0),MATCH(N7,'My Students'!$20:$20,0))","v":{"$error":"#N/A"}}]
[null,null,null,null,{"$f":"INDEX($O:$O,MATCH(\"Major\",$N:$N,0))","v":{"$error":"#N/A"}},null,"Supp Instructn",null,"x","NURS Info Session",null,"x (to refer student to nursing info webpage and session)",null,"FR/TR",{"$f":"INDEX('My Students'!$20:$28,MATCH($O$1,'My Students'!$B$20:$B$28,0),MATCH(N8,'My Students'!$20:$20,0))","v":{"$error":"#N/A"}}]
["Customs Info",null,null,"BannerPOS",{"$f":"INDEX($O:$O,MATCH(D9,$N:$N,0))","v":{"$error":"#N/A"}},null,"RTTP",null,"x","Check phone #",null,"x (to tell stu their listed ph #s are wrong, & how to fix)",null,"StudentName",{"$f":"INDEX('My Students'!$20:$28,MATCH($O$1,'My Students'!$B$20:$B$28,0),MATCH(N9,'My Students'!$20:$20,0))","v":{"$error":"#N/A"}}]
["CountrySlot",{"$f":"INDEX($O:$O,MATCH(A10,$N:$N,0))","v":{"$error":"#N/A"}},null,"Majors match?",{"$f":"IF(E7=E9,\"Y\",\"N, Submit change of major\")","v":{"$error":"#N/A"}},null,"Note 1",null,"x","Advisor info",{"$f":"INDEX('Data Lists'!$J:$J,MATCH($B$12,'Data Lists'!$H:$H,0))","v":{"$error":"#N/A"}},"(leave formula, or type \"me <email>\")",null,"Major",{"$f":"INDEX('My Students'!$20:$28,MATCH($O$1,'My Students'!$B$20:$B$28,0),MATCH(N10,'My Students'!$20:$20,0))","v":{"$error":"#N/A"}}]
["Order/Time",{"$f":"INDEX($O:$O,MATCH(A11,$N:$N,0))","v":{"$error":"#N/A"}},null,"Override major",null,null,"Other",null,"[notes]","Other",null,"[type any notes to student]",null,"Order/Time",{"$f":"INDEX('My Students'!$20:$28,MATCH($O$1,'My Students'!$B$20:$B$28,0),MATCH(N11,'My Students'!$20:$20,0))","v":{"$error":"#N/A"}}]
["Acad Advisor",{"$f":"INDEX($O:$O,MATCH(\"Assigned Advisor\",$N:$N,0))","v":{"$error":"#N/A"}},null,null,null,null,"Paste in advising report:",{"$f":"CONCATENATE(\"Student came for advising during Customs.\",IF(H6<>\"\",\"  Attaching scanned copy of notes.\",\"\"),IF(H5=\"a\",Messages!$C$2,IF(H5=\"b\",Messages!$C$3,IF(H5<>\"\",CONCATENATE(\"  Registered student for classes for upcoming semester: \",H5),\"\"))),IF(H11<>\"\",CONCATENATE(\"\n\n\",H11),\"\"),IF(H7<>\"\",\"\n\nSubmitted change of major form. \",\"\"),IF(H8<>\"\",Messages!$C$4,\"\"),IF(H9<>\"\",Messages!$C$5,\"\"),IF(H10<>\"\",Messages!$C$6,\"\"))","v":"Student came for advising during Customs."},null,"Paste in stu msg:",{"$f":"CONCATENATE(\"We enjoyed seeing you at the CBHS Advising Center Customs session today, \",$A$21,\"!  \",IF(K5=\"x\",\"I've attached your Registration Checklist, for your records.\",\"\"),IF(K11<>\"\",CONCATENATE(\"\n\n\",K11),\"\"),IF(K6=\"x\",CONCATENATE(Messages!$C$7&K10&\", before making changes.\"),\"\"),IF(K9=\"x\",Messages!$C$10,\"\"),IF(K7=\"x\",Messages!$C$8,\"\"),IF(K8<>\"\",Messages!$C$9,\"\"),CONCATENATE(\"\n\nIf you have any questions or concerns, please contact \"&K10&\".  You'll also want to plan to come in for an advising appointment around mid-terms each semester, to talk about your classes for the upcoming term.  You can find Instructions and Schedule links at mtsu.edu/cbhsadv. \"),\"\n\nWe look forward to seeing you at MTSU this semester!\n\n\",$B$2,\"\n\",$B$3)","v":{"$error":"#N/A"}},null,null,"PrescribedCrsMath",{"$f":"INDEX('My Students'!$20:$28,MATCH($O$1,'My Students'!$B$20:$B$28,0),MATCH(N12,'My Students'!$20:$20,0))","v":{"$error":"#N/A"}},{"$f":"IF(O12=\"college level\",\"n\",IF(O12=0,\"blank--check\",\"y\"))","v":{"$error":"#N/A"}}]
["Customs Advisor",{"$f":"INDEX($O:$O,MATCH(A13,$N:$N,0))","v":{"$error":"#N/A"}},null,"Factors in Choosing Classes",null,null,"\"Registered\" choices: \"a\" to get message re stu registering in lab, \"b\" to get message re helping stu register in office, or type list of classes to be inserted.",null,null,null,null,null,null,"PrescribedCrsWriting",{"$f":"INDEX('My Students'!$20:$28,MATCH($O$1,'My Students'!$B$20:$B$28,0),MATCH(N13,'My Students'!$20:$20,0))","v":{"$error":"#N/A"}},{"$f":"IF(O13=\"college level\",\"n\",IF(O13=0,\"blank--check\",\"y\"))","v":{"$error":"#N/A"}}]
[null,null,null,"Honors",{"$f":"INDEX($O:$O,MATCH(\"HonorsElig\",$N:$N,0))","v":{"$error":"#N/A"}},null,null,null,null,null,null,null,null,"PrescribedCrsReading",{"$f":"INDEX('My Students'!$20:$28,MATCH($O$1,'My Students'!$B$20:$B$28,0),MATCH(N14,'My Students'!$20:$20,0))","v":{"$error":"#N/A"}},{"$f":"IF(O14=\"college level\",\"n\",IF(O14=0,\"blank--check\",\"y\"))","v":{"$error":"#N/A"}}]
["Emily's Notes",{"$f":"INDEX($O:$O,MATCH(\"Notes\",$N:$N,0))","v":{"$error":"#N/A"}},null,"Prescribeds",{"$f":"IF(AND(P12=\"n\",P13=\"n\",P14=\"n\"),\"\",\nCONCATENATE(\"Ks: \"&IF(P12=\"y\",O12,\"\")&IF(P12=\"y\",\", \",\"\")&IF(P12=\"blank--check\",\"Math--check; \",\"\")&\nIF(P13=\"y\",\"ENGL\",\"\")&IF(P13=\"y\",\", \",\"\")&IF(P13=\"blank--check\",\"Engl--check; \",\"\")&\nIF(P14=\"y\",\"READ\",\"\")&IF(T14=\"y\",\", \",\"\")&IF(P14=\"blank--check\",\"Read--check; \",\"\")&\nIF(P15=\"y\",\"U1010\",\"\")))","v":{"$error":"#N/A"}},null,"This is what it will say:",null,null,"This is what it will say:",null,null,null,"PrescribedCrsStudySkills",{"$f":"INDEX('My Students'!$20:$28,MATCH($O$1,'My Students'!$B$20:$B$28,0),MATCH(N15,'My Students'!$20:$20,0))","v":{"$error":"#N/A"}},{"$f":"IF((P12<>\"n\")+(P13=\"y\")+(P14=\"y\")>=2,\"y\",\"n\")","v":{"$error":"#N/A"}}]
[null,null,null,null,null,null,{"$f":"H12","v":"Student came for advising during Customs."},null,null,{"$f":"K12","v":{"$error":"#N/A"}},null,null,null,"HonorsElig",{"$f":"INDEX('My Students'!$20:$28,MATCH($O$1,'My Students'!$B$20:$B$28,0),MATCH(N16,'My Students'!$20:$20,0))","v":{"$error":"#N/A"}}]
[null,null,null,"Scholars Acad",{"$f":"INDEX($O:$O,MATCH(\"Sacad\",$N:$N,0))","v":{"$error":"#N/A"}},null,null,null,null,null,null,null,null,"ACTEngl",{"$f":"INDEX('My Students'!$20:$28,MATCH($O$1,'My Students'!$B$20:$B$28,0),MATCH(N17,'My Students'!$20:$20,0))","v":{"$error":"#N/A"}}]
[null,null,null,"Pre-Nursing",{"$f":"INDEX($O:$O,MATCH(\"PREN\",$N:$N,0))","v":{"$error":"#N/A"}},null,null,null,null,null,null,null,null,"HighSchoolGPA",{"$f":"INDEX('My Students'!$20:$28,MATCH($O$1,'My Students'!$B$20:$B$28,0),MATCH(N18,'My Students'!$20:$20,0))","v":{"$error":"#N/A"}}]
["Copy-Pastes & Folder Links",null,null,"ACTEngl",{"$f":"INDEX($O:$O,MATCH(\"ACTEngl\",$N:$N,0))","v":{"$error":"#N/A"}},null,null,null,null,null,null,null,null,"ACTCompositeScore",{"$f":"INDEX('My Students'!$20:$28,MATCH($O$1,'My Students'!$B$20:$B$28,0),MATCH(N19,'My Students'!$20:$20,0))","v":{"$error":"#N/A"}}]
[{"$f":"INDEX(O:O,MATCH(\"StudentName\",N:N,0))","v":{"$error":"#N/A"}},{"$f":"O1","v":0},null,null,null,null,null,null,null,null,null,null,null,"InclusiveGPA",{"$f":"INDEX('My Students'!$20:$28,MATCH($O$1,'My Students'!$B$20:$B$28,0),MATCH(N20,'My Students'!$20:$20,0))","v":{"$error":"#N/A"}}]
[{"$f":"IFERROR(MID(A20,SEARCH(\" \",A20,1)+1,SEARCH(\" \",A20,SEARCH(\" \",A20,1)+1)-SEARCH(\" \",A20,1)-1),MID(A20,FIND(\" \",A20)+1,256))","v":{"$error":"#N/A"}},{"$f":"CONCATENATE(LEFT(A20,FIND(\", \",A20,1)-1))","v":{"$error":"#N/A"}},null,"Flags",null,null,null,null,null,null,null,null,null,"HrsEarned",{"$f":"INDEX('My Students'!$20:$28,MATCH($O$1,'My Students'!$B$20:$B$28,0),MATCH(N21,'My Students'!$20:$20,0))","v":{"$error":"#N/A"}}]
["Major name",{"$f":"IF(E11=\"\",INDEX('Data Lists'!B:B,MATCH(E7,'Data Lists'!A:A,0)),INDEX('Data Lists'!B:B,MATCH(E11,'Data Lists'!B:B,0)))","v":{"$error":"#N/A"}},null,"Holds",{"$f":"INDEX($O:$O,MATCH(D22,$N:$N,0))","v":{"$error":"#N/A"}},null,null,null,null,null,null,null,null,"CountrySlot",{"$f":"INDEX('My Students'!$20:$28,MATCH($O$1,'My Students'!$B$20:$B$28,0),MATCH(N22,'My Students'!$20:$20,0))","v":{"$error":"#N/A"}}]
["Folder name",{"$f":"IF(E11=\"\",CONCATENATE(INDEX('Data Lists'!E:E,MATCH(E7,'Data Lists'!A:A,0)),\" \",B21,\", \",A21,\" \",B3),CONCATENATE(INDEX('Data Lists'!E:E,MATCH(E11,'Data Lists'!B:B,0)),\" \",B21,\", \",A21,\" \",B3))","v":{"$error":"#N/A"}},null,"Reg Restrictions",{"$f":"INDEX($O:$O,MATCH(\"RegistrationRestrictions\",$N:$N,0))","v":{"$error":"#N/A"}},null,null,null,null,null,null,null,null,"CUSTOMSGrp",{"$f":"INDEX('My Students'!$20:$28,MATCH($O$1,'My Students'!$B$20:$B$28,0),MATCH(N23,'My Students'!$20:$20,0))","v":{"$error":"#N/A"}}]
["Dept folders",{"$f":"HYPERLINK(CONCATENATE(\"Z:\\CoBHS Advising\\Departments\\\",IF(E12=\"\",INDEX('Data Lists'!D:D,MATCH(E8,'Data Lists'!A:A,0)),INDEX('Data Lists'!D:D,MATCH(E12,'Data Lists'!B:B,0))),\"\\Student Forms\\\"))","v":{"$error":"#N/A"}},null,"Immunizations",{"$f":"INDEX($O:$O,MATCH(\"RegistrationRestrictions\",$N:$N,0))","v":{"$error":"#N/A"}},null,null,null,null,null,null,null,null,"CustomsPOS",{"$f":"INDEX('My Students'!$20:$28,MATCH($O$1,'My Students'!$B$20:$B$28,0),MATCH(N24,'My Students'!$20:$20,0))","v":{"$error":"#N/A"}}]
["Stu folder",{"$f":"HYPERLINK(CONCATENATE(\"Z:\\CoBHS Advising\\Departments\\\",IF(E12=\"\",INDEX('Data Lists'!D:D,MATCH(E8,'Data Lists'!A:A,0)),INDEX('Data Lists'!D:D,MATCH(E12,'Data Lists'!B:B,0))),\"\\Student Forms\\\",B23))","v":{"$error":"#N/A"}},{"$f":"YEARFRAC(O33,NOW())","v":{"$error":"#N/A"}},"Under 18 & Imm",{"$f":"IF(C25>=18,\"OK--over 18\",\"If need imms, will need parent sig\")","v":{"$error":"#N/A"}},null,null,null,null,null,null,null,null,"BannerPOS",{"$f":"INDEX('My Students'!$20:$28,MATCH($O$1,'My Students'!$B$20:$B$28,0),MATCH(N25,'My Students'!$20:$20,0))","v":{"$error":"#N/A"}}]
[null,null,null,"Missing Items",{"$f":"INDEX($O:$O,MATCH(\"MissingChecklistItems\",$N:$N,0))","v":{"$error":"#N/A"}},null,null,null,null,null,null,null,null,"Assigned Advisor",{"$f":"INDEX('My Students'!$20:$28,MATCH($O$1,'My Students'!$B$20:$B$28,0),MATCH(N26,'My Students'!$20:$20,0))","v":{"$error":"#N/A"}}]
[null,null,null,"Term",{"$f":"INDEX($O:$O,MATCH(\"TermDesc\",$N:$N,0))","v":{"$error":"#N/A"}},null,null,null,null,null,null,null,null,"Customs Advisor",{"$f":"INDEX('My Students'!$20:$28,MATCH($O$1,'My Students'!$B$20:$B$28,0),MATCH(N27,'My Students'!$20:$20,0))","v":{"$error":"#N/A"}}]
[null,null,null,"Might need BUAF",{"$f":"INDEX($O:$O,MATCH(\"VetOrDep\",$N:$N,0))","v":{"$error":"#N/A"}},null,null,null,null,null,null,null,null,"Holds",{"$f":"INDEX('My Students'!$20:$28,MATCH($O$1,'My Students'!$B$20:$B$28,0),MATCH(N28,'My Students'!$20:$20,0))","v":{"$error":"#N/A"}}]
[null,null,null,"Reverse Transfer",{"$f":"INDEX($O:$O,MATCH(\"ReverseTransfer\",$N:$N,0))","v":{"$error":"#N/A"}},null,null,null,null,null,null,null,null,"RegistrationRestrictions",{"$f":"INDEX('My Students'!$20:$28,MATCH($O$1,'My Students'!$B$20:$B$28,0),MATCH(N29,'My Students'!$20:$20,0))","v":{"$error":"#N/A"}}]
[null,null,null,"First Generation",{"$f":"INDEX($O:$O,MATCH(\"1stGen\",$N:$N,0))","v":{"$error":"#N/A"}},null,null,null,null,null,null,null,null,"MissingChecklistItems",{"$f":"INDEX('My Students'!$20:$28,MATCH($O$1,'My Students'!$B$20:$B$28,0),MATCH(N30,'My Students'!$20:$20,0))","v":{"$error":"#N/A"}}]
[null,null,null,null,null,null,null,null,null,null,null,null,null,"AdmissionDecision",{"$f":"INDEX('My Students'!$20:$28,MATCH($O$1,'My Students'!$B$20:$B$28,0),MATCH(N31,'My Students'!$20:$20,0))","v":{"$error":"#N/A"}}]
["Want to add a link to the student's folder? ",null,null,null,null,null,null,null,null,null,null,null,null,"TermDesc",{"$f":"INDEX('My Students'!$20:$28,MATCH($O$1,'My Students'!$B$20:$B$28,0),MATCH(N32,'My Students'!$20:$20,0))","v":{"$error":"#N/A"}}]
["--Click on the \"Stu folder\" field above (B21).",null,null,null,null,null,null,null,null,null,null,null,null,"DateofBirth",{"$f":"INDEX('My Students'!$20:$28,MATCH($O$1,'My Students'!$B$20:$B$28,0),MATCH(N33,'My Students'!$20:$20,0))","v":{"$error":"#N/A"}}]
["--Control-K to start the process of creating a link.",null,null,null,null,null,null,null,null,null,null,null,null,"Notes",{"$f":"INDEX('My Students'!$20:$28,MATCH($O$1,'My Students'!$B$20:$B$28,0),MATCH(N34,'My Students'!$20:$20,0))","v":{"$error":"#N/A"}}]
["--Browse to the student's folder.",null,null,null,null,null,null,null,null,null,null,null,null,"MTSUEmail",{"$f":"INDEX('My Students'!$20:$28,MATCH($O$1,'My Students'!$B$20:$B$28,0),MATCH(N35,'My Students'!$20:$20,0))","v":{"$error":"#N/A"}}]
["--Choose any file in the folder and double-click on it.",null,null,null,null,null,null,null,null,null,null,null,null,"PersonalEmail",{"$f":"INDEX('My Students'!$20:$28,MATCH($O$1,'My Students'!$B$20:$B$28,0),MATCH(N36,'My Students'!$20:$20,0))","v":{"$error":"#N/A"}}]
["--In the Address box, delete the file name (back to the \\ after the folder name).",null,null,null,null,null,null,null,null,null,null,null,null,"PermPhone",{"$f":"INDEX('My Students'!$20:$28,MATCH($O$1,'My Students'!$B$20:$B$28,0),MATCH(N37,'My Students'!$20:$20,0))","v":{"$error":"#N/A"}}]
["--Click OK.",null,null,null,null,null,null,null,null,null,null,null,null,"MailingPhone",{"$f":"INDEX('My Students'!$20:$28,MATCH($O$1,'My Students'!$B$20:$B$28,0),MATCH(N38,'My Students'!$20:$20,0))","v":{"$error":"#N/A"}}]
["--Now you should see the path to the folder, underlined as a link.",null,null,null,null,null,null,null,null,null,null,null,null,"NursElig",{"$f":"INDEX('My Students'!$20:$28,MATCH($O$1,'My Students'!$B$20:$B$28,0),MATCH(N39,'My Students'!$20:$20,0))","v":{"$error":"#N/A"}}]
["--When you click on your link, the folder should open in a separate window.",null,null,null,null,null,null,null,null,null,null,null,null,"ACTMathScre",{"$f":"INDEX('My Students'!$20:$28,MATCH($O$1,'My Students'!$B$20:$B$28,0),MATCH(N40,'My Students'!$20:$20,0))","v":{"$error":"#N/A"}}]
[null,null,null,null,null,null,null,null,null,null,null,null,null,"ACTScienceScre",{"$f":"INDEX('My Students'!$20:$28,MATCH($O$1,'My Students'!$B$20:$B$28,0),MATCH(N41,'My Students'!$20:$20,0))","v":{"$error":"#N/A"}}]
[null,null,null,null,null,null,null,null,null,null,null,null,null,"A&P?",{"$f":"IF(O1<>\"\",IF(OR(AND(O40=21,O41>21),AND(O40>21,O41=21)),\"maybe\",IF(AND(O31>=21,O41>=21),\"Y\",\"N\")),\"\")","v":{"$error":"#N/A"}}]
[null,null,null,null,null,null,null,null,null,null,null,null,null,"Major",{"$f":"INDEX('Data Lists'!B:B,MATCH(O24,'Data Lists'!A:A,0))","v":{"$error":"#N/A"}}]
[null,null,null,null,null,null,null,null,null,null,null,null,null,"NameM#",{"$f":"CONCATENATE(O47,\", \",O46,\" \",O45)","v":{"$error":"#N/A"}}]
[null,null,null,null,null,null,null,null,null,null,null,null,null,"M# copy",{"$f":"O1","v":0}]
[null,null,null,null,null,null,null,null,null,null,null,null,null,"Fname",{"$f":"IF(1<>\"\",IFERROR(MID(O9,SEARCH(\" \",O9,1)+1,SEARCH(\" \",O9,SEARCH(\" \",O9,1)+1)-SEARCH(\" \",O9,1)-1),MID(O9,FIND(\" \",O9)+1,256)),\"\")","v":{"$error":"#N/A"}}]
[null,null,null,null,null,null,null,null,null,null,null,null,null,"Lname",{"$f":"IF(O1<>\"\",CONCATENATE(LEFT(O9,FIND(\", \",O9,1)-1)),\"\")","v":{"$error":"#N/A"}}]

{"sheet":"E","index":27,"n_rows":47,"n_cols":16,"rows_kept":47,"cut":false,"hidden":false,"merged":[[15,6,39,7],[15,9,39,10],[14,3,15,3],[14,4,15,4],[14,0,15,0],[14,1,15,1]]}
["Contact & Demographic Info",null,null,"Academic Info",null,null,"Start",null,null,"Change major",null,null,null,"M#",{"$f":"'My Students'!B25","v":0}]
["Name",{"$f":"CONCATENATE(A21,\" \",B21)","v":{"$error":"#N/A"}},null,"Transferred hours",{"$f":"INDEX($O:$O,MATCH(\"HrsEarned\",$N:$N,0))","v":{"$error":"#N/A"}},null,"Stop",null,null,"Notes for advisor",null,null,null,"Deleted",{"$f":"INDEX('My Students'!$20:$28,MATCH($O$1,'My Students'!$B$20:$B$28,0),MATCH(N2,'My Students'!$20:$20,0))","v":{"$error":"#N/A"}}]
["M#",{"$f":"O1","v":0},null,"HS GPA",{"$f":"INDEX($O:$O,MATCH(\"HighSchoolGPA\",$N:$N,0))","v":{"$error":"#N/A"}},null,null,null,null,null,null,null,null,"SAcad",{"$f":"INDEX('My Students'!$20:$28,MATCH($O$1,'My Students'!$B$20:$B$28,0),MATCH(N3,'My Students'!$20:$20,0))","v":{"$error":"#N/A"}}]
["MTSUEmail",{"$f":"INDEX($O:$O,MATCH(A4,$N:$N,0))","v":{"$error":"#N/A"}},null,"Inclusive GPA",{"$f":"INDEX($O:$O,MATCH(\"InclusiveGPA\",$N:$N,0))","v":{"$error":"#N/A"}},null,null,"Report Builder",null,null,"Student Message Builder",null,null,"VetOrDep",{"$f":"INDEX('My Students'!$20:$28,MATCH($O$1,'My Students'!$B$20:$B$28,0),MATCH(N4,'My Students'!$20:$20,0))","v":{"$error":"#N/A"}}]
["PersonalEmail",{"$f":"INDEX($O:$O,MATCH(A5,$N:$N,0))","v":{"$error":"#N/A"}},null,"ACT Math",{"$f":"INDEX($O:$O,MATCH(\"ACTMathScre\",$N:$N,0))","v":{"$error":"#N/A"}},null,"Registered",null,"see below","Docs attached",null,"x (to say that you've attached docs for the student)",null,"PREN",{"$f":"INDEX('My Students'!$20:$28,MATCH($O$1,'My Students'!$B$20:$B$28,0),MATCH(N5,'My Students'!$20:$20,0))","v":{"$error":"#N/A"}}]
["PermPhone",{"$f":"INDEX($O:$O,MATCH(A6,$N:$N,0))","v":{"$error":"#N/A"}},null,"ACT Science",{"$f":"INDEX($O:$O,MATCH(\"ACTScienceScre\",$N:$N,0))","v":{"$error":"#N/A"}},null,"Attaching Scan",null,"x","Drop/Add info",null,"x (to give info on switching classes & steps to do so)",null,"1stGen",{"$f":"INDEX('My Students'!$20:$28,MATCH($O$1,'My Students'!$B$20:$B$28,0),MATCH(N6,'My Students'!$20:$20,0))","v":{"$error":"#N/A"}}]
["MailingPhone",{"$f":"INDEX($O:$O,MATCH(A7,$N:$N,0))","v":{"$error":"#N/A"}},null,"CustomsPOS",{"$f":"INDEX($O:$O,MATCH(D7,$N:$N,0))","v":{"$error":"#N/A"}},null,"Submitted COM",null,"x","Acad success tips",null,"x (to give acad tips, tutoring & SI websites, & \"ask for help\")",null,"ReverseTransfer",{"$f":"INDEX('My Students'!$20:$28,MATCH($O$1,'My Students'!$B$20:$B$28,0),MATCH(N7,'My Students'!$20:$20,0))","v":{"$error":"#N/A"}}]
[null,null,null,null,{"$f":"INDEX($O:$O,MATCH(\"Major\",$N:$N,0))","v":{"$error":"#N/A"}},null,"Supp Instructn",null,"x","NURS Info Session",null,"x (to refer student to nursing info webpage and session)",null,"FR/TR",{"$f":"INDEX('My Students'!$20:$28,MATCH($O$1,'My Students'!$B$20:$B$28,0),MATCH(N8,'My Students'!$20:$20,0))","v":{"$error":"#N/A"}}]
["Customs Info",null,null,"BannerPOS",{"$f":"INDEX($O:$O,MATCH(D9,$N:$N,0))","v":{"$error":"#N/A"}},null,"RTTP",null,"x","Check phone #",null,"x (to tell stu their listed ph #s are wrong, & how to fix)",null,"StudentName",{"$f":"INDEX('My Students'!$20:$28,MATCH($O$1,'My Students'!$B$20:$B$28,0),MATCH(N9,'My Students'!$20:$20,0))","v":{"$error":"#N/A"}}]
["CountrySlot",{"$f":"INDEX($O:$O,MATCH(A10,$N:$N,0))","v":{"$error":"#N/A"}},null,"Majors match?",{"$f":"IF(E7=E9,\"Y\",\"N, Submit change of major\")","v":{"$error":"#N/A"}},null,"Note 1",null,"x","Advisor info",{"$f":"INDEX('Data Lists'!$J:$J,MATCH($B$12,'Data Lists'!$H:$H,0))","v":{"$error":"#N/A"}},"(leave formula, or type \"me <email>\")",null,"Major",{"$f":"INDEX('My Students'!$20:$28,MATCH($O$1,'My Students'!$B$20:$B$28,0),MATCH(N10,'My Students'!$20:$20,0))","v":{"$error":"#N/A"}}]
["Order/Time",{"$f":"INDEX($O:$O,MATCH(A11,$N:$N,0))","v":{"$error":"#N/A"}},null,"Override major",null,null,"Other",null,"[notes]","Other",null,"[type any notes to student]",null,"Order/Time",{"$f":"INDEX('My Students'!$20:$28,MATCH($O$1,'My Students'!$B$20:$B$28,0),MATCH(N11,'My Students'!$20:$20,0))","v":{"$error":"#N/A"}}]
["Acad Advisor",{"$f":"INDEX($O:$O,MATCH(\"Assigned Advisor\",$N:$N,0))","v":{"$error":"#N/A"}},null,null,null,null,"Paste in advising report:",{"$f":"CONCATENATE(\"Student came for advising during Customs.\",IF(H6<>\"\",\"  Attaching scanned copy of notes.\",\"\"),IF(H5=\"a\",Messages!$C$2,IF(H5=\"b\",Messages!$C$3,IF(H5<>\"\",CONCATENATE(\"  Registered student for classes for upcoming semester: \",H5),\"\"))),IF(H11<>\"\",CONCATENATE(\"\n\n\",H11),\"\"),IF(H7<>\"\",\"\n\nSubmitted change of major form. \",\"\"),IF(H8<>\"\",Messages!$C$4,\"\"),IF(H9<>\"\",Messages!$C$5,\"\"),IF(H10<>\"\",Messages!$C$6,\"\"))","v":"Student came for advising during Customs."},null,"Paste in stu msg:",{"$f":"CONCATENATE(\"We enjoyed seeing you at the CBHS Advising Center Customs session today, \",$A$21,\"!  \",IF(K5=\"x\",\"I've attached your Registration Checklist, for your records.\",\"\"),IF(K11<>\"\",CONCATENATE(\"\n\n\",K11),\"\"),IF(K6=\"x\",CONCATENATE(Messages!$C$7&K10&\", before making changes.\"),\"\"),IF(K9=\"x\",Messages!$C$10,\"\"),IF(K7=\"x\",Messages!$C$8,\"\"),IF(K8<>\"\",Messages!$C$9,\"\"),CONCATENATE(\"\n\nIf you have any questions or concerns, please contact \"&K10&\".  You'll also want to plan to come in for an advising appointment around mid-terms each semester, to talk about your classes for the upcoming term.  You can find Instructions and Schedule links at mtsu.edu/cbhsadv. \"),\"\n\nWe look forward to seeing you at MTSU this semester!\n\n\",$B$2,\"\n\",$B$3)","v":{"$error":"#N/A"}},null,null,"PrescribedCrsMath",{"$f":"INDEX('My Students'!$20:$28,MATCH($O$1,'My Students'!$B$20:$B$28,0),MATCH(N12,'My Students'!$20:$20,0))","v":{"$error":"#N/A"}},{"$f":"IF(O12=\"college level\",\"n\",IF(O12=0,\"blank--check\",\"y\"))","v":{"$error":"#N/A"}}]
["Customs Advisor",{"$f":"INDEX($O:$O,MATCH(A13,$N:$N,0))","v":{"$error":"#N/A"}},null,"Factors in Choosing Classes",null,null,"\"Registered\" choices: \"a\" to get message re stu registering in lab, \"b\" to get message re helping stu register in office, or type list of classes to be inserted.",null,null,null,null,null,null,"PrescribedCrsWriting",{"$f":"INDEX('My Students'!$20:$28,MATCH($O$1,'My Students'!$B$20:$B$28,0),MATCH(N13,'My Students'!$20:$20,0))","v":{"$error":"#N/A"}},{"$f":"IF(O13=\"college level\",\"n\",IF(O13=0,\"blank--check\",\"y\"))","v":{"$error":"#N/A"}}]
[null,null,null,"Honors",{"$f":"INDEX($O:$O,MATCH(\"HonorsElig\",$N:$N,0))","v":{"$error":"#N/A"}},null,null,null,null,null,null,null,null,"PrescribedCrsReading",{"$f":"INDEX('My Students'!$20:$28,MATCH($O$1,'My Students'!$B$20:$B$28,0),MATCH(N14,'My Students'!$20:$20,0))","v":{"$error":"#N/A"}},{"$f":"IF(O14=\"college level\",\"n\",IF(O14=0,\"blank--check\",\"y\"))","v":{"$error":"#N/A"}}]
["Emily's Notes",{"$f":"INDEX($O:$O,MATCH(\"Notes\",$N:$N,0))","v":{"$error":"#N/A"}},null,"Prescribeds",{"$f":"IF(AND(P12=\"n\",P13=\"n\",P14=\"n\"),\"\",\nCONCATENATE(\"Ks: \"&IF(P12=\"y\",O12,\"\")&IF(P12=\"y\",\", \",\"\")&IF(P12=\"blank--check\",\"Math--check; \",\"\")&\nIF(P13=\"y\",\"ENGL\",\"\")&IF(P13=\"y\",\", \",\"\")&IF(P13=\"blank--check\",\"Engl--check; \",\"\")&\nIF(P14=\"y\",\"READ\",\"\")&IF(T14=\"y\",\", \",\"\")&IF(P14=\"blank--check\",\"Read--check; \",\"\")&\nIF(P15=\"y\",\"U1010\",\"\")))","v":{"$error":"#N/A"}},null,"This is what it will say:",null,null,"This is what it will say:",null,null,null,"PrescribedCrsStudySkills",{"$f":"INDEX('My Students'!$20:$28,MATCH($O$1,'My Students'!$B$20:$B$28,0),MATCH(N15,'My Students'!$20:$20,0))","v":{"$error":"#N/A"}},{"$f":"IF((P12<>\"n\")+(P13=\"y\")+(P14=\"y\")>=2,\"y\",\"n\")","v":{"$error":"#N/A"}}]
[null,null,null,null,null,null,{"$f":"H12","v":"Student came for advising during Customs."},null,null,{"$f":"K12","v":{"$error":"#N/A"}},null,null,null,"HonorsElig",{"$f":"INDEX('My Students'!$20:$28,MATCH($O$1,'My Students'!$B$20:$B$28,0),MATCH(N16,'My Students'!$20:$20,0))","v":{"$error":"#N/A"}}]
[null,null,null,"Scholars Acad",{"$f":"INDEX($O:$O,MATCH(\"Sacad\",$N:$N,0))","v":{"$error":"#N/A"}},null,null,null,null,null,null,null,null,"ACTEngl",{"$f":"INDEX('My Students'!$20:$28,MATCH($O$1,'My Students'!$B$20:$B$28,0),MATCH(N17,'My Students'!$20:$20,0))","v":{"$error":"#N/A"}}]
[null,null,null,"Pre-Nursing",{"$f":"INDEX($O:$O,MATCH(\"PREN\",$N:$N,0))","v":{"$error":"#N/A"}},null,null,null,null,null,null,null,null,"HighSchoolGPA",{"$f":"INDEX('My Students'!$20:$28,MATCH($O$1,'My Students'!$B$20:$B$28,0),MATCH(N18,'My Students'!$20:$20,0))","v":{"$error":"#N/A"}}]
["Copy-Pastes & Folder Links",null,null,"ACTEngl",{"$f":"INDEX($O:$O,MATCH(\"ACTEngl\",$N:$N,0))","v":{"$error":"#N/A"}},null,null,null,null,null,null,null,null,"ACTCompositeScore",{"$f":"INDEX('My Students'!$20:$28,MATCH($O$1,'My Students'!$B$20:$B$28,0),MATCH(N19,'My Students'!$20:$20,0))","v":{"$error":"#N/A"}}]
[{"$f":"INDEX(O:O,MATCH(\"StudentName\",N:N,0))","v":{"$error":"#N/A"}},{"$f":"O1","v":0},null,null,null,null,null,null,null,null,null,null,null,"InclusiveGPA",{"$f":"INDEX('My Students'!$20:$28,MATCH($O$1,'My Students'!$B$20:$B$28,0),MATCH(N20,'My Students'!$20:$20,0))","v":{"$error":"#N/A"}}]
[{"$f":"IFERROR(MID(A20,SEARCH(\" \",A20,1)+1,SEARCH(\" \",A20,SEARCH(\" \",A20,1)+1)-SEARCH(\" \",A20,1)-1),MID(A20,FIND(\" \",A20)+1,256))","v":{"$error":"#N/A"}},{"$f":"CONCATENATE(LEFT(A20,FIND(\", \",A20,1)-1))","v":{"$error":"#N/A"}},null,"Flags",null,null,null,null,null,null,null,null,null,"HrsEarned",{"$f":"INDEX('My Students'!$20:$28,MATCH($O$1,'My Students'!$B$20:$B$28,0),MATCH(N21,'My Students'!$20:$20,0))","v":{"$error":"#N/A"}}]
["Major name",{"$f":"IF(E11=\"\",INDEX('Data Lists'!B:B,MATCH(E7,'Data Lists'!A:A,0)),INDEX('Data Lists'!B:B,MATCH(E11,'Data Lists'!B:B,0)))","v":{"$error":"#N/A"}},null,"Holds",{"$f":"INDEX($O:$O,MATCH(D22,$N:$N,0))","v":{"$error":"#N/A"}},null,null,null,null,null,null,null,null,"CountrySlot",{"$f":"INDEX('My Students'!$20:$28,MATCH($O$1,'My Students'!$B$20:$B$28,0),MATCH(N22,'My Students'!$20:$20,0))","v":{"$error":"#N/A"}}]
["Folder name",{"$f":"IF(E11=\"\",CONCATENATE(INDEX('Data Lists'!E:E,MATCH(E7,'Data Lists'!A:A,0)),\" \",B21,\", \",A21,\" \",B3),CONCATENATE(INDEX('Data Lists'!E:E,MATCH(E11,'Data Lists'!B:B,0)),\" \",B21,\", \",A21,\" \",B3))","v":{"$error":"#N/A"}},null,"Reg Restrictions",{"$f":"INDEX($O:$O,MATCH(\"RegistrationRestrictions\",$N:$N,0))","v":{"$error":"#N/A"}},null,null,null,null,null,null,null,null,"CUSTOMSGrp",{"$f":"INDEX('My Students'!$20:$28,MATCH($O$1,'My Students'!$B$20:$B$28,0),MATCH(N23,'My Students'!$20:$20,0))","v":{"$error":"#N/A"}}]
["Dept folders",{"$f":"HYPERLINK(CONCATENATE(\"Z:\\CoBHS Advising\\Departments\\\",IF(E12=\"\",INDEX('Data Lists'!D:D,MATCH(E8,'Data Lists'!A:A,0)),INDEX('Data Lists'!D:D,MATCH(E12,'Data Lists'!B:B,0))),\"\\Student Forms\\\"))","v":{"$error":"#N/A"}},null,"Immunizations",{"$f":"INDEX($O:$O,MATCH(\"RegistrationRestrictions\",$N:$N,0))","v":{"$error":"#N/A"}},null,null,null,null,null,null,null,null,"CustomsPOS",{"$f":"INDEX('My Students'!$20:$28,MATCH($O$1,'My Students'!$B$20:$B$28,0),MATCH(N24,'My Students'!$20:$20,0))","v":{"$error":"#N/A"}}]
["Stu folder",{"$f":"HYPERLINK(CONCATENATE(\"Z:\\CoBHS Advising\\Departments\\\",IF(E12=\"\",INDEX('Data Lists'!D:D,MATCH(E8,'Data Lists'!A:A,0)),INDEX('Data Lists'!D:D,MATCH(E12,'Data Lists'!B:B,0))),\"\\Student Forms\\\",B23))","v":{"$error":"#N/A"}},{"$f":"YEARFRAC(O33,NOW())","v":{"$error":"#N/A"}},"Under 18 & Imm",{"$f":"IF(C25>=18,\"OK--over 18\",\"If need imms, will need parent sig\")","v":{"$error":"#N/A"}},null,null,null,null,null,null,null,null,"BannerPOS",{"$f":"INDEX('My Students'!$20:$28,MATCH($O$1,'My Students'!$B$20:$B$28,0),MATCH(N25,'My Students'!$20:$20,0))","v":{"$error":"#N/A"}}]
[null,null,null,"Missing Items",{"$f":"INDEX($O:$O,MATCH(\"MissingChecklistItems\",$N:$N,0))","v":{"$error":"#N/A"}},null,null,null,null,null,null,null,null,"Assigned Advisor",{"$f":"INDEX('My Students'!$20:$28,MATCH($O$1,'My Students'!$B$20:$B$28,0),MATCH(N26,'My Students'!$20:$20,0))","v":{"$error":"#N/A"}}]
[null,null,null,"Term",{"$f":"INDEX($O:$O,MATCH(\"TermDesc\",$N:$N,0))","v":{"$error":"#N/A"}},null,null,null,null,null,null,null,null,"Customs Advisor",{"$f":"INDEX('My Students'!$20:$28,MATCH($O$1,'My Students'!$B$20:$B$28,0),MATCH(N27,'My Students'!$20:$20,0))","v":{"$error":"#N/A"}}]
[null,null,null,"Might need BUAF",{"$f":"INDEX($O:$O,MATCH(\"VetOrDep\",$N:$N,0))","v":{"$error":"#N/A"}},null,null,null,null,null,null,null,null,"Holds",{"$f":"INDEX('My Students'!$20:$28,MATCH($O$1,'My Students'!$B$20:$B$28,0),MATCH(N28,'My Students'!$20:$20,0))","v":{"$error":"#N/A"}}]
[null,null,null,"Reverse Transfer",{"$f":"INDEX($O:$O,MATCH(\"ReverseTransfer\",$N:$N,0))","v":{"$error":"#N/A"}},null,null,null,null,null,null,null,null,"RegistrationRestrictions",{"$f":"INDEX('My Students'!$20:$28,MATCH($O$1,'My Students'!$B$20:$B$28,0),MATCH(N29,'My Students'!$20:$20,0))","v":{"$error":"#N/A"}}]
[null,null,null,"First Generation",{"$f":"INDEX($O:$O,MATCH(\"1stGen\",$N:$N,0))","v":{"$error":"#N/A"}},null,null,null,null,null,null,null,null,"MissingChecklistItems",{"$f":"INDEX('My Students'!$20:$28,MATCH($O$1,'My Students'!$B$20:$B$28,0),MATCH(N30,'My Students'!$20:$20,0))","v":{"$error":"#N/A"}}]
[null,null,null,null,null,null,null,null,null,null,null,null,null,"AdmissionDecision",{"$f":"INDEX('My Students'!$20:$28,MATCH($O$1,'My Students'!$B$20:$B$28,0),MATCH(N31,'My Students'!$20:$20,0))","v":{"$error":"#N/A"}}]
["Want to add a link to the student's folder? ",null,null,null,null,null,null,null,null,null,null,null,null,"TermDesc",{"$f":"INDEX('My Students'!$20:$28,MATCH($O$1,'My Students'!$B$20:$B$28,0),MATCH(N32,'My Students'!$20:$20,0))","v":{"$error":"#N/A"}}]
["--Click on the \"Stu folder\" field above (B21).",null,null,null,null,null,null,null,null,null,null,null,null,"DateofBirth",{"$f":"INDEX('My Students'!$20:$28,MATCH($O$1,'My Students'!$B$20:$B$28,0),MATCH(N33,'My Students'!$20:$20,0))","v":{"$error":"#N/A"}}]
["--Control-K to start the process of creating a link.",null,null,null,null,null,null,null,null,null,null,null,null,"Notes",{"$f":"INDEX('My Students'!$20:$28,MATCH($O$1,'My Students'!$B$20:$B$28,0),MATCH(N34,'My Students'!$20:$20,0))","v":{"$error":"#N/A"}}]
["--Browse to the student's folder.",null,null,null,null,null,null,null,null,null,null,null,null,"MTSUEmail",{"$f":"INDEX('My Students'!$20:$28,MATCH($O$1,'My Students'!$B$20:$B$28,0),MATCH(N35,'My Students'!$20:$20,0))","v":{"$error":"#N/A"}}]
["--Choose any file in the folder and double-click on it.",null,null,null,null,null,null,null,null,null,null,null,null,"PersonalEmail",{"$f":"INDEX('My Students'!$20:$28,MATCH($O$1,'My Students'!$B$20:$B$28,0),MATCH(N36,'My Students'!$20:$20,0))","v":{"$error":"#N/A"}}]
["--In the Address box, delete the file name (back to the \\ after the folder name).",null,null,null,null,null,null,null,null,null,null,null,null,"PermPhone",{"$f":"INDEX('My Students'!$20:$28,MATCH($O$1,'My Students'!$B$20:$B$28,0),MATCH(N37,'My Students'!$20:$20,0))","v":{"$error":"#N/A"}}]
["--Click OK.",null,null,null,null,null,null,null,null,null,null,null,null,"MailingPhone",{"$f":"INDEX('My Students'!$20:$28,MATCH($O$1,'My Students'!$B$20:$B$28,0),MATCH(N38,'My Students'!$20:$20,0))","v":{"$error":"#N/A"}}]
["--Now you should see the path to the folder, underlined as a link.",null,null,null,null,null,null,null,null,null,null,null,null,"NursElig",{"$f":"INDEX('My Students'!$20:$28,MATCH($O$1,'My Students'!$B$20:$B$28,0),MATCH(N39,'My Students'!$20:$20,0))","v":{"$error":"#N/A"}}]
["--When you click on your link, the folder should open in a separate window.",null,null,null,null,null,null,null,null,null,null,null,null,"ACTMathScre",{"$f":"INDEX('My Students'!$20:$28,MATCH($O$1,'My Students'!$B$20:$B$28,0),MATCH(N40,'My Students'!$20:$20,0))","v":{"$error":"#N/A"}}]
[null,null,null,null,null,null,null,null,null,null,null,null,null,"ACTScienceScre",{"$f":"INDEX('My Students'!$20:$28,MATCH($O$1,'My Students'!$B$20:$B$28,0),MATCH(N41,'My Students'!$20:$20,0))","v":{"$error":"#N/A"}}]
[null,null,null,null,null,null,null,null,null,null,null,null,null,"A&P?",{"$f":"IF(O1<>\"\",IF(OR(AND(O40=21,O41>21),AND(O40>21,O41=21)),\"maybe\",IF(AND(O31>=21,O41>=21),\"Y\",\"N\")),\"\")","v":{"$error":"#N/A"}}]
[null,null,null,null,null,null,null,null,null,null,null,null,null,"Major",{"$f":"INDEX('Data Lists'!B:B,MATCH(O24,'Data Lists'!A:A,0))","v":{"$error":"#N/A"}}]
[null,null,null,null,null,null,null,null,null,null,null,null,null,"NameM#",{"$f":"CONCATENATE(O47,\", \",O46,\" \",O45)","v":{"$error":"#N/A"}}]
[null,null,null,null,null,null,null,null,null,null,null,null,null,"M# copy",{"$f":"O1","v":0}]
[null,null,null,null,null,null,null,null,null,null,null,null,null,"Fname",{"$f":"IF(1<>\"\",IFERROR(MID(O9,SEARCH(\" \",O9,1)+1,SEARCH(\" \",O9,SEARCH(\" \",O9,1)+1)-SEARCH(\" \",O9,1)-1),MID(O9,FIND(\" \",O9)+1,256)),\"\")","v":{"$error":"#N/A"}}]
[null,null,null,null,null,null,null,null,null,null,null,null,null,"Lname",{"$f":"IF(O1<>\"\",CONCATENATE(LEFT(O9,FIND(\", \",O9,1)-1)),\"\")","v":{"$error":"#N/A"}}]

{"sheet":"F","index":28,"n_rows":47,"n_cols":16,"rows_kept":47,"cut":false,"hidden":false,"merged":[[15,6,39,7],[15,9,39,10],[14,3,15,3],[14,4,15,4],[14,0,15,0],[14,1,15,1]]}
["Contact & Demographic Info",null,null,"Academic Info",null,null,"Start",null,null,"Change major",null,null,null,"M#",{"$f":"'My Students'!B26","v":0}]
["Name",{"$f":"CONCATENATE(A21,\" \",B21)","v":{"$error":"#N/A"}},null,"Transferred hours",{"$f":"INDEX($O:$O,MATCH(\"HrsEarned\",$N:$N,0))","v":{"$error":"#N/A"}},null,"Stop",null,null,"Notes for advisor",null,null,null,"Deleted",{"$f":"INDEX('My Students'!$20:$28,MATCH($O$1,'My Students'!$B$20:$B$28,0),MATCH(N2,'My Students'!$20:$20,0))","v":{"$error":"#N/A"}}]
["M#",{"$f":"O1","v":0},null,"HS GPA",{"$f":"INDEX($O:$O,MATCH(\"HighSchoolGPA\",$N:$N,0))","v":{"$error":"#N/A"}},null,null,null,null,null,null,null,null,"SAcad",{"$f":"INDEX('My Students'!$20:$28,MATCH($O$1,'My Students'!$B$20:$B$28,0),MATCH(N3,'My Students'!$20:$20,0))","v":{"$error":"#N/A"}}]
["MTSUEmail",{"$f":"INDEX($O:$O,MATCH(A4,$N:$N,0))","v":{"$error":"#N/A"}},null,"Inclusive GPA",{"$f":"INDEX($O:$O,MATCH(\"InclusiveGPA\",$N:$N,0))","v":{"$error":"#N/A"}},null,null,"Report Builder",null,null,"Student Message Builder",null,null,"VetOrDep",{"$f":"INDEX('My Students'!$20:$28,MATCH($O$1,'My Students'!$B$20:$B$28,0),MATCH(N4,'My Students'!$20:$20,0))","v":{"$error":"#N/A"}}]
["PersonalEmail",{"$f":"INDEX($O:$O,MATCH(A5,$N:$N,0))","v":{"$error":"#N/A"}},null,"ACT Math",{"$f":"INDEX($O:$O,MATCH(\"ACTMathScre\",$N:$N,0))","v":{"$error":"#N/A"}},null,"Registered",null,"see below","Docs attached",null,"x (to say that you've attached docs for the student)",null,"PREN",{"$f":"INDEX('My Students'!$20:$28,MATCH($O$1,'My Students'!$B$20:$B$28,0),MATCH(N5,'My Students'!$20:$20,0))","v":{"$error":"#N/A"}}]
["PermPhone",{"$f":"INDEX($O:$O,MATCH(A6,$N:$N,0))","v":{"$error":"#N/A"}},null,"ACT Science",{"$f":"INDEX($O:$O,MATCH(\"ACTScienceScre\",$N:$N,0))","v":{"$error":"#N/A"}},null,"Attaching Scan",null,"x","Drop/Add info",null,"x (to give info on switching classes & steps to do so)",null,"1stGen",{"$f":"INDEX('My Students'!$20:$28,MATCH($O$1,'My Students'!$B$20:$B$28,0),MATCH(N6,'My Students'!$20:$20,0))","v":{"$error":"#N/A"}}]
["MailingPhone",{"$f":"INDEX($O:$O,MATCH(A7,$N:$N,0))","v":{"$error":"#N/A"}},null,"CustomsPOS",{"$f":"INDEX($O:$O,MATCH(D7,$N:$N,0))","v":{"$error":"#N/A"}},null,"Submitted COM",null,"x","Acad success tips",null,"x (to give acad tips, tutoring & SI websites, & \"ask for help\")",null,"ReverseTransfer",{"$f":"INDEX('My Students'!$20:$28,MATCH($O$1,'My Students'!$B$20:$B$28,0),MATCH(N7,'My Students'!$20:$20,0))","v":{"$error":"#N/A"}}]
[null,null,null,null,{"$f":"INDEX($O:$O,MATCH(\"Major\",$N:$N,0))","v":{"$error":"#N/A"}},null,"Supp Instructn",null,"x","NURS Info Session",null,"x (to refer student to nursing info webpage and session)",null,"FR/TR",{"$f":"INDEX('My Students'!$20:$28,MATCH($O$1,'My Students'!$B$20:$B$28,0),MATCH(N8,'My Students'!$20:$20,0))","v":{"$error":"#N/A"}}]
["Customs Info",null,null,"BannerPOS",{"$f":"INDEX($O:$O,MATCH(D9,$N:$N,0))","v":{"$error":"#N/A"}},null,"RTTP",null,"x","Check phone #",null,"x (to tell stu their listed ph #s are wrong, & how to fix)",null,"StudentName",{"$f":"INDEX('My Students'!$20:$28,MATCH($O$1,'My Students'!$B$20:$B$28,0),MATCH(N9,'My Students'!$20:$20,0))","v":{"$error":"#N/A"}}]
["CountrySlot",{"$f":"INDEX($O:$O,MATCH(A10,$N:$N,0))","v":{"$error":"#N/A"}},null,"Majors match?",{"$f":"IF(E7=E9,\"Y\",\"N, Submit change of major\")","v":{"$error":"#N/A"}},null,"Note 1",null,"x","Advisor info",{"$f":"INDEX('Data Lists'!$J:$J,MATCH($B$12,'Data Lists'!$H:$H,0))","v":{"$error":"#N/A"}},"(leave formula, or type \"me <email>\")",null,"Major",{"$f":"INDEX('My Students'!$20:$28,MATCH($O$1,'My Students'!$B$20:$B$28,0),MATCH(N10,'My Students'!$20:$20,0))","v":{"$error":"#N/A"}}]
["Order/Time",{"$f":"INDEX($O:$O,MATCH(A11,$N:$N,0))","v":{"$error":"#N/A"}},null,"Override major",null,null,"Other",null,"[notes]","Other",null,"[type any notes to student]",null,"Order/Time",{"$f":"INDEX('My Students'!$20:$28,MATCH($O$1,'My Students'!$B$20:$B$28,0),MATCH(N11,'My Students'!$20:$20,0))","v":{"$error":"#N/A"}}]
["Acad Advisor",{"$f":"INDEX($O:$O,MATCH(\"Assigned Advisor\",$N:$N,0))","v":{"$error":"#N/A"}},null,null,null,null,"Paste in advising report:",{"$f":"CONCATENATE(\"Student came for advising during Customs.\",IF(H6<>\"\",\"  Attaching scanned copy of notes.\",\"\"),IF(H5=\"a\",Messages!$C$2,IF(H5=\"b\",Messages!$C$3,IF(H5<>\"\",CONCATENATE(\"  Registered student for classes for upcoming semester: \",H5),\"\"))),IF(H11<>\"\",CONCATENATE(\"\n\n\",H11),\"\"),IF(H7<>\"\",\"\n\nSubmitted change of major form. \",\"\"),IF(H8<>\"\",Messages!$C$4,\"\"),IF(H9<>\"\",Messages!$C$5,\"\"),IF(H10<>\"\",Messages!$C$6,\"\"))","v":"Student came for advising during Customs."},null,"Paste in stu msg:",{"$f":"CONCATENATE(\"We enjoyed seeing you at the CBHS Advising Center Customs session today, \",$A$21,\"!  \",IF(K5=\"x\",\"I've attached your Registration Checklist, for your records.\",\"\"),IF(K11<>\"\",CONCATENATE(\"\n\n\",K11),\"\"),IF(K6=\"x\",CONCATENATE(Messages!$C$7&K10&\", before making changes.\"),\"\"),IF(K9=\"x\",Messages!$C$10,\"\"),IF(K7=\"x\",Messages!$C$8,\"\"),IF(K8<>\"\",Messages!$C$9,\"\"),CONCATENATE(\"\n\nIf you have any questions or concerns, please contact \"&K10&\".  You'll also want to plan to come in for an advising appointment around mid-terms each semester, to talk about your classes for the upcoming term.  You can find Instructions and Schedule links at mtsu.edu/cbhsadv. \"),\"\n\nWe look forward to seeing you at MTSU this semester!\n\n\",$B$2,\"\n\",$B$3)","v":{"$error":"#N/A"}},null,null,"PrescribedCrsMath",{"$f":"INDEX('My Students'!$20:$28,MATCH($O$1,'My Students'!$B$20:$B$28,0),MATCH(N12,'My Students'!$20:$20,0))","v":{"$error":"#N/A"}},{"$f":"IF(O12=\"college level\",\"n\",IF(O12=0,\"blank--check\",\"y\"))","v":{"$error":"#N/A"}}]
["Customs Advisor",{"$f":"INDEX($O:$O,MATCH(A13,$N:$N,0))","v":{"$error":"#N/A"}},null,"Factors in Choosing Classes",null,null,"\"Registered\" choices: \"a\" to get message re stu registering in lab, \"b\" to get message re helping stu register in office, or type list of classes to be inserted.",null,null,null,null,null,null,"PrescribedCrsWriting",{"$f":"INDEX('My Students'!$20:$28,MATCH($O$1,'My Students'!$B$20:$B$28,0),MATCH(N13,'My Students'!$20:$20,0))","v":{"$error":"#N/A"}},{"$f":"IF(O13=\"college level\",\"n\",IF(O13=0,\"blank--check\",\"y\"))","v":{"$error":"#N/A"}}]
[null,null,null,"Honors",{"$f":"INDEX($O:$O,MATCH(\"HonorsElig\",$N:$N,0))","v":{"$error":"#N/A"}},null,null,null,null,null,null,null,null,"PrescribedCrsReading",{"$f":"INDEX('My Students'!$20:$28,MATCH($O$1,'My Students'!$B$20:$B$28,0),MATCH(N14,'My Students'!$20:$20,0))","v":{"$error":"#N/A"}},{"$f":"IF(O14=\"college level\",\"n\",IF(O14=0,\"blank--check\",\"y\"))","v":{"$error":"#N/A"}}]
["Emily's Notes",{"$f":"INDEX($O:$O,MATCH(\"Notes\",$N:$N,0))","v":{"$error":"#N/A"}},null,"Prescribeds",{"$f":"IF(AND(P12=\"n\",P13=\"n\",P14=\"n\"),\"\",\nCONCATENATE(\"Ks: \"&IF(P12=\"y\",O12,\"\")&IF(P12=\"y\",\", \",\"\")&IF(P12=\"blank--check\",\"Math--check; \",\"\")&\nIF(P13=\"y\",\"ENGL\",\"\")&IF(P13=\"y\",\", \",\"\")&IF(P13=\"blank--check\",\"Engl--check; \",\"\")&\nIF(P14=\"y\",\"READ\",\"\")&IF(T14=\"y\",\", \",\"\")&IF(P14=\"blank--check\",\"Read--check; \",\"\")&\nIF(P15=\"y\",\"U1010\",\"\")))","v":{"$error":"#N/A"}},null,"This is what it will say:",null,null,"This is what it will say:",null,null,null,"PrescribedCrsStudySkills",{"$f":"INDEX('My Students'!$20:$28,MATCH($O$1,'My Students'!$B$20:$B$28,0),MATCH(N15,'My Students'!$20:$20,0))","v":{"$error":"#N/A"}},{"$f":"IF((P12<>\"n\")+(P13=\"y\")+(P14=\"y\")>=2,\"y\",\"n\")","v":{"$error":"#N/A"}}]
[null,null,null,null,null,null,{"$f":"H12","v":"Student came for advising during Customs."},null,null,{"$f":"K12","v":{"$error":"#N/A"}},null,null,null,"HonorsElig",{"$f":"INDEX('My Students'!$20:$28,MATCH($O$1,'My Students'!$B$20:$B$28,0),MATCH(N16,'My Students'!$20:$20,0))","v":{"$error":"#N/A"}}]
[null,null,null,"Scholars Acad",{"$f":"INDEX($O:$O,MATCH(\"Sacad\",$N:$N,0))","v":{"$error":"#N/A"}},null,null,null,null,null,null,null,null,"ACTEngl",{"$f":"INDEX('My Students'!$20:$28,MATCH($O$1,'My Students'!$B$20:$B$28,0),MATCH(N17,'My Students'!$20:$20,0))","v":{"$error":"#N/A"}}]
[null,null,null,"Pre-Nursing",{"$f":"INDEX($O:$O,MATCH(\"PREN\",$N:$N,0))","v":{"$error":"#N/A"}},null,null,null,null,null,null,null,null,"HighSchoolGPA",{"$f":"INDEX('My Students'!$20:$28,MATCH($O$1,'My Students'!$B$20:$B$28,0),MATCH(N18,'My Students'!$20:$20,0))","v":{"$error":"#N/A"}}]
["Copy-Pastes & Folder Links",null,null,"ACTEngl",{"$f":"INDEX($O:$O,MATCH(\"ACTEngl\",$N:$N,0))","v":{"$error":"#N/A"}},null,null,null,null,null,null,null,null,"ACTCompositeScore",{"$f":"INDEX('My Students'!$20:$28,MATCH($O$1,'My Students'!$B$20:$B$28,0),MATCH(N19,'My Students'!$20:$20,0))","v":{"$error":"#N/A"}}]
[{"$f":"INDEX(O:O,MATCH(\"StudentName\",N:N,0))","v":{"$error":"#N/A"}},{"$f":"O1","v":0},null,null,null,null,null,null,null,null,null,null,null,"InclusiveGPA",{"$f":"INDEX('My Students'!$20:$28,MATCH($O$1,'My Students'!$B$20:$B$28,0),MATCH(N20,'My Students'!$20:$20,0))","v":{"$error":"#N/A"}}]
[{"$f":"IFERROR(MID(A20,SEARCH(\" \",A20,1)+1,SEARCH(\" \",A20,SEARCH(\" \",A20,1)+1)-SEARCH(\" \",A20,1)-1),MID(A20,FIND(\" \",A20)+1,256))","v":{"$error":"#N/A"}},{"$f":"CONCATENATE(LEFT(A20,FIND(\", \",A20,1)-1))","v":{"$error":"#N/A"}},null,"Flags",null,null,null,null,null,null,null,null,null,"HrsEarned",{"$f":"INDEX('My Students'!$20:$28,MATCH($O$1,'My Students'!$B$20:$B$28,0),MATCH(N21,'My Students'!$20:$20,0))","v":{"$error":"#N/A"}}]
["Major name",{"$f":"IF(E11=\"\",INDEX('Data Lists'!B:B,MATCH(E7,'Data Lists'!A:A,0)),INDEX('Data Lists'!B:B,MATCH(E11,'Data Lists'!B:B,0)))","v":{"$error":"#N/A"}},null,"Holds",{"$f":"INDEX($O:$O,MATCH(D22,$N:$N,0))","v":{"$error":"#N/A"}},null,null,null,null,null,null,null,null,"CountrySlot",{"$f":"INDEX('My Students'!$20:$28,MATCH($O$1,'My Students'!$B$20:$B$28,0),MATCH(N22,'My Students'!$20:$20,0))","v":{"$error":"#N/A"}}]
["Folder name",{"$f":"IF(E11=\"\",CONCATENATE(INDEX('Data Lists'!E:E,MATCH(E7,'Data Lists'!A:A,0)),\" \",B21,\", \",A21,\" \",B3),CONCATENATE(INDEX('Data Lists'!E:E,MATCH(E11,'Data Lists'!B:B,0)),\" \",B21,\", \",A21,\" \",B3))","v":{"$error":"#N/A"}},null,"Reg Restrictions",{"$f":"INDEX($O:$O,MATCH(\"RegistrationRestrictions\",$N:$N,0))","v":{"$error":"#N/A"}},null,null,null,null,null,null,null,null,"CUSTOMSGrp",{"$f":"INDEX('My Students'!$20:$28,MATCH($O$1,'My Students'!$B$20:$B$28,0),MATCH(N23,'My Students'!$20:$20,0))","v":{"$error":"#N/A"}}]
["Dept folders",{"$f":"HYPERLINK(CONCATENATE(\"Z:\\CoBHS Advising\\Departments\\\",IF(E12=\"\",INDEX('Data Lists'!D:D,MATCH(E8,'Data Lists'!A:A,0)),INDEX('Data Lists'!D:D,MATCH(E12,'Data Lists'!B:B,0))),\"\\Student Forms\\\"))","v":{"$error":"#N/A"}},null,"Immunizations",{"$f":"INDEX($O:$O,MATCH(\"RegistrationRestrictions\",$N:$N,0))","v":{"$error":"#N/A"}},null,null,null,null,null,null,null,null,"CustomsPOS",{"$f":"INDEX('My Students'!$20:$28,MATCH($O$1,'My Students'!$B$20:$B$28,0),MATCH(N24,'My Students'!$20:$20,0))","v":{"$error":"#N/A"}}]
["Stu folder",{"$f":"HYPERLINK(CONCATENATE(\"Z:\\CoBHS Advising\\Departments\\\",IF(E12=\"\",INDEX('Data Lists'!D:D,MATCH(E8,'Data Lists'!A:A,0)),INDEX('Data Lists'!D:D,MATCH(E12,'Data Lists'!B:B,0))),\"\\Student Forms\\\",B23))","v":{"$error":"#N/A"}},{"$f":"YEARFRAC(O33,NOW())","v":{"$error":"#N/A"}},"Under 18 & Imm",{"$f":"IF(C25>=18,\"OK--over 18\",\"If need imms, will need parent sig\")","v":{"$error":"#N/A"}},null,null,null,null,null,null,null,null,"BannerPOS",{"$f":"INDEX('My Students'!$20:$28,MATCH($O$1,'My Students'!$B$20:$B$28,0),MATCH(N25,'My Students'!$20:$20,0))","v":{"$error":"#N/A"}}]
[null,null,null,"Missing Items",{"$f":"INDEX($O:$O,MATCH(\"MissingChecklistItems\",$N:$N,0))","v":{"$error":"#N/A"}},null,null,null,null,null,null,null,null,"Assigned Advisor",{"$f":"INDEX('My Students'!$20:$28,MATCH($O$1,'My Students'!$B$20:$B$28,0),MATCH(N26,'My Students'!$20:$20,0))","v":{"$error":"#N/A"}}]
[null,null,null,"Term",{"$f":"INDEX($O:$O,MATCH(\"TermDesc\",$N:$N,0))","v":{"$error":"#N/A"}},null,null,null,null,null,null,null,null,"Customs Advisor",{"$f":"INDEX('My Students'!$20:$28,MATCH($O$1,'My Students'!$B$20:$B$28,0),MATCH(N27,'My Students'!$20:$20,0))","v":{"$error":"#N/A"}}]
[null,null,null,"Might need BUAF",{"$f":"INDEX($O:$O,MATCH(\"VetOrDep\",$N:$N,0))","v":{"$error":"#N/A"}},null,null,null,null,null,null,null,null,"Holds",{"$f":"INDEX('My Students'!$20:$28,MATCH($O$1,'My Students'!$B$20:$B$28,0),MATCH(N28,'My Students'!$20:$20,0))","v":{"$error":"#N/A"}}]
[null,null,null,"Reverse Transfer",{"$f":"INDEX($O:$O,MATCH(\"ReverseTransfer\",$N:$N,0))","v":{"$error":"#N/A"}},null,null,null,null,null,null,null,null,"RegistrationRestrictions",{"$f":"INDEX('My Students'!$20:$28,MATCH($O$1,'My Students'!$B$20:$B$28,0),MATCH(N29,'My Students'!$20:$20,0))","v":{"$error":"#N/A"}}]
[null,null,null,"First Generation",{"$f":"INDEX($O:$O,MATCH(\"1stGen\",$N:$N,0))","v":{"$error":"#N/A"}},null,null,null,null,null,null,null,null,"MissingChecklistItems",{"$f":"INDEX('My Students'!$20:$28,MATCH($O$1,'My Students'!$B$20:$B$28,0),MATCH(N30,'My Students'!$20:$20,0))","v":{"$error":"#N/A"}}]
[null,null,null,null,null,null,null,null,null,null,null,null,null,"AdmissionDecision",{"$f":"INDEX('My Students'!$20:$28,MATCH($O$1,'My Students'!$B$20:$B$28,0),MATCH(N31,'My Students'!$20:$20,0))","v":{"$error":"#N/A"}}]
["Want to add a link to the student's folder? ",null,null,null,null,null,null,null,null,null,null,null,null,"TermDesc",{"$f":"INDEX('My Students'!$20:$28,MATCH($O$1,'My Students'!$B$20:$B$28,0),MATCH(N32,'My Students'!$20:$20,0))","v":{"$error":"#N/A"}}]
["--Click on the \"Stu folder\" field above (B21).",null,null,null,null,null,null,null,null,null,null,null,null,"DateofBirth",{"$f":"INDEX('My Students'!$20:$28,MATCH($O$1,'My Students'!$B$20:$B$28,0),MATCH(N33,'My Students'!$20:$20,0))","v":{"$error":"#N/A"}}]
["--Control-K to start the process of creating a link.",null,null,null,null,null,null,null,null,null,null,null,null,"Notes",{"$f":"INDEX('My Students'!$20:$28,MATCH($O$1,'My Students'!$B$20:$B$28,0),MATCH(N34,'My Students'!$20:$20,0))","v":{"$error":"#N/A"}}]
["--Browse to the student's folder.",null,null,null,null,null,null,null,null,null,null,null,null,"MTSUEmail",{"$f":"INDEX('My Students'!$20:$28,MATCH($O$1,'My Students'!$B$20:$B$28,0),MATCH(N35,'My Students'!$20:$20,0))","v":{"$error":"#N/A"}}]
["--Choose any file in the folder and double-click on it.",null,null,null,null,null,null,null,null,null,null,null,null,"PersonalEmail",{"$f":"INDEX('My Students'!$20:$28,MATCH($O$1,'My Students'!$B$20:$B$28,0),MATCH(N36,'My Students'!$20:$20,0))","v":{"$error":"#N/A"}}]
["--In the Address box, delete the file name (back to the \\ after the folder name).",null,null,null,null,null,null,null,null,null,null,null,null,"PermPhone",{"$f":"INDEX('My Students'!$20:$28,MATCH($O$1,'My Students'!$B$20:$B$28,0),MATCH(N37,'My Students'!$20:$20,0))","v":{"$error":"#N/A"}}]
["--Click OK.",null,null,null,null,null,null,null,null,null,null,null,null,"MailingPhone",{"$f":"INDEX('My Students'!$20:$28,MATCH($O$1,'My Students'!$B$20:$B$28,0),MATCH(N38,'My Students'!$20:$20,0))","v":{"$error":"#N/A"}}]
["--Now you should see the path to the folder, underlined as a link.",null,null,null,null,null,null,null,null,null,null,null,null,"NursElig",{"$f":"INDEX('My Students'!$20:$28,MATCH($O$1,'My Students'!$B$20:$B$28,0),MATCH(N39,'My Students'!$20:$20,0))","v":{"$error":"#N/A"}}]
["--When you click on your link, the folder should open in a separate window.",null,null,null,null,null,null,null,null,null,null,null,null,"ACTMathScre",{"$f":"INDEX('My Students'!$20:$28,MATCH($O$1,'My Students'!$B$20:$B$28,0),MATCH(N40,'My Students'!$20:$20,0))","v":{"$error":"#N/A"}}]
[null,null,null,null,null,null,null,null,null,null,null,null,null,"ACTScienceScre",{"$f":"INDEX('My Students'!$20:$28,MATCH($O$1,'My Students'!$B$20:$B$28,0),MATCH(N41,'My Students'!$20:$20,0))","v":{"$error":"#N/A"}}]
[null,null,null,null,null,null,null,null,null,null,null,null,null,"A&P?",{"$f":"IF(O1<>\"\",IF(OR(AND(O40=21,O41>21),AND(O40>21,O41=21)),\"maybe\",IF(AND(O31>=21,O41>=21),\"Y\",\"N\")),\"\")","v":{"$error":"#N/A"}}]
[null,null,null,null,null,null,null,null,null,null,null,null,null,"Major",{"$f":"INDEX('Data Lists'!B:B,MATCH(O24,'Data Lists'!A:A,0))","v":{"$error":"#N/A"}}]
[null,null,null,null,null,null,null,null,null,null,null,null,null,"NameM#",{"$f":"CONCATENATE(O47,\", \",O46,\" \",O45)","v":{"$error":"#N/A"}}]
[null,null,null,null,null,null,null,null,null,null,null,null,null,"M# copy",{"$f":"O1","v":0}]
[null,null,null,null,null,null,null,null,null,null,null,null,null,"Fname",{"$f":"IF(1<>\"\",IFERROR(MID(O9,SEARCH(\" \",O9,1)+1,SEARCH(\" \",O9,SEARCH(\" \",O9,1)+1)-SEARCH(\" \",O9,1)-1),MID(O9,FIND(\" \",O9)+1,256)),\"\")","v":{"$error":"#N/A"}}]
[null,null,null,null,null,null,null,null,null,null,null,null,null,"Lname",{"$f":"IF(O1<>\"\",CONCATENATE(LEFT(O9,FIND(\", \",O9,1)-1)),\"\")","v":{"$error":"#N/A"}}]

{"sheet":"G","index":29,"n_rows":47,"n_cols":16,"rows_kept":47,"cut":false,"hidden":false,"merged":[[15,6,39,7],[15,9,39,10],[14,3,15,3],[14,4,15,4],[14,0,15,0],[14,1,15,1]]}
["Contact & Demographic Info",null,null,"Academic Info",null,null,"Start",null,null,"Change major",null,null,null,"M#",{"$f":"'My Students'!B27","v":0}]
["Name",{"$f":"CONCATENATE(A21,\" \",B21)","v":{"$error":"#N/A"}},null,"Transferred hours",{"$f":"INDEX($O:$O,MATCH(\"HrsEarned\",$N:$N,0))","v":{"$error":"#N/A"}},null,"Stop",null,null,"Notes for advisor",null,null,null,"Deleted",{"$f":"INDEX('My Students'!$20:$28,MATCH($O$1,'My Students'!$B$20:$B$28,0),MATCH(N2,'My Students'!$20:$20,0))","v":{"$error":"#N/A"}}]
["M#",{"$f":"O1","v":0},null,"HS GPA",{"$f":"INDEX($O:$O,MATCH(\"HighSchoolGPA\",$N:$N,0))","v":{"$error":"#N/A"}},null,null,null,null,null,null,null,null,"SAcad",{"$f":"INDEX('My Students'!$20:$28,MATCH($O$1,'My Students'!$B$20:$B$28,0),MATCH(N3,'My Students'!$20:$20,0))","v":{"$error":"#N/A"}}]
["MTSUEmail",{"$f":"INDEX($O:$O,MATCH(A4,$N:$N,0))","v":{"$error":"#N/A"}},null,"Inclusive GPA",{"$f":"INDEX($O:$O,MATCH(\"InclusiveGPA\",$N:$N,0))","v":{"$error":"#N/A"}},null,null,"Report Builder",null,null,"Student Message Builder",null,null,"VetOrDep",{"$f":"INDEX('My Students'!$20:$28,MATCH($O$1,'My Students'!$B$20:$B$28,0),MATCH(N4,'My Students'!$20:$20,0))","v":{"$error":"#N/A"}}]
["PersonalEmail",{"$f":"INDEX($O:$O,MATCH(A5,$N:$N,0))","v":{"$error":"#N/A"}},null,"ACT Math",{"$f":"INDEX($O:$O,MATCH(\"ACTMathScre\",$N:$N,0))","v":{"$error":"#N/A"}},null,"Registered",null,"see below","Docs attached",null,"x (to say that you've attached docs for the student)",null,"PREN",{"$f":"INDEX('My Students'!$20:$28,MATCH($O$1,'My Students'!$B$20:$B$28,0),MATCH(N5,'My Students'!$20:$20,0))","v":{"$error":"#N/A"}}]
["PermPhone",{"$f":"INDEX($O:$O,MATCH(A6,$N:$N,0))","v":{"$error":"#N/A"}},null,"ACT Science",{"$f":"INDEX($O:$O,MATCH(\"ACTScienceScre\",$N:$N,0))","v":{"$error":"#N/A"}},null,"Attaching Scan",null,"x","Drop/Add info",null,"x (to give info on switching classes & steps to do so)",null,"1stGen",{"$f":"INDEX('My Students'!$20:$28,MATCH($O$1,'My Students'!$B$20:$B$28,0),MATCH(N6,'My Students'!$20:$20,0))","v":{"$error":"#N/A"}}]
["MailingPhone",{"$f":"INDEX($O:$O,MATCH(A7,$N:$N,0))","v":{"$error":"#N/A"}},null,"CustomsPOS",{"$f":"INDEX($O:$O,MATCH(D7,$N:$N,0))","v":{"$error":"#N/A"}},null,"Submitted COM",null,"x","Acad success tips",null,"x (to give acad tips, tutoring & SI websites, & \"ask for help\")",null,"ReverseTransfer",{"$f":"INDEX('My Students'!$20:$28,MATCH($O$1,'My Students'!$B$20:$B$28,0),MATCH(N7,'My Students'!$20:$20,0))","v":{"$error":"#N/A"}}]
[null,null,null,null,{"$f":"INDEX($O:$O,MATCH(\"Major\",$N:$N,0))","v":{"$error":"#N/A"}},null,"Supp Instructn",null,"x","NURS Info Session",null,"x (to refer student to nursing info webpage and session)",null,"FR/TR",{"$f":"INDEX('My Students'!$20:$28,MATCH($O$1,'My Students'!$B$20:$B$28,0),MATCH(N8,'My Students'!$20:$20,0))","v":{"$error":"#N/A"}}]
["Customs Info",null,null,"BannerPOS",{"$f":"INDEX($O:$O,MATCH(D9,$N:$N,0))","v":{"$error":"#N/A"}},null,"RTTP",null,"x","Check phone #",null,"x (to tell stu their listed ph #s are wrong, & how to fix)",null,"StudentName",{"$f":"INDEX('My Students'!$20:$28,MATCH($O$1,'My Students'!$B$20:$B$28,0),MATCH(N9,'My Students'!$20:$20,0))","v":{"$error":"#N/A"}}]
["CountrySlot",{"$f":"INDEX($O:$O,MATCH(A10,$N:$N,0))","v":{"$error":"#N/A"}},null,"Majors match?",{"$f":"IF(E7=E9,\"Y\",\"N, Submit change of major\")","v":{"$error":"#N/A"}},null,"Note 1",null,"x","Advisor info",{"$f":"INDEX('Data Lists'!$J:$J,MATCH($B$12,'Data Lists'!$H:$H,0))","v":{"$error":"#N/A"}},"(leave formula, or type \"me <email>\")",null,"Major",{"$f":"INDEX('My Students'!$20:$28,MATCH($O$1,'My Students'!$B$20:$B$28,0),MATCH(N10,'My Students'!$20:$20,0))","v":{"$error":"#N/A"}}]
["Order/Time",{"$f":"INDEX($O:$O,MATCH(A11,$N:$N,0))","v":{"$error":"#N/A"}},null,"Override major",null,null,"Other",null,"[notes]","Other",null,"[type any notes to student]",null,"Order/Time",{"$f":"INDEX('My Students'!$20:$28,MATCH($O$1,'My Students'!$B$20:$B$28,0),MATCH(N11,'My Students'!$20:$20,0))","v":{"$error":"#N/A"}}]
["Acad Advisor",{"$f":"INDEX($O:$O,MATCH(\"Assigned Advisor\",$N:$N,0))","v":{"$error":"#N/A"}},null,null,null,null,"Paste in advising report:",{"$f":"CONCATENATE(\"Student came for advising during Customs.\",IF(H6<>\"\",\"  Attaching scanned copy of notes.\",\"\"),IF(H5=\"a\",Messages!$C$2,IF(H5=\"b\",Messages!$C$3,IF(H5<>\"\",CONCATENATE(\"  Registered student for classes for upcoming semester: \",H5),\"\"))),IF(H11<>\"\",CONCATENATE(\"\n\n\",H11),\"\"),IF(H7<>\"\",\"\n\nSubmitted change of major form. \",\"\"),IF(H8<>\"\",Messages!$C$4,\"\"),IF(H9<>\"\",Messages!$C$5,\"\"),IF(H10<>\"\",Messages!$C$6,\"\"))","v":"Student came for advising during Customs."},null,"Paste in stu msg:",{"$f":"CONCATENATE(\"We enjoyed seeing you at the CBHS Advising Center Customs session today, \",$A$21,\"!  \",IF(K5=\"x\",\"I've attached your Registration Checklist, for your records.\",\"\"),IF(K11<>\"\",CONCATENATE(\"\n\n\",K11),\"\"),IF(K6=\"x\",CONCATENATE(Messages!$C$7&K10&\", before making changes.\"),\"\"),IF(K9=\"x\",Messages!$C$10,\"\"),IF(K7=\"x\",Messages!$C$8,\"\"),IF(K8<>\"\",Messages!$C$9,\"\"),CONCATENATE(\"\n\nIf you have any questions or concerns, please contact \"&K10&\".  You'll also want to plan to come in for an advising appointment around mid-terms each semester, to talk about your classes for the upcoming term.  You can find Instructions and Schedule links at mtsu.edu/cbhsadv. \"),\"\n\nWe look forward to seeing you at MTSU this semester!\n\n\",$B$2,\"\n\",$B$3)","v":{"$error":"#N/A"}},null,null,"PrescribedCrsMath",{"$f":"INDEX('My Students'!$20:$28,MATCH($O$1,'My Students'!$B$20:$B$28,0),MATCH(N12,'My Students'!$20:$20,0))","v":{"$error":"#N/A"}},{"$f":"IF(O12=\"college level\",\"n\",IF(O12=0,\"blank--check\",\"y\"))","v":{"$error":"#N/A"}}]
["Customs Advisor",{"$f":"INDEX($O:$O,MATCH(A13,$N:$N,0))","v":{"$error":"#N/A"}},null,"Factors in Choosing Classes",null,null,"\"Registered\" choices: \"a\" to get message re stu registering in lab, \"b\" to get message re helping stu register in office, or type list of classes to be inserted.",null,null,null,null,null,null,"PrescribedCrsWriting",{"$f":"INDEX('My Students'!$20:$28,MATCH($O$1,'My Students'!$B$20:$B$28,0),MATCH(N13,'My Students'!$20:$20,0))","v":{"$error":"#N/A"}},{"$f":"IF(O13=\"college level\",\"n\",IF(O13=0,\"blank--check\",\"y\"))","v":{"$error":"#N/A"}}]
[null,null,null,"Honors",{"$f":"INDEX($O:$O,MATCH(\"HonorsElig\",$N:$N,0))","v":{"$error":"#N/A"}},null,null,null,null,null,null,null,null,"PrescribedCrsReading",{"$f":"INDEX('My Students'!$20:$28,MATCH($O$1,'My Students'!$B$20:$B$28,0),MATCH(N14,'My Students'!$20:$20,0))","v":{"$error":"#N/A"}},{"$f":"IF(O14=\"college level\",\"n\",IF(O14=0,\"blank--check\",\"y\"))","v":{"$error":"#N/A"}}]
["Emily's Notes",{"$f":"INDEX($O:$O,MATCH(\"Notes\",$N:$N,0))","v":{"$error":"#N/A"}},null,"Prescribeds",{"$f":"IF(AND(P12=\"n\",P13=\"n\",P14=\"n\"),\"\",\nCONCATENATE(\"Ks: \"&IF(P12=\"y\",O12,\"\")&IF(P12=\"y\",\", \",\"\")&IF(P12=\"blank--check\",\"Math--check; \",\"\")&\nIF(P13=\"y\",\"ENGL\",\"\")&IF(P13=\"y\",\", \",\"\")&IF(P13=\"blank--check\",\"Engl--check; \",\"\")&\nIF(P14=\"y\",\"READ\",\"\")&IF(T14=\"y\",\", \",\"\")&IF(P14=\"blank--check\",\"Read--check; \",\"\")&\nIF(P15=\"y\",\"U1010\",\"\")))","v":{"$error":"#N/A"}},null,"This is what it will say:",null,null,"This is what it will say:",null,null,null,"PrescribedCrsStudySkills",{"$f":"INDEX('My Students'!$20:$28,MATCH($O$1,'My Students'!$B$20:$B$28,0),MATCH(N15,'My Students'!$20:$20,0))","v":{"$error":"#N/A"}},{"$f":"IF((P12<>\"n\")+(P13=\"y\")+(P14=\"y\")>=2,\"y\",\"n\")","v":{"$error":"#N/A"}}]
[null,null,null,null,null,null,{"$f":"H12","v":"Student came for advising during Customs."},null,null,{"$f":"K12","v":{"$error":"#N/A"}},null,null,null,"HonorsElig",{"$f":"INDEX('My Students'!$20:$28,MATCH($O$1,'My Students'!$B$20:$B$28,0),MATCH(N16,'My Students'!$20:$20,0))","v":{"$error":"#N/A"}}]
[null,null,null,"Scholars Acad",{"$f":"INDEX($O:$O,MATCH(\"Sacad\",$N:$N,0))","v":{"$error":"#N/A"}},null,null,null,null,null,null,null,null,"ACTEngl",{"$f":"INDEX('My Students'!$20:$28,MATCH($O$1,'My Students'!$B$20:$B$28,0),MATCH(N17,'My Students'!$20:$20,0))","v":{"$error":"#N/A"}}]
[null,null,null,"Pre-Nursing",{"$f":"INDEX($O:$O,MATCH(\"PREN\",$N:$N,0))","v":{"$error":"#N/A"}},null,null,null,null,null,null,null,null,"HighSchoolGPA",{"$f":"INDEX('My Students'!$20:$28,MATCH($O$1,'My Students'!$B$20:$B$28,0),MATCH(N18,'My Students'!$20:$20,0))","v":{"$error":"#N/A"}}]
["Copy-Pastes & Folder Links",null,null,"ACTEngl",{"$f":"INDEX($O:$O,MATCH(\"ACTEngl\",$N:$N,0))","v":{"$error":"#N/A"}},null,null,null,null,null,null,null,null,"ACTCompositeScore",{"$f":"INDEX('My Students'!$20:$28,MATCH($O$1,'My Students'!$B$20:$B$28,0),MATCH(N19,'My Students'!$20:$20,0))","v":{"$error":"#N/A"}}]
[{"$f":"INDEX(O:O,MATCH(\"StudentName\",N:N,0))","v":{"$error":"#N/A"}},{"$f":"O1","v":0},null,null,null,null,null,null,null,null,null,null,null,"InclusiveGPA",{"$f":"INDEX('My Students'!$20:$28,MATCH($O$1,'My Students'!$B$20:$B$28,0),MATCH(N20,'My Students'!$20:$20,0))","v":{"$error":"#N/A"}}]
[{"$f":"IFERROR(MID(A20,SEARCH(\" \",A20,1)+1,SEARCH(\" \",A20,SEARCH(\" \",A20,1)+1)-SEARCH(\" \",A20,1)-1),MID(A20,FIND(\" \",A20)+1,256))","v":{"$error":"#N/A"}},{"$f":"CONCATENATE(LEFT(A20,FIND(\", \",A20,1)-1))","v":{"$error":"#N/A"}},null,"Flags",null,null,null,null,null,null,null,null,null,"HrsEarned",{"$f":"INDEX('My Students'!$20:$28,MATCH($O$1,'My Students'!$B$20:$B$28,0),MATCH(N21,'My Students'!$20:$20,0))","v":{"$error":"#N/A"}}]
["Major name",{"$f":"IF(E11=\"\",INDEX('Data Lists'!B:B,MATCH(E7,'Data Lists'!A:A,0)),INDEX('Data Lists'!B:B,MATCH(E11,'Data Lists'!B:B,0)))","v":{"$error":"#N/A"}},null,"Holds",{"$f":"INDEX($O:$O,MATCH(D22,$N:$N,0))","v":{"$error":"#N/A"}},null,null,null,null,null,null,null,null,"CountrySlot",{"$f":"INDEX('My Students'!$20:$28,MATCH($O$1,'My Students'!$B$20:$B$28,0),MATCH(N22,'My Students'!$20:$20,0))","v":{"$error":"#N/A"}}]
["Folder name",{"$f":"IF(E11=\"\",CONCATENATE(INDEX('Data Lists'!E:E,MATCH(E7,'Data Lists'!A:A,0)),\" \",B21,\", \",A21,\" \",B3),CONCATENATE(INDEX('Data Lists'!E:E,MATCH(E11,'Data Lists'!B:B,0)),\" \",B21,\", \",A21,\" \",B3))","v":{"$error":"#N/A"}},null,"Reg Restrictions",{"$f":"INDEX($O:$O,MATCH(\"RegistrationRestrictions\",$N:$N,0))","v":{"$error":"#N/A"}},null,null,null,null,null,null,null,null,"CUSTOMSGrp",{"$f":"INDEX('My Students'!$20:$28,MATCH($O$1,'My Students'!$B$20:$B$28,0),MATCH(N23,'My Students'!$20:$20,0))","v":{"$error":"#N/A"}}]
["Dept folders",{"$f":"HYPERLINK(CONCATENATE(\"Z:\\CoBHS Advising\\Departments\\\",IF(E12=\"\",INDEX('Data Lists'!D:D,MATCH(E8,'Data Lists'!A:A,0)),INDEX('Data Lists'!D:D,MATCH(E12,'Data Lists'!B:B,0))),\"\\Student Forms\\\"))","v":{"$error":"#N/A"}},null,"Immunizations",{"$f":"INDEX($O:$O,MATCH(\"RegistrationRestrictions\",$N:$N,0))","v":{"$error":"#N/A"}},null,null,null,null,null,null,null,null,"CustomsPOS",{"$f":"INDEX('My Students'!$20:$28,MATCH($O$1,'My Students'!$B$20:$B$28,0),MATCH(N24,'My Students'!$20:$20,0))","v":{"$error":"#N/A"}}]
["Stu folder",{"$f":"HYPERLINK(CONCATENATE(\"Z:\\CoBHS Advising\\Departments\\\",IF(E12=\"\",INDEX('Data Lists'!D:D,MATCH(E8,'Data Lists'!A:A,0)),INDEX('Data Lists'!D:D,MATCH(E12,'Data Lists'!B:B,0))),\"\\Student Forms\\\",B23))","v":{"$error":"#N/A"}},{"$f":"YEARFRAC(O33,NOW())","v":{"$error":"#N/A"}},"Under 18 & Imm",{"$f":"IF(C25>=18,\"OK--over 18\",\"If need imms, will need parent sig\")","v":{"$error":"#N/A"}},null,null,null,null,null,null,null,null,"BannerPOS",{"$f":"INDEX('My Students'!$20:$28,MATCH($O$1,'My Students'!$B$20:$B$28,0),MATCH(N25,'My Students'!$20:$20,0))","v":{"$error":"#N/A"}}]
[null,null,null,"Missing Items",{"$f":"INDEX($O:$O,MATCH(\"MissingChecklistItems\",$N:$N,0))","v":{"$error":"#N/A"}},null,null,null,null,null,null,null,null,"Assigned Advisor",{"$f":"INDEX('My Students'!$20:$28,MATCH($O$1,'My Students'!$B$20:$B$28,0),MATCH(N26,'My Students'!$20:$20,0))","v":{"$error":"#N/A"}}]
[null,null,null,"Term",{"$f":"INDEX($O:$O,MATCH(\"TermDesc\",$N:$N,0))","v":{"$error":"#N/A"}},null,null,null,null,null,null,null,null,"Customs Advisor",{"$f":"INDEX('My Students'!$20:$28,MATCH($O$1,'My Students'!$B$20:$B$28,0),MATCH(N27,'My Students'!$20:$20,0))","v":{"$error":"#N/A"}}]
[null,null,null,"Might need BUAF",{"$f":"INDEX($O:$O,MATCH(\"VetOrDep\",$N:$N,0))","v":{"$error":"#N/A"}},null,null,null,null,null,null,null,null,"Holds",{"$f":"INDEX('My Students'!$20:$28,MATCH($O$1,'My Students'!$B$20:$B$28,0),MATCH(N28,'My Students'!$20:$20,0))","v":{"$error":"#N/A"}}]
[null,null,null,"Reverse Transfer",{"$f":"INDEX($O:$O,MATCH(\"ReverseTransfer\",$N:$N,0))","v":{"$error":"#N/A"}},null,null,null,null,null,null,null,null,"RegistrationRestrictions",{"$f":"INDEX('My Students'!$20:$28,MATCH($O$1,'My Students'!$B$20:$B$28,0),MATCH(N29,'My Students'!$20:$20,0))","v":{"$error":"#N/A"}}]
[null,null,null,"First Generation",{"$f":"INDEX($O:$O,MATCH(\"1stGen\",$N:$N,0))","v":{"$error":"#N/A"}},null,null,null,null,null,null,null,null,"MissingChecklistItems",{"$f":"INDEX('My Students'!$20:$28,MATCH($O$1,'My Students'!$B$20:$B$28,0),MATCH(N30,'My Students'!$20:$20,0))","v":{"$error":"#N/A"}}]
[null,null,null,null,null,null,null,null,null,null,null,null,null,"AdmissionDecision",{"$f":"INDEX('My Students'!$20:$28,MATCH($O$1,'My Students'!$B$20:$B$28,0),MATCH(N31,'My Students'!$20:$20,0))","v":{"$error":"#N/A"}}]
["Want to add a link to the student's folder? ",null,null,null,null,null,null,null,null,null,null,null,null,"TermDesc",{"$f":"INDEX('My Students'!$20:$28,MATCH($O$1,'My Students'!$B$20:$B$28,0),MATCH(N32,'My Students'!$20:$20,0))","v":{"$error":"#N/A"}}]
["--Click on the \"Stu folder\" field above (B21).",null,null,null,null,null,null,null,null,null,null,null,null,"DateofBirth",{"$f":"INDEX('My Students'!$20:$28,MATCH($O$1,'My Students'!$B$20:$B$28,0),MATCH(N33,'My Students'!$20:$20,0))","v":{"$error":"#N/A"}}]
["--Control-K to start the process of creating a link.",null,null,null,null,null,null,null,null,null,null,null,null,"Notes",{"$f":"INDEX('My Students'!$20:$28,MATCH($O$1,'My Students'!$B$20:$B$28,0),MATCH(N34,'My Students'!$20:$20,0))","v":{"$error":"#N/A"}}]
["--Browse to the student's folder.",null,null,null,null,null,null,null,null,null,null,null,null,"MTSUEmail",{"$f":"INDEX('My Students'!$20:$28,MATCH($O$1,'My Students'!$B$20:$B$28,0),MATCH(N35,'My Students'!$20:$20,0))","v":{"$error":"#N/A"}}]
["--Choose any file in the folder and double-click on it.",null,null,null,null,null,null,null,null,null,null,null,null,"PersonalEmail",{"$f":"INDEX('My Students'!$20:$28,MATCH($O$1,'My Students'!$B$20:$B$28,0),MATCH(N36,'My Students'!$20:$20,0))","v":{"$error":"#N/A"}}]
["--In the Address box, delete the file name (back to the \\ after the folder name).",null,null,null,null,null,null,null,null,null,null,null,null,"PermPhone",{"$f":"INDEX('My Students'!$20:$28,MATCH($O$1,'My Students'!$B$20:$B$28,0),MATCH(N37,'My Students'!$20:$20,0))","v":{"$error":"#N/A"}}]
["--Click OK.",null,null,null,null,null,null,null,null,null,null,null,null,"MailingPhone",{"$f":"INDEX('My Students'!$20:$28,MATCH($O$1,'My Students'!$B$20:$B$28,0),MATCH(N38,'My Students'!$20:$20,0))","v":{"$error":"#N/A"}}]
["--Now you should see the path to the folder, underlined as a link.",null,null,null,null,null,null,null,null,null,null,null,null,"NursElig",{"$f":"INDEX('My Students'!$20:$28,MATCH($O$1,'My Students'!$B$20:$B$28,0),MATCH(N39,'My Students'!$20:$20,0))","v":{"$error":"#N/A"}}]
["--When you click on your link, the folder should open in a separate window.",null,null,null,null,null,null,null,null,null,null,null,null,"ACTMathScre",{"$f":"INDEX('My Students'!$20:$28,MATCH($O$1,'My Students'!$B$20:$B$28,0),MATCH(N40,'My Students'!$20:$20,0))","v":{"$error":"#N/A"}}]
[null,null,null,null,null,null,null,null,null,null,null,null,null,"ACTScienceScre",{"$f":"INDEX('My Students'!$20:$28,MATCH($O$1,'My Students'!$B$20:$B$28,0),MATCH(N41,'My Students'!$20:$20,0))","v":{"$error":"#N/A"}}]
[null,null,null,null,null,null,null,null,null,null,null,null,null,"A&P?",{"$f":"IF(O1<>\"\",IF(OR(AND(O40=21,O41>21),AND(O40>21,O41=21)),\"maybe\",IF(AND(O31>=21,O41>=21),\"Y\",\"N\")),\"\")","v":{"$error":"#N/A"}}]
[null,null,null,null,null,null,null,null,null,null,null,null,null,"Major",{"$f":"INDEX('Data Lists'!B:B,MATCH(O24,'Data Lists'!A:A,0))","v":{"$error":"#N/A"}}]
[null,null,null,null,null,null,null,null,null,null,null,null,null,"NameM#",{"$f":"CONCATENATE(O47,\", \",O46,\" \",O45)","v":{"$error":"#N/A"}}]
[null,null,null,null,null,null,null,null,null,null,null,null,null,"M# copy",{"$f":"O1","v":0}]
[null,null,null,null,null,null,null,null,null,null,null,null,null,"Fname",{"$f":"IF(1<>\"\",IFERROR(MID(O9,SEARCH(\" \",O9,1)+1,SEARCH(\" \",O9,SEARCH(\" \",O9,1)+1)-SEARCH(\" \",O9,1)-1),MID(O9,FIND(\" \",O9)+1,256)),\"\")","v":{"$error":"#N/A"}}]
[null,null,null,null,null,null,null,null,null,null,null,null,null,"Lname",{"$f":"IF(O1<>\"\",CONCATENATE(LEFT(O9,FIND(\", \",O9,1)-1)),\"\")","v":{"$error":"#N/A"}}]

{"sheet":"H","index":30,"n_rows":47,"n_cols":16,"rows_kept":47,"cut":false,"hidden":false,"merged":[[15,6,39,7],[15,9,39,10],[14,3,15,3],[14,4,15,4],[14,0,15,0],[14,1,15,1]]}
["Contact & Demographic Info",null,null,"Academic Info",null,null,"Start",null,null,"Change major",null,null,null,"M#",{"$f":"'My Students'!B28","v":0}]
["Name",{"$f":"CONCATENATE(A21,\" \",B21)","v":{"$error":"#N/A"}},null,"Transferred hours",{"$f":"INDEX($O:$O,MATCH(\"HrsEarned\",$N:$N,0))","v":{"$error":"#N/A"}},null,"Stop",null,null,"Notes for advisor",null,null,null,"Deleted",{"$f":"INDEX('My Students'!$20:$28,MATCH($O$1,'My Students'!$B$20:$B$28,0),MATCH(N2,'My Students'!$20:$20,0))","v":{"$error":"#N/A"}}]
["M#",{"$f":"O1","v":0},null,"HS GPA",{"$f":"INDEX($O:$O,MATCH(\"HighSchoolGPA\",$N:$N,0))","v":{"$error":"#N/A"}},null,null,null,null,null,null,null,null,"SAcad",{"$f":"INDEX('My Students'!$20:$28,MATCH($O$1,'My Students'!$B$20:$B$28,0),MATCH(N3,'My Students'!$20:$20,0))","v":{"$error":"#N/A"}}]
["MTSUEmail",{"$f":"INDEX($O:$O,MATCH(A4,$N:$N,0))","v":{"$error":"#N/A"}},null,"Inclusive GPA",{"$f":"INDEX($O:$O,MATCH(\"InclusiveGPA\",$N:$N,0))","v":{"$error":"#N/A"}},null,null,"Report Builder",null,null,"Student Message Builder",null,null,"VetOrDep",{"$f":"INDEX('My Students'!$20:$28,MATCH($O$1,'My Students'!$B$20:$B$28,0),MATCH(N4,'My Students'!$20:$20,0))","v":{"$error":"#N/A"}}]
["PersonalEmail",{"$f":"INDEX($O:$O,MATCH(A5,$N:$N,0))","v":{"$error":"#N/A"}},null,"ACT Math",{"$f":"INDEX($O:$O,MATCH(\"ACTMathScre\",$N:$N,0))","v":{"$error":"#N/A"}},null,"Registered",null,"see below","Docs attached",null,"x (to say that you've attached docs for the student)",null,"PREN",{"$f":"INDEX('My Students'!$20:$28,MATCH($O$1,'My Students'!$B$20:$B$28,0),MATCH(N5,'My Students'!$20:$20,0))","v":{"$error":"#N/A"}}]
["PermPhone",{"$f":"INDEX($O:$O,MATCH(A6,$N:$N,0))","v":{"$error":"#N/A"}},null,"ACT Science",{"$f":"INDEX($O:$O,MATCH(\"ACTScienceScre\",$N:$N,0))","v":{"$error":"#N/A"}},null,"Attaching Scan",null,"x","Drop/Add info",null,"x (to give info on switching classes & steps to do so)",null,"1stGen",{"$f":"INDEX('My Students'!$20:$28,MATCH($O$1,'My Students'!$B$20:$B$28,0),MATCH(N6,'My Students'!$20:$20,0))","v":{"$error":"#N/A"}}]
["MailingPhone",{"$f":"INDEX($O:$O,MATCH(A7,$N:$N,0))","v":{"$error":"#N/A"}},null,"CustomsPOS",{"$f":"INDEX($O:$O,MATCH(D7,$N:$N,0))","v":{"$error":"#N/A"}},null,"Submitted COM",null,"x","Acad success tips",null,"x (to give acad tips, tutoring & SI websites, & \"ask for help\")",null,"ReverseTransfer",{"$f":"INDEX('My Students'!$20:$28,MATCH($O$1,'My Students'!$B$20:$B$28,0),MATCH(N7,'My Students'!$20:$20,0))","v":{"$error":"#N/A"}}]
[null,null,null,null,{"$f":"INDEX($O:$O,MATCH(\"Major\",$N:$N,0))","v":{"$error":"#N/A"}},null,"Supp Instructn",null,"x","NURS Info Session",null,"x (to refer student to nursing info webpage and session)",null,"FR/TR",{"$f":"INDEX('My Students'!$20:$28,MATCH($O$1,'My Students'!$B$20:$B$28,0),MATCH(N8,'My Students'!$20:$20,0))","v":{"$error":"#N/A"}}]
["Customs Info",null,null,"BannerPOS",{"$f":"INDEX($O:$O,MATCH(D9,$N:$N,0))","v":{"$error":"#N/A"}},null,"RTTP",null,"x","Check phone #",null,"x (to tell stu their listed ph #s are wrong, & how to fix)",null,"StudentName",{"$f":"INDEX('My Students'!$20:$28,MATCH($O$1,'My Students'!$B$20:$B$28,0),MATCH(N9,'My Students'!$20:$20,0))","v":{"$error":"#N/A"}}]
["CountrySlot",{"$f":"INDEX($O:$O,MATCH(A10,$N:$N,0))","v":{"$error":"#N/A"}},null,"Majors match?",{"$f":"IF(E7=E9,\"Y\",\"N, Submit change of major\")","v":{"$error":"#N/A"}},null,"Note 1",null,"x","Advisor info",{"$f":"INDEX('Data Lists'!$J:$J,MATCH($B$12,'Data Lists'!$H:$H,0))","v":{"$error":"#N/A"}},"(leave formula, or type \"me <email>\")",null,"Major",{"$f":"INDEX('My Students'!$20:$28,MATCH($O$1,'My Students'!$B$20:$B$28,0),MATCH(N10,'My Students'!$20:$20,0))","v":{"$error":"#N/A"}}]
["Order/Time",{"$f":"INDEX($O:$O,MATCH(A11,$N:$N,0))","v":{"$error":"#N/A"}},null,"Override major",null,null,"Other",null,"[notes]","Other",null,"[type any notes to student]",null,"Order/Time",{"$f":"INDEX('My Students'!$20:$28,MATCH($O$1,'My Students'!$B$20:$B$28,0),MATCH(N11,'My Students'!$20:$20,0))","v":{"$error":"#N/A"}}]
["Acad Advisor",{"$f":"INDEX($O:$O,MATCH(\"Assigned Advisor\",$N:$N,0))","v":{"$error":"#N/A"}},null,null,null,null,"Paste in advising report:",{"$f":"CONCATENATE(\"Student came for advising during Customs.\",IF(H6<>\"\",\"  Attaching scanned copy of notes.\",\"\"),IF(H5=\"a\",Messages!$C$2,IF(H5=\"b\",Messages!$C$3,IF(H5<>\"\",CONCATENATE(\"  Registered student for classes for upcoming semester: \",H5),\"\"))),IF(H11<>\"\",CONCATENATE(\"\n\n\",H11),\"\"),IF(H7<>\"\",\"\n\nSubmitted change of major form. \",\"\"),IF(H8<>\"\",Messages!$C$4,\"\"),IF(H9<>\"\",Messages!$C$5,\"\"),IF(H10<>\"\",Messages!$C$6,\"\"))","v":"Student came for advising during Customs."},null,"Paste in stu msg:",{"$f":"CONCATENATE(\"We enjoyed seeing you at the CBHS Advising Center Customs session today, \",$A$21,\"!  \",IF(K5=\"x\",\"I've attached your Registration Checklist, for your records.\",\"\"),IF(K11<>\"\",CONCATENATE(\"\n\n\",K11),\"\"),IF(K6=\"x\",CONCATENATE(Messages!$C$7&K10&\", before making changes.\"),\"\"),IF(K9=\"x\",Messages!$C$10,\"\"),IF(K7=\"x\",Messages!$C$8,\"\"),IF(K8<>\"\",Messages!$C$9,\"\"),CONCATENATE(\"\n\nIf you have any questions or concerns, please contact \"&K10&\".  You'll also want to plan to come in for an advising appointment around mid-terms each semester, to talk about your classes for the upcoming term.  You can find Instructions and Schedule links at mtsu.edu/cbhsadv. \"),\"\n\nWe look forward to seeing you at MTSU this semester!\n\n\",$B$2,\"\n\",$B$3)","v":{"$error":"#N/A"}},null,null,"PrescribedCrsMath",{"$f":"INDEX('My Students'!$20:$28,MATCH($O$1,'My Students'!$B$20:$B$28,0),MATCH(N12,'My Students'!$20:$20,0))","v":{"$error":"#N/A"}},{"$f":"IF(O12=\"college level\",\"n\",IF(O12=0,\"blank--check\",\"y\"))","v":{"$error":"#N/A"}}]
["Customs Advisor",{"$f":"INDEX($O:$O,MATCH(A13,$N:$N,0))","v":{"$error":"#N/A"}},null,"Factors in Choosing Classes",null,null,"\"Registered\" choices: \"a\" to get message re stu registering in lab, \"b\" to get message re helping stu register in office, or type list of classes to be inserted.",null,null,null,null,null,null,"PrescribedCrsWriting",{"$f":"INDEX('My Students'!$20:$28,MATCH($O$1,'My Students'!$B$20:$B$28,0),MATCH(N13,'My Students'!$20:$20,0))","v":{"$error":"#N/A"}},{"$f":"IF(O13=\"college level\",\"n\",IF(O13=0,\"blank--check\",\"y\"))","v":{"$error":"#N/A"}}]
[null,null,null,"Honors",{"$f":"INDEX($O:$O,MATCH(\"HonorsElig\",$N:$N,0))","v":{"$error":"#N/A"}},null,null,null,null,null,null,null,null,"PrescribedCrsReading",{"$f":"INDEX('My Students'!$20:$28,MATCH($O$1,'My Students'!$B$20:$B$28,0),MATCH(N14,'My Students'!$20:$20,0))","v":{"$error":"#N/A"}},{"$f":"IF(O14=\"college level\",\"n\",IF(O14=0,\"blank--check\",\"y\"))","v":{"$error":"#N/A"}}]
["Emily's Notes",{"$f":"INDEX($O:$O,MATCH(\"Notes\",$N:$N,0))","v":{"$error":"#N/A"}},null,"Prescribeds",{"$f":"IF(AND(P12=\"n\",P13=\"n\",P14=\"n\"),\"\",\nCONCATENATE(\"Ks: \"&IF(P12=\"y\",O12,\"\")&IF(P12=\"y\",\", \",\"\")&IF(P12=\"blank--check\",\"Math--check; \",\"\")&\nIF(P13=\"y\",\"ENGL\",\"\")&IF(P13=\"y\",\", \",\"\")&IF(P13=\"blank--check\",\"Engl--check; \",\"\")&\nIF(P14=\"y\",\"READ\",\"\")&IF(T14=\"y\",\", \",\"\")&IF(P14=\"blank--check\",\"Read--check; \",\"\")&\nIF(P15=\"y\",\"U1010\",\"\")))","v":{"$error":"#N/A"}},null,"This is what it will say:",null,null,"This is what it will say:",null,null,null,"PrescribedCrsStudySkills",{"$f":"INDEX('My Students'!$20:$28,MATCH($O$1,'My Students'!$B$20:$B$28,0),MATCH(N15,'My Students'!$20:$20,0))","v":{"$error":"#N/A"}},{"$f":"IF((P12<>\"n\")+(P13=\"y\")+(P14=\"y\")>=2,\"y\",\"n\")","v":{"$error":"#N/A"}}]
[null,null,null,null,null,null,{"$f":"H12","v":"Student came for advising during Customs."},null,null,{"$f":"K12","v":{"$error":"#N/A"}},null,null,null,"HonorsElig",{"$f":"INDEX('My Students'!$20:$28,MATCH($O$1,'My Students'!$B$20:$B$28,0),MATCH(N16,'My Students'!$20:$20,0))","v":{"$error":"#N/A"}}]
[null,null,null,"Scholars Acad",{"$f":"INDEX($O:$O,MATCH(\"Sacad\",$N:$N,0))","v":{"$error":"#N/A"}},null,null,null,null,null,null,null,null,"ACTEngl",{"$f":"INDEX('My Students'!$20:$28,MATCH($O$1,'My Students'!$B$20:$B$28,0),MATCH(N17,'My Students'!$20:$20,0))","v":{"$error":"#N/A"}}]
[null,null,null,"Pre-Nursing",{"$f":"INDEX($O:$O,MATCH(\"PREN\",$N:$N,0))","v":{"$error":"#N/A"}},null,null,null,null,null,null,null,null,"HighSchoolGPA",{"$f":"INDEX('My Students'!$20:$28,MATCH($O$1,'My Students'!$B$20:$B$28,0),MATCH(N18,'My Students'!$20:$20,0))","v":{"$error":"#N/A"}}]
["Copy-Pastes & Folder Links",null,null,"ACTEngl",{"$f":"INDEX($O:$O,MATCH(\"ACTEngl\",$N:$N,0))","v":{"$error":"#N/A"}},null,null,null,null,null,null,null,null,"ACTCompositeScore",{"$f":"INDEX('My Students'!$20:$28,MATCH($O$1,'My Students'!$B$20:$B$28,0),MATCH(N19,'My Students'!$20:$20,0))","v":{"$error":"#N/A"}}]
[{"$f":"INDEX(O:O,MATCH(\"StudentName\",N:N,0))","v":{"$error":"#N/A"}},{"$f":"O1","v":0},null,null,null,null,null,null,null,null,null,null,null,"InclusiveGPA",{"$f":"INDEX('My Students'!$20:$28,MATCH($O$1,'My Students'!$B$20:$B$28,0),MATCH(N20,'My Students'!$20:$20,0))","v":{"$error":"#N/A"}}]
[{"$f":"IFERROR(MID(A20,SEARCH(\" \",A20,1)+1,SEARCH(\" \",A20,SEARCH(\" \",A20,1)+1)-SEARCH(\" \",A20,1)-1),MID(A20,FIND(\" \",A20)+1,256))","v":{"$error":"#N/A"}},{"$f":"CONCATENATE(LEFT(A20,FIND(\", \",A20,1)-1))","v":{"$error":"#N/A"}},null,"Flags",null,null,null,null,null,null,null,null,null,"HrsEarned",{"$f":"INDEX('My Students'!$20:$28,MATCH($O$1,'My Students'!$B$20:$B$28,0),MATCH(N21,'My Students'!$20:$20,0))","v":{"$error":"#N/A"}}]
["Major name",{"$f":"IF(E11=\"\",INDEX('Data Lists'!B:B,MATCH(E7,'Data Lists'!A:A,0)),INDEX('Data Lists'!B:B,MATCH(E11,'Data Lists'!B:B,0)))","v":{"$error":"#N/A"}},null,"Holds",{"$f":"INDEX($O:$O,MATCH(D22,$N:$N,0))","v":{"$error":"#N/A"}},null,null,null,null,null,null,null,null,"CountrySlot",{"$f":"INDEX('My Students'!$20:$28,MATCH($O$1,'My Students'!$B$20:$B$28,0),MATCH(N22,'My Students'!$20:$20,0))","v":{"$error":"#N/A"}}]
["Folder name",{"$f":"IF(E11=\"\",CONCATENATE(INDEX('Data Lists'!E:E,MATCH(E7,'Data Lists'!A:A,0)),\" \",B21,\", \",A21,\" \",B3),CONCATENATE(INDEX('Data Lists'!E:E,MATCH(E11,'Data Lists'!B:B,0)),\" \",B21,\", \",A21,\" \",B3))","v":{"$error":"#N/A"}},null,"Reg Restrictions",{"$f":"INDEX($O:$O,MATCH(\"RegistrationRestrictions\",$N:$N,0))","v":{"$error":"#N/A"}},null,null,null,null,null,null,null,null,"CUSTOMSGrp",{"$f":"INDEX('My Students'!$20:$28,MATCH($O$1,'My Students'!$B$20:$B$28,0),MATCH(N23,'My Students'!$20:$20,0))","v":{"$error":"#N/A"}}]
["Dept folders",{"$f":"HYPERLINK(CONCATENATE(\"Z:\\CoBHS Advising\\Departments\\\",IF(E12=\"\",INDEX('Data Lists'!D:D,MATCH(E8,'Data Lists'!A:A,0)),INDEX('Data Lists'!D:D,MATCH(E12,'Data Lists'!B:B,0))),\"\\Student Forms\\\"))","v":{"$error":"#N/A"}},null,"Immunizations",{"$f":"INDEX($O:$O,MATCH(\"RegistrationRestrictions\",$N:$N,0))","v":{"$error":"#N/A"}},null,null,null,null,null,null,null,null,"CustomsPOS",{"$f":"INDEX('My Students'!$20:$28,MATCH($O$1,'My Students'!$B$20:$B$28,0),MATCH(N24,'My Students'!$20:$20,0))","v":{"$error":"#N/A"}}]
["Stu folder",{"$f":"HYPERLINK(CONCATENATE(\"Z:\\CoBHS Advising\\Departments\\\",IF(E12=\"\",INDEX('Data Lists'!D:D,MATCH(E8,'Data Lists'!A:A,0)),INDEX('Data Lists'!D:D,MATCH(E12,'Data Lists'!B:B,0))),\"\\Student Forms\\\",B23))","v":{"$error":"#N/A"}},{"$f":"YEARFRAC(O33,NOW())","v":{"$error":"#N/A"}},"Under 18 & Imm",{"$f":"IF(C25>=18,\"OK--over 18\",\"If need imms, will need parent sig\")","v":{"$error":"#N/A"}},null,null,null,null,null,null,null,null,"BannerPOS",{"$f":"INDEX('My Students'!$20:$28,MATCH($O$1,'My Students'!$B$20:$B$28,0),MATCH(N25,'My Students'!$20:$20,0))","v":{"$error":"#N/A"}}]
[null,null,null,"Missing Items",{"$f":"INDEX($O:$O,MATCH(\"MissingChecklistItems\",$N:$N,0))","v":{"$error":"#N/A"}},null,null,null,null,null,null,null,null,"Assigned Advisor",{"$f":"INDEX('My Students'!$20:$28,MATCH($O$1,'My Students'!$B$20:$B$28,0),MATCH(N26,'My Students'!$20:$20,0))","v":{"$error":"#N/A"}}]
[null,null,null,"Term",{"$f":"INDEX($O:$O,MATCH(\"TermDesc\",$N:$N,0))","v":{"$error":"#N/A"}},null,null,null,null,null,null,null,null,"Customs Advisor",{"$f":"INDEX('My Students'!$20:$28,MATCH($O$1,'My Students'!$B$20:$B$28,0),MATCH(N27,'My Students'!$20:$20,0))","v":{"$error":"#N/A"}}]
[null,null,null,"Might need BUAF",{"$f":"INDEX($O:$O,MATCH(\"VetOrDep\",$N:$N,0))","v":{"$error":"#N/A"}},null,null,null,null,null,null,null,null,"Holds",{"$f":"INDEX('My Students'!$20:$28,MATCH($O$1,'My Students'!$B$20:$B$28,0),MATCH(N28,'My Students'!$20:$20,0))","v":{"$error":"#N/A"}}]
[null,null,null,"Reverse Transfer",{"$f":"INDEX($O:$O,MATCH(\"ReverseTransfer\",$N:$N,0))","v":{"$error":"#N/A"}},null,null,null,null,null,null,null,null,"RegistrationRestrictions",{"$f":"INDEX('My Students'!$20:$28,MATCH($O$1,'My Students'!$B$20:$B$28,0),MATCH(N29,'My Students'!$20:$20,0))","v":{"$error":"#N/A"}}]
[null,null,null,"First Generation",{"$f":"INDEX($O:$O,MATCH(\"1stGen\",$N:$N,0))","v":{"$error":"#N/A"}},null,null,null,null,null,null,null,null,"MissingChecklistItems",{"$f":"INDEX('My Students'!$20:$28,MATCH($O$1,'My Students'!$B$20:$B$28,0),MATCH(N30,'My Students'!$20:$20,0))","v":{"$error":"#N/A"}}]
[null,null,null,null,null,null,null,null,null,null,null,null,null,"AdmissionDecision",{"$f":"INDEX('My Students'!$20:$28,MATCH($O$1,'My Students'!$B$20:$B$28,0),MATCH(N31,'My Students'!$20:$20,0))","v":{"$error":"#N/A"}}]
["Want to add a link to the student's folder? ",null,null,null,null,null,null,null,null,null,null,null,null,"TermDesc",{"$f":"INDEX('My Students'!$20:$28,MATCH($O$1,'My Students'!$B$20:$B$28,0),MATCH(N32,'My Students'!$20:$20,0))","v":{"$error":"#N/A"}}]
["--Click on the \"Stu folder\" field above (B21).",null,null,null,null,null,null,null,null,null,null,null,null,"DateofBirth",{"$f":"INDEX('My Students'!$20:$28,MATCH($O$1,'My Students'!$B$20:$B$28,0),MATCH(N33,'My Students'!$20:$20,0))","v":{"$error":"#N/A"}}]
["--Control-K to start the process of creating a link.",null,null,null,null,null,null,null,null,null,null,null,null,"Notes",{"$f":"INDEX('My Students'!$20:$28,MATCH($O$1,'My Students'!$B$20:$B$28,0),MATCH(N34,'My Students'!$20:$20,0))","v":{"$error":"#N/A"}}]
["--Browse to the student's folder.",null,null,null,null,null,null,null,null,null,null,null,null,"MTSUEmail",{"$f":"INDEX('My Students'!$20:$28,MATCH($O$1,'My Students'!$B$20:$B$28,0),MATCH(N35,'My Students'!$20:$20,0))","v":{"$error":"#N/A"}}]
["--Choose any file in the folder and double-click on it.",null,null,null,null,null,null,null,null,null,null,null,null,"PersonalEmail",{"$f":"INDEX('My Students'!$20:$28,MATCH($O$1,'My Students'!$B$20:$B$28,0),MATCH(N36,'My Students'!$20:$20,0))","v":{"$error":"#N/A"}}]
["--In the Address box, delete the file name (back to the \\ after the folder name).",null,null,null,null,null,null,null,null,null,null,null,null,"PermPhone",{"$f":"INDEX('My Students'!$20:$28,MATCH($O$1,'My Students'!$B$20:$B$28,0),MATCH(N37,'My Students'!$20:$20,0))","v":{"$error":"#N/A"}}]
["--Click OK.",null,null,null,null,null,null,null,null,null,null,null,null,"MailingPhone",{"$f":"INDEX('My Students'!$20:$28,MATCH($O$1,'My Students'!$B$20:$B$28,0),MATCH(N38,'My Students'!$20:$20,0))","v":{"$error":"#N/A"}}]
["--Now you should see the path to the folder, underlined as a link.",null,null,null,null,null,null,null,null,null,null,null,null,"NursElig",{"$f":"INDEX('My Students'!$20:$28,MATCH($O$1,'My Students'!$B$20:$B$28,0),MATCH(N39,'My Students'!$20:$20,0))","v":{"$error":"#N/A"}}]
["--When you click on your link, the folder should open in a separate window.",null,null,null,null,null,null,null,null,null,null,null,null,"ACTMathScre",{"$f":"INDEX('My Students'!$20:$28,MATCH($O$1,'My Students'!$B$20:$B$28,0),MATCH(N40,'My Students'!$20:$20,0))","v":{"$error":"#N/A"}}]
[null,null,null,null,null,null,null,null,null,null,null,null,null,"ACTScienceScre",{"$f":"INDEX('My Students'!$20:$28,MATCH($O$1,'My Students'!$B$20:$B$28,0),MATCH(N41,'My Students'!$20:$20,0))","v":{"$error":"#N/A"}}]
[null,null,null,null,null,null,null,null,null,null,null,null,null,"A&P?",{"$f":"IF(O1<>\"\",IF(OR(AND(O40=21,O41>21),AND(O40>21,O41=21)),\"maybe\",IF(AND(O31>=21,O41>=21),\"Y\",\"N\")),\"\")","v":{"$error":"#N/A"}}]
[null,null,null,null,null,null,null,null,null,null,null,null,null,"Major",{"$f":"INDEX('Data Lists'!B:B,MATCH(O24,'Data Lists'!A:A,0))","v":{"$error":"#N/A"}}]
[null,null,null,null,null,null,null,null,null,null,null,null,null,"NameM#",{"$f":"CONCATENATE(O47,\", \",O46,\" \",O45)","v":{"$error":"#N/A"}}]
[null,null,null,null,null,null,null,null,null,null,null,null,null,"M# copy",{"$f":"O1","v":0}]
[null,null,null,null,null,null,null,null,null,null,null,null,null,"Fname",{"$f":"IF(1<>\"\",IFERROR(MID(O9,SEARCH(\" \",O9,1)+1,SEARCH(\" \",O9,SEARCH(\" \",O9,1)+1)-SEARCH(\" \",O9,1)-1),MID(O9,FIND(\" \",O9)+1,256)),\"\")","v":{"$error":"#N/A"}}]
[null,null,null,null,null,null,null,null,null,null,null,null,null,"Lname",{"$f":"IF(O1<>\"\",CONCATENATE(LEFT(O9,FIND(\", \",O9,1)-1)),\"\")","v":{"$error":"#N/A"}}]

{"sheet":"Messages","index":31,"n_rows":10,"n_cols":3,"rows_kept":10,"cut":false,"hidden":false,"merged":[]}
["Location","Topic","Message"]
["H5","Registered","  Student self-registered for classes in computer lab setting on Day 2, following Registration Checklist provided in advising folder on Day 1. See Registration Checklist for list of recommended courses."]
["H5","Registered","  Student self-registered for classes in computer lab setting, following Registration Checklist provided in advising folder. See Registration Checklist for list of recommended courses."]
["H8","SI","\n\nEncouraged student to attend Supplemental Instruction sessions, provided SI website.  "]
["H9","RTTP","\n\nRecommended Reacting to the Past (RTTP) sections of History.  "]
["H10","Note 1","\n\nAdd message here--anything that you tend to send to multiple students (Hold alt key and push Enter key twice at beginning, to leave a blank line between the prior message and this one!!)"]
["K6","Drop/Add Info","\n\nIf you later decide to change some of the classes you registered for today, and the new classes are listed as options on your Registration Checklist, that's fine.  You can drop the existing classes and add new ones without any financial penalty until the semester starts.  Here's how:\n--Use Look Up Classes in PipelineMT to find the new class you wish to add.\n  (Not sure how? Check the How To Tips guide I gave you, or let me know if you need help!)\n--Check the box beside that class. \n--At the bottom of the page, click on the Add to Worksheet button.\n--In the Action column, choose to drop the existing class in the drop-down menu.\n--Click the Submit Changes button.\n--Check the class list to make sure it has taken off the dropped class and added the new one instead.\n\nIf you want to switch to a class that wasn't listed on your form, please check with "]
["K7","Acad success tips","\n\nBe sure to start out strong: Go to class regularly, find free tutoring opportunities on the Student Success website (mtsu.edu/studentsuccess), form a study group and start meeting regularly early in the semester, etc.  Look into whether Supplemental Instruction (SI, mtsu.edu/si) is offered for any of your classes, and if so, attend SI sessions regularly throughout the semester.  If you're struggling, talk with your advisor sooner rather than later; we may be able to offer suggestions or resources to help you get back on track, so that you can finish the semester successfully!"]
["K8","Nurs Info Session","\n\nPlease join us at one our upcoming nursing information sessions, which are helpful for all students who are interested in applying to the nursing program.  Visit our website at mtsu.edu/cbhsadv/nursinginfo.php for more info, a list of upcoming dates, and a link to sign up for a session.  We hope to see you there!"]
["K9","Check Phone #","\n\nPlease check your contact info in the \"Personal Information\" section of PipelineMT.  We were unable to reach you via the phone numbers listed on your account.  We'll generally communicate through your MTSU email account, but we may call at certain times; please help us by making sure we have up-to-date contact info where we can reach you!  Please check all of the following in PipelineMT: \n--The numbers are correct.\n--You've provided at least 2 numbers where we can reach you.\n--The voicemail box for each number is turned on and isn't full so that we can leave a message if necessary.\n--The outgoing messsage (whatever we hear when we call you and get your voicemail) lists your name so that we know we've reached the right person."]

{"sheet":"Paste to FR Form","index":32,"n_rows":7,"n_cols":10,"rows_kept":7,"cut":false,"hidden":false,"merged":[]}
["Name: ","Brenda Smith",null,null,null,null,null,null,"Office Use Only:"]
["M#:","M00000001",null,null,null,null,null,null,"CountrySlot","FR - France (s756)"]
["Advisor:",{"$f":"IFERROR(INDEX('Data Lists'!K:K,MATCH('Paste to FR Form'!J4,'Data Lists'!H:H,0)),\"Don't type here! Type Acad Adv's 1st name on right!\")","v":"Amy (Amy.Foster@mtsu.edu)"},null,null,null,null,null,null,"Order/Time"]
["Date: ",null,null,null,null,null,null,null,"Acad Advisor","Amy"]
["Major:","Psychology--Pre-Grad",null,null,null,null,null,null,"Customs Advisor"]
["Minor:"]
["Eligible for honors program?",null,"UH: elig",null,"(More info: www.mtsu.edu/honors)"]

{"sheet":"Data Lists","index":33,"n_rows":27,"n_cols":18,"rows_kept":27,"cut":false,"hidden":false,"merged":[]}
["Majors & Depts",null,null,null,null,null,"Dept","First Name","Advisor","Adv Info 1","Adv Info 2",null,"CountrySlot","Code","Country",null,"Ltr","PREN"]
["POS Code","Major","Dept","Dept Name","Folder Code",null,"Acad Focus","Emily","Straker-Barak, Emily","your advisor, Emily (Emily.Straker-Barak@mtsu.edu)","Emily (Emily.Straker-Barak@mtsu.edu)",null,"BZ - Belize (s649)","BZ","Belize",null,"A","Eileen"]
["BS_ATTR","Athletic Training","HHP","Health & Human Performance","ATTR",null,"CJA","Joanne","Picker, Joanne","your advisor, Joanne (Joanne.Picker@mtsu.edu)","Joanne (Joanne.Picker@mtsu.edu)",null,"FR - France (s671)","FR","France",null,"B","Eileen"]
["BS_FACOCDFS","Child Development","HUSC","Human Sciences","FACO CDFS",null,"CJA","Candice","Burnom-Coman, Candice","your advisor, Candice (Candice.Burnom@mtsu.edu)","Candice (Candice.Burnom@mtsu.edu)",null,"IC - Iceland (s691)","IC","Iceland",null,"C","Eileen"]
["BS-CPHPUHE","Community & Public Health","HHP","Health & Human Performance","CPH PUHE",null,"HHP","Crystal","Ellis, Crystal","your advisor, Crystal (Crystal.Ellis@mtsu.edu)","Crystal (Crystal.Ellis@mtsu.edu)",null,"IC - Iceland (s690)","IC","Iceland",null,"D","Eileen"]
["BS_CRJU","Criminal Justice","CRJU","Criminal Justice","CRJU",null,"HHP","Sarah","Fossett, Sarah","your advisor, Sarah (Sarah.Fossett@mtsu.edu)","Sarah (Sarah.Fossett@mtsu.edu)",null,"PO - Portugal (s647)","PO","Portugal",null,"E","Eileen"]
["BS_CRJUHSEC","Criminal Justice--Homeland Security","CRJU","Criminal Justice","CRJU HSEC",null,"HHP","Dauthan","Keener, Dauthan","your advisor, Dauthan (Dauthan.Keener@mtsu.edu)","Dauthan (Dauthan.Keener@mtsu.edu)",null,"SN - Singapore (s669)","SN","Singapore",null,"F","Eileen"]
["BS_CRJULAEN","Criminal Justice--Law Enforcement","CRJU","Criminal Justice","CRJU LAEN",null,"HHP","Judy","Monroe, Judy","your advisor, Judy (Judy.Monroe@mtsu.edu)","Judy (Judy.Monroe@mtsu.edu)",null,"SN - Singapore (s918)","SN","Singapore",null,"G","Eileen"]
["BS_ESCI","Exercise Science","HHP","Health & Human Performance","ESCI",null,"HUSC","Jennifer","Austin, Jennifer","your advisor, Jennifer (Jennifer.Austin@mtsu.edu)","Jennifer (Jennifer.Austin@mtsu.edu)",null,"SN - Singapore (s657)","SN","Singapore",null,"H","Eileen"]
["BS_INPS","Industrial/Organizational Psychology","PSY","Psychology","PSY INPS",null,"HUSC","Brandie","Freeman, Brandie","your advisor, Brandie (Brandie.Freeman@mtsu.edu)","Brandie (Brandie.Freeman@mtsu.edu)",null,"VE - Venezuela (s681)","VE","Venezuela",null,"I","Eileen"]
["BS_INDE","Interior Design","HUSC","Human Sciences","INDE",null,"NURS","Eileen","Chalmers, Eileen","your advisor, Eileen (Eileen.Chalmers@mtsu.edu)","Eileen (Eileen.Chalmers@mtsu.edu)",null,"VE - Venezuela (s687)","VE","Venezuela",null,"J","Eileen"]
["BS-LSTS","Leisure, Sport, & Tourism Studies","HHP","Health & Human Performance","LSTS",null,"NURS","Shelia","Withers, Shelia","your advisor, Shelia (Shelia.Withers@mtsu.edu)","Shelia (Shelia.Withers@mtsu.edu)",null,"WE - Wales (s677)","WE","Wales",null,"K","Eileen"]
["BSN_NURS","Nursing","NURS","Nursing","NURS",null,"PSY","Chloe","Calhoun, Chloe","your advisor, Chloe (Chloe.Calhoun@mtsu.edu)","Chloe (Chloe.Calhoun@mtsu.edu)",null,null,null,null,null,"L","Shelia"]
["BS_NUFO","Nutrition & Food Science","HUSC","Human Sciences","NUFO",null,"PSY","Amy","Foster, Amy","your advisor, Amy (Amy.Foster@mtsu.edu)","Amy (Amy.Foster@mtsu.edu)",null,null,null,null,null,"M","Shelia"]
["BS_NUFODIET","Nutrition & Food Science--Dietetics","HUSC","Human Sciences","NUFO DIET",null,"PSY","Stacey","Jones, Stacey","your advisor, Stacey (Stacey.Jones@mtsu.edu)","Stacey (Stacey.Jones@mtsu.edu)",null,null,null,null,null,"N","Shelia"]
["BSN_NURSPREN","Pre-Nursing","NURS","Nursing","NURS PREN",null,"SOWO","Crystal","Owen, Crystal","your advisor, Crystal (Crystal.Owen@mtsu.edu)","Bonnie (Bonnie.McCarty@mtsu.edu)",null,null,null,null,null,"O","Shelia"]
["BSW_SOWOPRSW","Pre-Social Work","SOWO","Social Work","SOWO PRSW",null,null,null,null,null,null,null,null,null,null,null,"P","Shelia"]
["BS_PSY","Psychology","PSY","Psychology","PSY",null,null,null,null,null,null,null,null,null,null,null,"Q","Shelia"]
["BS_PSYPGSC","Psychology--Pre-Grad","PSY","Psychology","PSY PGSC",null,null,null,null,null,null,null,null,null,null,null,"R","Shelia"]
["BSW_SOWO","Social Work","SOWO","Social Work","SOWO",null,null,null,null,null,null,null,null,null,null,null,"S","Shelia"]
["BS-SLPA","Speech Pathology","HHP","Health & Human Performance","SLPA",null,null,null,null,null,null,null,null,null,null,null,"T","Shelia"]
["BS_TEMEADES","TXMD: Apparel Design","HUSC","Human Sciences","TEME ADES",null,null,null,null,null,null,null,null,null,null,null,"U","Shelia"]
["BS_TEMEFAMD","TXMD: Fashion Merchandising","HUSC","Human Sciences","TEME FAMD",null,null,null,null,null,null,null,null,null,null,null,"V","Shelia"]
[null,null,null,null,null,null,null,null,null,null,null,null,null,null,null,null,"W","Shelia"]
[null,null,null,null,null,null,null,null,null,null,null,null,null,null,null,null,"X","Shelia"]
[null,null,null,null,null,null,null,null,null,null,null,null,null,null,null,null,"Y","Shelia"]
[null,null,null,null,null,null,null,null,null,null,null,null,null,null,null,null,"Z","Shelia"]

{"sheet":"What to include","index":34,"n_rows":31,"n_cols":1,"rows_kept":31,"cut":false,"hidden":false,"merged":[]}
["Items to be included:"]
["-          Freshman or Transfer?"]
["-          Who is the advisor? Who is CUSTOMS advisor?"]
["-          M#"]
["-          CUSTOMS Country"]
["-          List all subs to be done"]
["-          Check for AP courses and other applicable credits."]
["-          How many transferred hours?"]
["-          Where did the student previously attend?"]
["Check off:"]
["-          Check Banner Term"]
["-          Check Banner Major"]
["-          READ, yes or no"]
["-          Finish line eligible?"]
["-          Honors eligible?"]
["-          Check transcripts"]
["-          Holds?"]
["-          Do they understand their parallel plan?"]
["-          Do they have prescribed courses?"]
["-          Immunization issues?"]
["-          Probation, yes or no"]
["-          Veterans benefits, yes or no"]
["-          Scholars academy?"]
["-          Athlete?"]
["Paperwork Checklist:"]
["-          FR template"]
["-          Upper Division Form"]
["-          K form, if applicable"]
["-          Academic Map"]
["-          Major information/Candidacy/NURS info sheet"]
["-          Important Dates"]

{"sheet":"Old","index":35,"n_rows":48,"n_cols":13,"rows_kept":48,"cut":false,"hidden":false,"merged":[[1,6,2,6],[1,7,2,7],[1,9,2,9]]}
["Contact & Demographic Info",null,null,"Academic Info",null,null,"To-Do","Where to find","What to check","Done",null,"M#",{"$f":"'My Students'!B3","v":"M00000001"}]
["Name",{"$f":"CONCATENATE(A17,\" \",B17)","v":"Brenda Smith"},null,"Transferred hours",{"$f":"INDEX($M:$M,MATCH(\"HrsEarned\",$L:$L,0))","v":28},null,"Check transcripts:","BDMS (Banner: SAAADMS, click search icon)","FRs: Any AP, IB, or DE?","y ",null,"Deleted",{"$f":"INDEX('My Students'!$2:$16,MATCH($M$1,'My Students'!$B$2:$B$16,0),MATCH(L2,'My Students'!$2:$2,0))","v":"This is sample data. The purple button will paste over it. Just ignore it for now!"}]
["M#",{"$f":"M1","v":"M00000001"},null,"HS GPA",{"$f":"INDEX($M:$M,MATCH(\"HighSchoolGPA\",$L:$L,0))","v":3.95},null,null,null,"TRs: Missing sems on MT transcript?",null,null,"SAcad",{"$f":"INDEX('My Students'!$2:$16,MATCH($M$1,'My Students'!$B$2:$B$16,0),MATCH(L3,'My Students'!$2:$2,0))","v":"reg"}]
["MTSUEmail",{"$f":"INDEX($M:$M,MATCH(A4,$L:$L,0))","v":"2@mtmail.mtsu.edu"},null,"Inclusive GPA",{"$f":"INDEX($M:$M,MATCH(\"InclusiveGPA\",$L:$L,0))","v":3.9161999999999999},null,"Check for holds","SOAHOLD or PipelineMT: ___",null,null,null,"VetOrDep",{"$f":"INDEX('My Students'!$2:$16,MATCH($M$1,'My Students'!$B$2:$B$16,0),MATCH(L4,'My Students'!$2:$2,0))","v":""}]
["PersonalEmail",{"$f":"INDEX($M:$M,MATCH(A5,$L:$L,0))","v":"2@aol.com"},null,"ACT Math",{"$f":"INDEX($M:$M,MATCH(\"ACTMathScre\",$L:$L,0))","v":20},null,"On probation?",null,null,null,null,"PREN",{"$f":"INDEX('My Students'!$2:$16,MATCH($M$1,'My Students'!$B$2:$B$16,0),MATCH(L5,'My Students'!$2:$2,0))","v":""}]
["PermPhone",{"$f":"INDEX($M:$M,MATCH(A6,$L:$L,0))","v":0},null,"ACT Science",{"$f":"INDEX($M:$M,MATCH(\"ACTScienceScre\",$L:$L,0))","v":22},null,"Vet benefits?","SGASTDN, SPAIDEN, ask student",null,null,null,"1stGen",{"$f":"INDEX('My Students'!$2:$16,MATCH($M$1,'My Students'!$B$2:$B$16,0),MATCH(L6,'My Students'!$2:$2,0))","v":"N"}]
["MailingPhone",{"$f":"INDEX($M:$M,MATCH(A7,$L:$L,0))","v":"(615) 556-0000"},null,"CustomsPOS",{"$f":"INDEX($M:$M,MATCH(D7,$L:$L,0))","v":"BS_PSYPGSC"},null,"Student Athlete?","SGASPRT",null,"2019-02-27",null,"ReverseTransfer",{"$f":"INDEX('My Students'!$2:$16,MATCH($M$1,'My Students'!$B$2:$B$16,0),MATCH(L7,'My Students'!$2:$2,0))","v":""}]
[null,null,null,"BannerPOS",{"$f":"INDEX($M:$M,MATCH(D8,$L:$L,0))","v":"BS_PSYPGSC"},null,"Subs needed","By comparing transcript, transfer eval, & UD form","Any classes that might/should count but aren't?",null,null,"FR/TR",{"$f":"INDEX('My Students'!$2:$16,MATCH($M$1,'My Students'!$B$2:$B$16,0),MATCH(L8,'My Students'!$2:$2,0))","v":"F"}]
["Customs Info",null,null,"Majors match?",{"$f":"IF(E7=E8,\"Y\",\"N, Submit change of major\")","v":"Y"},null,"Schools previously attended","SOAPCOL or PipelineMT: ___",null,null,null,"Order/Time",{"$f":"INDEX('My Students'!$2:$16,MATCH($M$1,'My Students'!$B$2:$B$16,0),MATCH(L9,'My Students'!$2:$2,0))","v":"2/10:30 AM"}]
["Order/Time",{"$f":"CONCATENATE(INDEX(M:M,MATCH(A10,L:L,0)),\" (\",LEFT(M20,2),\")\")","v":"2/10:30 AM (28)"},null,"Override major",null,null,null,null,null,null,null,"StudentName",{"$f":"INDEX('My Students'!$2:$16,MATCH($M$1,'My Students'!$B$2:$B$16,0),MATCH(L10,'My Students'!$2:$2,0))","v":"Smith, Brenda"}]
["Acad Advisor",{"$f":"INDEX($M:$M,MATCH(\"Assigned Advisor\",$L:$L,0))","v":"Joe Bob"},null,null,null,null,"Folder Checklist:",null,null,null,null,"PrescribedCrsMath",{"$f":"INDEX('My Students'!$2:$16,MATCH($M$1,'My Students'!$B$2:$B$16,0),MATCH(L11,'My Students'!$2:$2,0))","v":"College level"}]
["Customs Advisor",{"$f":"INDEX($M:$M,MATCH(\"Customs Advisor\",$L:$L,0))","v":"Jennifer"},null,"Factors in Choosing Classes",null,null,"Reg checklist or freshman template",null,null,null,null,"PrescribedCrsWriting",{"$f":"INDEX('My Students'!$2:$16,MATCH($M$1,'My Students'!$B$2:$B$16,0),MATCH(L12,'My Students'!$2:$2,0))","v":"College level"}]
["Emily's Notes",{"$f":"INDEX($M:$M,MATCH(\"Notes\",$L:$L,0))","v":""},null,"Honors",{"$f":"IF(RIGHT(INDEX($M:$M,MATCH(\"HonorsElig\",$L:$L,0)),1)=\"N\",\"N\",CONCATENATE(\"Honors: \",INDEX($M:$M,MATCH(\"HonorsElig\",$L:$L,0))))","v":"Honors: UH: elig"},null,"Upper division form, if transfer (or freshman with several credits)",null,null,null,null,"PrescribedCrsReading",{"$f":"INDEX('My Students'!$2:$16,MATCH($M$1,'My Students'!$B$2:$B$16,0),MATCH(L13,'My Students'!$2:$2,0))","v":"College level"}]
[null,null,null,"Prescribeds",{"$f":"IF(AND(M11=\"College level\",M12=\"College level\",M13=\"College level\",M14=\"College level\"),\"\",CONCATENATE(\"Ks: \",IF(M11<>\"College level\",CONCATENATE(M11,\", \"),\"\"),IF(M12<>\"College level\",\"Engl, \",\"\"),IF(M13<>\"College level\",\"READ, \",\"\"),IF(AND(M14<>\"College level\",M14<>0),\"U1010\",\"\")))","v":"Ks: "},null,"Prescribed courses template, if applicable",null,null,null,null,"PrescribedCrsStudySkills",{"$f":"INDEX('My Students'!$2:$16,MATCH($M$1,'My Students'!$B$2:$B$16,0),MATCH(L14,'My Students'!$2:$2,0))","v":0}]
["Copy-Pastes & Folder Links",null,null,"Scholars Acad",{"$f":"INDEX($M:$M,MATCH(\"Sacad\",$L:$L,0))","v":"reg"},null,"Academic map",null,null,null,null,"HonorsElig",{"$f":"INDEX('My Students'!$2:$16,MATCH($M$1,'My Students'!$B$2:$B$16,0),MATCH(L15,'My Students'!$2:$2,0))","v":"UH: elig"}]
[{"$f":"INDEX(M:M,MATCH(\"StudentName\",L:L,0))","v":"Smith, Brenda"},{"$f":"M1","v":"M00000001"},null,"Pre-Nursing",{"$f":"INDEX($M:$M,MATCH(\"PREN\",$L:$L,0))","v":""},null,"Major info / Candidacy / Nursing info sheet if applicable",null,null,null,null,"ACTEngl",{"$f":"INDEX('My Students'!$2:$16,MATCH($M$1,'My Students'!$B$2:$B$16,0),MATCH(L16,'My Students'!$2:$2,0))","v":""}]
[{"$f":"IFERROR(MID(A16,SEARCH(\" \",A16,1)+1,SEARCH(\" \",A16,SEARCH(\" \",A16,1)+1)-SEARCH(\" \",A16,1)-1),MID(A16,FIND(\" \",A16)+1,256))","v":"Brenda"},{"$f":"CONCATENATE(LEFT(A16,FIND(\", \",A16,1)-1))","v":"Smith"},null,"ACTEngl",{"$f":"INDEX($M:$M,MATCH(\"ACTEngl\",$L:$L,0))","v":""},null,"2nd page of Reg checklist (w/ Important Dates), if using freshman template",null,null,null,null,"HighSchoolGPA",{"$f":"INDEX('My Students'!$2:$16,MATCH($M$1,'My Students'!$B$2:$B$16,0),MATCH(L17,'My Students'!$2:$2,0))","v":3.95}]
["Major name",{"$f":"IF(E10=\"\",INDEX('Data Lists'!B:B,MATCH(E7,'Data Lists'!A:A,0)),INDEX('Data Lists'!B:B,MATCH(E10,'Data Lists'!B:B,0)))","v":"Psychology--Pre-Grad"},null,null,null,null,null,null,null,null,null,"ACTCompositeScore",{"$f":"INDEX('My Students'!$2:$16,MATCH($M$1,'My Students'!$B$2:$B$16,0),MATCH(L18,'My Students'!$2:$2,0))","v":25}]
["Folder name",{"$f":"IF(E10=\"\",CONCATENATE(INDEX('Data Lists'!E:E,MATCH(E7,'Data Lists'!A:A,0)),\" \",M10,\" \",B3),CONCATENATE(INDEX('Data Lists'!E:E,MATCH(E10,'Data Lists'!B:B,0)),\" \",B2,\" \",B3))","v":"PSY PGSC Smith, Brenda M00000001"},null,"Flags",null,null,"I give to stus, but wasn't on master list:",null,null,null,null,"InclusiveGPA",{"$f":"INDEX('My Students'!$2:$16,MATCH($M$1,'My Students'!$B$2:$B$16,0),MATCH(L19,'My Students'!$2:$2,0))","v":3.9161999999999999}]
["Dept folders",{"$f":"HYPERLINK(CONCATENATE(\"Z:\\CoBHS Advising\\\",IF(E10=\"\",INDEX('Data Lists'!D:D,MATCH(E7,'Data Lists'!A:A,0)),INDEX('Data Lists'!D:D,MATCH(E10,'Data Lists'!B:B,0))),\"\\Student Forms\\\"))","v":"Z:\\CoBHS Advising\\Psychology\\Student Forms\\"},null,"Holds",{"$f":"INDEX($M:$M,MATCH(D20,$L:$L,0))","v":"None"},null,"How To Tips",null,null,null,null,"HrsEarned",{"$f":"INDEX('My Students'!$2:$16,MATCH($M$1,'My Students'!$B$2:$B$16,0),MATCH(L20,'My Students'!$2:$2,0))","v":28}]
["Stu folder",{"$f":"HYPERLINK(CONCATENATE(\"Z:\\CoBHS Advising\\\",IF(E10=\"\",INDEX('Data Lists'!D:D,MATCH(E7,'Data Lists'!A:A,0)),INDEX('Data Lists'!D:D,MATCH(E10,'Data Lists'!B:B,0))),\"\\Student Forms\\\",B19))","v":"Z:\\CoBHS Advising\\Psychology\\Student Forms\\PSY PGSC Smith, Brenda M00000001"},null,"Reg Restrictions",{"$f":"INDEX($M:$M,MATCH(\"RegistrationRestrictions\",$L:$L,0))","v":0},null,"Fall workshops schedule",null,null,null,null,"CountrySlot",{"$f":"INDEX('My Students'!$2:$16,MATCH($M$1,'My Students'!$B$2:$B$16,0),MATCH(L21,'My Students'!$2:$2,0))","v":"FR - France (s756)"}]
[null,null,null,"Missing Items",{"$f":"INDEX($M:$M,MATCH(\"MissingChecklistItems\",$L:$L,0))","v":0},null,null,null,null,null,null,"CUSTOMSGrp",{"$f":"INDEX('My Students'!$2:$16,MATCH($M$1,'My Students'!$B$2:$B$16,0),MATCH(L22,'My Students'!$2:$2,0))","v":"PSY"}]
[null,null,null,"Term",{"$f":"INDEX($M:$M,MATCH(\"TermDesc\",$L:$L,0))","v":"Fall 2019"},null,null,null,null,null,null,"CustomsPOS",{"$f":"INDEX('My Students'!$2:$16,MATCH($M$1,'My Students'!$B$2:$B$16,0),MATCH(L23,'My Students'!$2:$2,0))","v":"BS_PSYPGSC"}]
[null,null,null,"Might need BUAF",{"$f":"INDEX($M:$M,MATCH(\"VetOrDep\",$L:$L,0))","v":""},null,null,null,null,null,null,"BannerPOS",{"$f":"INDEX('My Students'!$2:$16,MATCH($M$1,'My Students'!$B$2:$B$16,0),MATCH(L24,'My Students'!$2:$2,0))","v":"BS_PSYPGSC"}]
[null,null,null,"First Generation",{"$f":"INDEX($M:$M,MATCH(\"1stGen\",$L:$L,0))","v":"N"},null,null,null,null,null,null,"Assigned Advisor","Joe Bob"]
[null,null,null,null,null,null,null,null,null,null,null,"Customs Advisor",{"$f":"INDEX('My Students'!$2:$16,MATCH($M$1,'My Students'!$B$2:$B$16,0),MATCH(L26,'My Students'!$2:$2,0))","v":"Jennifer"}]
[null,null,null,null,null,null,null,null,null,null,null,"Holds",{"$f":"INDEX('My Students'!$2:$16,MATCH($M$1,'My Students'!$B$2:$B$16,0),MATCH(L27,'My Students'!$2:$2,0))","v":"None"}]
[null,null,null,null,null,null,null,null,null,null,null,"RegistrationRestrictions",{"$f":"INDEX('My Students'!$2:$16,MATCH($M$1,'My Students'!$B$2:$B$16,0),MATCH(L28,'My Students'!$2:$2,0))","v":0}]
[null,null,null,null,null,null,null,null,null,null,null,"MissingChecklistItems",{"$f":"INDEX('My Students'!$2:$16,MATCH($M$1,'My Students'!$B$2:$B$16,0),MATCH(L29,'My Students'!$2:$2,0))","v":0}]
[null,null,null,null,null,null,null,null,null,null,null,"AdmissionDecision",{"$f":"INDEX('My Students'!$2:$16,MATCH($M$1,'My Students'!$B$2:$B$16,0),MATCH(L30,'My Students'!$2:$2,0))","v":"LF-Freshman Final Acceptance"}]
[null,null,null,null,null,null,null,null,null,null,null,"TermDesc",{"$f":"INDEX('My Students'!$2:$16,MATCH($M$1,'My Students'!$B$2:$B$16,0),MATCH(L31,'My Students'!$2:$2,0))","v":"Fall 2019"}]
[null,null,null,null,null,null,null,null,null,null,null,"Notes",{"$f":"INDEX('My Students'!$2:$16,MATCH($M$1,'My Students'!$B$2:$B$16,0),MATCH(L32,'My Students'!$2:$2,0))","v":""}]
[null,null,null,null,null,null,null,null,null,null,null,"MTSUEmail",{"$f":"INDEX('My Students'!$2:$16,MATCH($M$1,'My Students'!$B$2:$B$16,0),MATCH(L33,'My Students'!$2:$2,0))","v":"2@mtmail.mtsu.edu"}]
[null,null,null,null,null,null,null,null,null,null,null,"PersonalEmail",{"$f":"INDEX('My Students'!$2:$16,MATCH($M$1,'My Students'!$B$2:$B$16,0),MATCH(L34,'My Students'!$2:$2,0))","v":"2@aol.com"}]
[null,null,null,null,null,null,null,null,null,null,null,"PermPhone",{"$f":"INDEX('My Students'!$2:$16,MATCH($M$1,'My Students'!$B$2:$B$16,0),MATCH(L35,'My Students'!$2:$2,0))","v":0}]
[null,null,null,null,null,null,null,null,null,null,null,"MailingPhone",{"$f":"INDEX('My Students'!$2:$16,MATCH($M$1,'My Students'!$B$2:$B$16,0),MATCH(L36,'My Students'!$2:$2,0))","v":"(615) 556-0000"}]
[null,null,null,null,null,null,null,null,null,null,null,"NursElig",{"$f":"INDEX('My Students'!$2:$16,MATCH($M$1,'My Students'!$B$2:$B$16,0),MATCH(L37,'My Students'!$2:$2,0))","v":""}]
[null,null,null,null,null,null,null,null,null,null,null,"ACTMathScre",{"$f":"INDEX('My Students'!$2:$16,MATCH($M$1,'My Students'!$B$2:$B$16,0),MATCH(L38,'My Students'!$2:$2,0))","v":20}]
[null,null,null,null,null,null,null,null,null,null,null,"ACTScienceScre",{"$f":"INDEX('My Students'!$2:$16,MATCH($M$1,'My Students'!$B$2:$B$16,0),MATCH(L39,'My Students'!$2:$2,0))","v":22}]
[null,null,null,null,null,null,null,null,null,null,null,"Concat",{"$f":"INDEX('My Students'!$2:$16,MATCH($M$1,'My Students'!$B$2:$B$16,0),MATCH(L40,'My Students'!$2:$2,0))","v":{"$error":"#N/A"}}]
[null,null,null,null,null,null,null,null,null,null,null,"Folder",{"$f":"INDEX('My Students'!$2:$16,MATCH($M$1,'My Students'!$B$2:$B$16,0),MATCH(L41,'My Students'!$2:$2,0))","v":{"$error":"#N/A"}}]
[null,null,null,null,null,null,null,null,null,null,null,"A&P?",{"$f":"INDEX('My Students'!$2:$16,MATCH($M$1,'My Students'!$B$2:$B$16,0),MATCH(L42,'My Students'!$2:$2,0))","v":{"$error":"#N/A"}}]
[null,null,null,null,null,null,null,null,null,null,null,"Major",{"$f":"INDEX('My Students'!$2:$16,MATCH($M$1,'My Students'!$B$2:$B$16,0),MATCH(L43,'My Students'!$2:$2,0))","v":"Psychology (Pre-Grad)"}]
[null,null,null,null,null,null,null,null,null,null,null,"NameM#",{"$f":"INDEX('My Students'!$2:$16,MATCH($M$1,'My Students'!$B$2:$B$16,0),MATCH(L44,'My Students'!$2:$2,0))","v":{"$error":"#N/A"}}]
[null,null,null,null,null,null,null,null,null,null,null,"Match",{"$f":"INDEX('My Students'!$2:$16,MATCH($M$1,'My Students'!$B$2:$B$16,0),MATCH(L45,'My Students'!$2:$2,0))","v":{"$error":"#N/A"}}]
[null,null,null,null,null,null,null,null,null,null,null,"M# copy",{"$f":"INDEX('My Students'!$2:$16,MATCH($M$1,'My Students'!$B$2:$B$16,0),MATCH(L46,'My Students'!$2:$2,0))","v":{"$error":"#N/A"}}]
[null,null,null,null,null,null,null,null,null,null,null,"Fname",{"$f":"INDEX('My Students'!$2:$16,MATCH($M$1,'My Students'!$B$2:$B$16,0),MATCH(L47,'My Students'!$2:$2,0))","v":{"$error":"#N/A"}}]
[null,null,null,null,null,null,null,null,null,null,null,"Lname",{"$f":"INDEX('My Students'!$2:$16,MATCH($M$1,'My Students'!$B$2:$B$16,0),MATCH(L48,'My Students'!$2:$2,0))","v":{"$error":"#N/A"}}]