{"text_format":"1","workbook":"xlsx","n_sheets":5,"sheets":["Front","Back","Front-No Fill","Back-No Fill","Clear button"],"not_rendered":{"charts":0,"images":2,"macros":1,"external_links":0,"defined_names":3,"comments":0,"pivot_tables":0},"unopened":[],"bounds":{"document_bytes":16777216,"sheet_cells":100000,"rows_first":2000,"rows_last":500,"rows_between":2000,"halvings":0,"cell_chars":16384,"cell_head_chars":4096},"cells_cut":0,"cells_raw":0,"read":"whole","date_system":"1900"}

{"sheet":"Front","index":0,"n_rows":75,"n_cols":10,"rows_kept":75,"cut":false,"hidden":false,"merged":[[74,1,78,10],[70,0,70,9],[50,1,50,3],[50,5,51,5],[50,7,51,7],[50,8,51,8],[50,9,51,9],[51,1,51,3],[52,2,52,3],[53,2,53,3],[54,2,54,3],[55,2,55,3],[56,2,56,3],[66,2,66,3],[67,2,67,3],[68,2,68,3],[69,2,69,3],[37,2,37,3],[38,2,38,3],[40,1,40,3],[61,2,61,3],[57,2,57,3],[58,2,58,3],[59,2,59,3],[60,2,60,3],[13,0,49,0],[13,1,13,3],[14,2,14,3],[15,2,15,3],[16,2,16,3],[18,1,18,3],[21,2,21,3],[23,1,23,3],[24,1,24,3],[36,2,36,3],[25,2,25,3],[26,2,26,3],[27,2,27,3],[28,2,28,3],[29,2,29,3],[35,2,35,3],[65,2,65,3],[62,2,62,3],[64,2,64,3],[3,3,4,9],[5,0,5,2],[6,0,6,1],[10,0,10,9],[11,0,12,3],[11,4,12,4],[11,5,12,5],[11,6,11,9],[30,2,30,3],[31,2,31,3],[32,2,32,3],[33,2,33,3],[34,2,34,3]]}
[]
[]
[]
[null,null,null,"UPPER DIVISION FORM\nOriginal copy signed by major and minor advisors must be filed with the Graduation Analyst\nfor the College of Behavioral and Health Sciences three semesters before graduation."]
[]
["Student name: (Last, First MI.)",null,null,null,null,null,null,null,"ID#:"]
["Mailing address:",null,null,null,"Email:",null,null,null,"Phone:"]
[]
["Degree:",null,null,"Major:",null,null,"Minor:",null,null,"Catalog:"]
[]
["Instructions: For students graduating in Fall 2009 or later. One (1) copy signed by major and minor advisors should be filed in the Graduation Coordinator's Office during the second semester of the sophomore year. The Intent to Graduate Form must be filed simultaneously with the upper division form.\nUpdated curriculum effective for 2016 Fall cohort and subsequent cohorts."]
["COURSES REQUIRED",null,null,null,"CREDIT HOURS","GRADE","PROPOSED SUBSTITUTIONS - MUST SUBMIT SUB FORM FOR APPROVAL **"]
[null,null,null,null,null,null,"Course Prefix & Number","Sem Hrs","Institution where course was taken","Approval submitted?"]
["General Education Requirements","COMMUNICATION (9 hours): ",null,null,9,null,{"$f":"IF(SUMIF(F15:F17,\"<>\",E15:E17)>=E14,\"Done\",\"\")","v":""}]
[null,"ENGL 1010","Expository Writing",null,3]
[null,"ENGL 1020","Research & Argumentative Writing",null,3]
[null,"COMM 2200","Fundamentals of Communication",null,3]
[]
[null,"HISTORY (Choose 6 hours): ",null,null,6,null,{"$f":"IF(SUM(IF(F20<>\"\",E20,0)+IF(F21<>\"\",E21,0)+IF(F22<>\"\",E22,0))>=E19,\"Done\",\"\")","v":""}]
[null,"HIST 2010","Survey of United States History I",null,3]
[null,"HIST 2020","Survey of United States History II",null,3]
[null,"HIST 2030","Tennessee History",null,3]
[]
[null,"HUMANITIES &/or FINE ARTS (Choose 9 hours): "]
[null,"One course must be in Literature as indicated by a * sign.\nThe other two courses selected must be with different prefixes.",null,null,9,null,{"$f":"IF(SUMIF(F26:F39,\"<>\",E26:E39)>=E25,\"Done\",\"\")","v":""}]
[null,"ENGL 2020","Themes in Literature and Culture *",null,3]
[null,"ENGL 2030","The Experience of Literature *",null,3]
[null,"HUM 2610","Foreign Literature in Translation *",null,3]
[null,"ANTH 2210","Introduction to World Prehistory",null,3]
[null,"ART 1030","Art Appreciation",null,3]
[null,"ART 1920","Survey of Western Art I",null,3]
[null,"DANC 1000","Introduction to Dance",null,3]
[null,"HIST 1010","Survey Western Civilization I",null,3]
[null,"HIST 1020","Survey Western Civilization II",null,3]
[null,"HIST 1110","Survey World Civilization I",null,3]
[null,"HIST 1120","Survey World Civilization II",null,3]
[null,"MUS 1030","Introduction to Music",null,3]
[null,"PHIL 1030","Introduction to Philosophy",null,3]
[null,"THEA 1030","Introduction to Theatre",null,3]
[null,null,null,null,null,"U"]
[null,"MATHEMATICS (3 hours): ",null,null,3,null,{"$f":"IF(SUMIF(F42:F49,\"<>\",E42:E49)>=E41,\"Done\",\"\")","v":""}]
[null,"MATH 1010","Math for General Studies",null,3]
[null,"MATH 1530","Applied Statistics",null,3]
[null,"MATH 1630","College Math for Managerial, Social, & Life Sciences",null,3]
[null,"MATH 1710","College Algebra",null,3]
[null,"MATH 1720","Plane Trigonometry",null,3]
[null,"MATH 1730","Pre-Calculus",null,3]
[null,"MATH 1810","Applied Calculus I",null,3]
[null,"MATH 1910","Calculus I",null,3]
[]
[null,"NATURAL SCIENCES (Choose 8 hours)",null,null,null,null,""]
[null,"The two courses selected must be with different prefixes.",null,null,8,null,{"$f":"IF(SUMIF(F53:F70,\"<>\",E53:E70)>=E52,\"Done\",\"\")","v":""}]
[null,"ASTR 1030/1","Exploring the Universe",null,4]
[null,"BIOL 1030/1","Topics in Biology",null,4]
[null,"BIOL 1110/1","General Biology",null,4]
[null,"BIOL 2010/1","Human Anatomy & Physiology I",null,4]
[null,"BIOL 2020/1","Human Anatomy & Physiology II",null,4]
[null,"CHEM 1010/1","Introduction to Chemistry",null,4]
[null,"CHEM 1030/1","Chemistry for the Consumer",null,4]
[null,"CHEM 1110/1","General Chemistry",null,4]
[null,"CHEM 1130/1","Contemporary Issues in Science & 1131 Lab",null,4]
[null,"GEOL 1030/1","Introduction to Earth Science",null,4]
[null,"GEOL 1040/1","Physical Geology",null,4]
[null,"PGEO 1030","Physical Geography ",null,4]
[null,"PHYS 1110","Discovering Physics",null,4]
[null,"PHYS 1130/1                     ","Comtemporary Issues in Science",null,4]
[null,"PHYS 2010/1","Non-Calc-Based Physics I",null,4]
[null,"PHYS 2110/1","Calculus-Based Physics I",null,4]
[null,"PSCI 1030/1","Physical Science",null,4]
[null,"PSCI 1130/1","Contemporary Issues in Science & 1131 Lab",null,4]
["** Any course substitution(s) must be approved on an MTSU Course Substitution form with appropriate advisor, department chair, and college dean signatures BEFORE being submitted to the Graduation Analyst. "]
[]
[]
[null,"How to use (by Bonnie Mccarty)"]
[null,"•\tFor gen eds and the minor: It tracks whether the student has completed that section, and changes from yellow highlight to an un-highlighted “Done” when the section is complete.  This makes it easy to quickly see what the student still needs to work on.\n•\tFor the core classes of the major, the highlight is on each blank grade spot.  When a grade is filled in, the highlight goes away.  Again, this shows what the student still needs to complete.  (I use a different format here in the assumption that major classes might not be completed until the last semester, so having a section-wide “Done” label wouldn’t really be useful!)\n•\tThe color-coded version is helpful for advisors and students, but not so helpful for grad analysts. Thus, I have a black-and-white version that can be printed for the graduation paperwork.\n•\tPrinting two separate tabs front and back can be challenging in Excel.  Thus, I have buttons to do so.  Two buttons on the “Back” tab let the advisor print or save a PDF of either the color or the black/white version easily."]

{"sheet":"Back","index":1,"n_rows":77,"n_cols":12,"rows_kept":77,"cut":false,"hidden":false,"merged":[[0,11,74,11],[76,8,76,9],[18,2,18,3],[75,8,75,9],[20,2,20,3],[0,0,0,2],[0,3,0,7],[1,5,1,7],[2,4,3,4],[2,5,3,5],[2,6,2,9],[11,2,11,3],[22,0,55,0],[57,0,63,0],[65,0,73,0],[12,2,12,3],[14,2,14,3],[15,2,15,3],[16,2,16,3],[17,2,17,3],[2,0,20,0],[2,1,3,3],[4,1,4,3],[19,2,19,3],[5,1,5,3],[6,2,6,3],[7,2,7,3],[8,2,8,3]]}
["Student name: (Last, 1st, MI)",null,null,{"$f":"IF(Front!D6<>\"\",Front!D6,\"\")","v":""},null,null,null,null,"ID#:",{"$f":"IF(Front!J6<>\"\",Front!J6,\"\")","v":""},null,"IMPORTANT: Degrees require a minimum of: (1) 120 semester hours with at least a 2.0 grade point average; 12 of the last 18 hours must be taken at MTSU - not transferred; (2) 42 upper-division hours (3000-4000 level courses) with at least a 2.0 grade point average; \n(3) 30 upper-division hours must be taken at MTSU - not transferred; and (4) 60 senior college hours (taken at a four-year college).\nRemedial/Developmental courses do not count toward the 120-hour requirement or cumulative degree GPA. Courses used to fulfill high school deficiencies can only be counted as ELECTIVE credit.\nNote: Note:  UD courses not chosen in concentration can be used in general electives.  Exchange courses with Northumbria University (Law School) may substitute for guided electives."]
[{"$f":"CONCATENATE(\"Degree: \"&Front!A10)","v":"Degree: "},null,null,{"$f":"CONCATENATE(\"Major: \"&Front!D10)","v":"Major: "},"Minor:",{"$f":"IF(Front!G10=\"\",CONCATENATE(\"Minor: n/a\"),CONCATENATE(\"Minor: \",Front!G10))","v":"Minor: n/a"},null,null,"Catalog:",{"$f":"IF(Front!J10<>\"\",Front!J10,\"\")","v":""}]
["General Education Requirements (Cont'd)","COURSES REQUIRED",null,null,"CREDIT HOURS","GRADE","PROPOSED SUBSTITUTIONS - MUST SUBMIT SUB FORM FOR APPROVAL **"]
[null,null,null,null,null,null,"Course Prefix & Number","Sem Hrs","Institution where course was taken","Approval submitted?"]
[null,"SOCIAL/BEHAVIORAL SCIENCES:  "]
[null,"The 2 courses selected must be with different prefixes.",null,null,6,null,{"$f":"IF(SUMIF(F7:F21,\"<>\",E7:E21)>=E6,\"Done\",\"\")","v":""}]
[null,"AAS 2100","Introduction to African American Studies",null,3]
[null,"ANTH 2010","Cultural Anthropology",null,3]
[null,"ECON 2410","Principles of Economics, Macroeconomics",null,3]
[null,"ECON 2420","Principles of Economics, Microeconomics",null,3]
[null,"GEOG 2000","Introduction to Regional Geography",null,3]
[null,"GS 2010","Introduction to Cross-Cultural Experiences",null,3]
[null,"HLTH 1530/1","Health and Wellness w/ Lab",null,3]
[null,"JOUR/EMC/RIM 1020 American Media & Social Institutions",null,null,3]
[null,"P S 1005","Introduction to American Politics",null,3]
[null,"P S 1010","Introduction to Global Politics",null,3]
[null,"PSY 1410","General Psychology",null,3]
[null,"RS 2030","Religion & Society",null,3]
[null,"SOC 1010","Introductory Sociology",null,3]
[null,"SOC 2010","Social Problems",null,3]
[null,"WGST 2100","Introduction to Women's Studies",null,3]
[]
["Major Requirements ","Major:",{"$f":"Front!D10","v":0},null,null,"hrs",{"$f":"IF(E23=0,\"Enter major hours\",\"\")","v":"Enter major hours"}]
[]
[]
[]
[]
[]
[]
[]
[]
[]
[]
[]
[]
[]
[]
[]
[]
[]
[]
[]
[]
[]
[null,{"$f":"CONCATENATE(\"Choose courses equal to at least \"&E45&\" hrs:\")","v":"Choose courses equal to at least  hrs:"},null,null,null,"hrs",{"$f":"IF(E45=0,\"Enter hours required for this section\",IF(SUM(IF(F46<>\"\",E46,0)+IF(F49<>\"\",E49,0))>=E45,\"Done\",\"\"))","v":"Enter hours required for this section"}]
[]
[]
[]
[]
[null,{"$f":"CONCATENATE(\"Choose courses equal to at least \"&E50&\" hrs:\")","v":"Choose courses equal to at least  hrs:"},null,null,null,"hrs",{"$f":"IF(E50=0,\"Enter hours required for this section\",IF(SUMIF(F51:F56,\"<>\",E51:E56)>=E50,\"Done\",\"\"))","v":"Enter hours required for this section"}]
[]
[]
[]
[]
[]
[]
[]
["Minor","Minor:",null,null,null,"hrs",{"$f":"IF(E58=0,\"Enter minor hours\",IF(SUMIF(F59:F64,\"<>\",E59:E64)>=E58,\"Done\",\"\"))","v":"Enter minor hours"}]
[]
[]
[]
[]
[]
[]
[]
["Electives","Electives: ",null,null,null,"hrs",{"$f":"IF(E66=0,\"Enter required general elective hours\",IF(SUMIF(F67:F74,\"<>\",E67:E74)>=E66,\"Done\",\"\"))","v":"Enter required general elective hours"}]
[]
[]
[]
[]
[]
[]
[]
[]
[]
["Major Advisor's Signature",null,null,null,null,null,null,null,"Date",null,null,"Revision:"]
["Minor Advisor's Signature",null,null,null,null,null,null,null,"Date"]

{"sheet":"Front-No Fill","index":2,"n_rows":71,"n_cols":10,"rows_kept":71,"cut":false,"hidden":false,"merged":[[26,2,26,3],[27,2,27,3],[28,2,28,3],[29,2,29,3],[30,2,30,3],[40,1,40,3],[50,1,50,3],[50,5,51,5],[50,6,51,6],[50,7,51,7],[50,8,51,8],[50,9,51,9],[51,1,51,3],[52,2,52,3],[70,0,70,9],[53,2,53,3],[54,2,54,3],[55,2,55,3],[56,2,56,3],[57,2,57,3],[58,2,58,3],[59,2,59,3],[60,2,60,3],[61,2,61,3],[62,2,62,3],[69,2,69,3],[25,2,25,3],[11,0,12,3],[11,4,12,4],[11,5,12,5],[11,6,11,9],[13,0,69,0],[13,1,13,3],[14,2,14,3],[15,2,15,3],[16,2,16,3],[18,1,18,3],[19,2,19,3],[20,2,20,3],[21,2,21,3],[23,1,23,3],[24,1,24,3],[10,0,10,9],[3,3,4,9],[5,0,5,2],[5,3,5,7],[6,0,6,1],[64,2,64,3],[65,2,65,3],[66,2,66,3],[67,2,67,3],[68,2,68,3]]}
[]
[]
[]
[null,null,null,"UPPER DIVISION FORM\nOriginal copy signed by major and minor advisors must be filed with the Graduation Analyst\nfor the College of Behavioral and Health Sciences three semesters before graduation."]
[]
["Student name: (Last, 1st, MI)",null,null,{"$f":"IF(Front!D6<>\"\",Front!D6,\"\")","v":""},null,null,null,null,"ID#:",{"$f":"IF(Front!J6<>\"\",Front!J6,\"\")","v":""}]
["Mailing address:",null,{"$f":"IF(Front!C7<>\"\",Front!C7,\"\")","v":""},null,"Email:",{"$f":"IF(Front!F7<>\"\",Front!F7,\"\")","v":""},null,null,"Phone:",{"$f":"IF(Front!J7<>\"\",Front!J7,\"\")","v":""}]
[]
["Degree:",null,null,"Major:",null,null,"Minor:",null,null,"Catalog:"]
[{"$f":"IF(Front!A10<>\"\",Front!A10,\"\")","v":""},null,null,{"$f":"IF(Front!D10<>\"\",Front!D10,\"\")","v":""},null,null,{"$f":"IF(Front!G10<>\"\",Front!G10,\"\")","v":""},null,null,{"$f":"IF(Front!J10<>\"\",Front!J10,\"\")","v":""}]
["Instructions: For students graduating in Fall 2009 or later. One (1) copy signed by major and minor advisors should be filed in the Graduation Coordinator's Office during the second semester of the sophomore year. The Intent to Graduate Form must be filed simultaneously with the upper division form.\nUpdated curriculum effective for 2016 Fall cohort and subsequent cohorts."]
["COURSES REQUIRED",null,null,null,"CREDIT HOURS","GRADE","PROPOSED SUBSTITUTIONS - MUST SUBMIT SUB FORM FOR APPROVAL **"]
[null,null,null,null,null,null,"Course Prefix & Number","Sem Hrs","Institution where course was taken","Approval submitted?"]
["General Education Requirements","COMMUNICATION (9 hours):  C or better required",null,null,"9 hours"]
[null,"ENGL 1010","Expository Writing",null,{"$f":"IF(F15<>\"\",Front!E15,\"\")","v":""},{"$f":"IF(Front!F15<>\"\",Front!F15,\"\")","v":""},{"$f":"IF(Front!G15<>\"\",Front!G15,\"\")","v":""},{"$f":"IF(Front!H15<>\"\",Front!H15,\"\")","v":""},{"$f":"IF(Front!I15<>\"\",Front!I15,\"\")","v":""},{"$f":"IF(Front!J15<>\"\",Front!J15,\"\")","v":""}]
[null,"ENGL 1020","Research & Argumentative Writing",null,{"$f":"IF(F16<>\"\",Front!E16,\"\")","v":""},{"$f":"IF(Front!F16<>\"\",Front!F16,\"\")","v":""},{"$f":"IF(Front!G16<>\"\",Front!G16,\"\")","v":""},{"$f":"IF(Front!H16<>\"\",Front!H16,\"\")","v":""},{"$f":"IF(Front!I16<>\"\",Front!I16,\"\")","v":""},{"$f":"IF(Front!J16<>\"\",Front!J16,\"\")","v":""}]
[null,"COMM 2200","Fundamentals of Communication",null,{"$f":"IF(F17<>\"\",Front!E17,\"\")","v":""},{"$f":"IF(Front!F17<>\"\",Front!F17,\"\")","v":""},{"$f":"IF(Front!G17<>\"\",Front!G17,\"\")","v":""},{"$f":"IF(Front!H17<>\"\",Front!H17,\"\")","v":""},{"$f":"IF(Front!I17<>\"\",Front!I17,\"\")","v":""},{"$f":"IF(Front!J17<>\"\",Front!J17,\"\")","v":""}]
[]
[null,"HISTORY (Choose 6 hours):  C or better required",null,null,"6 hours"]
[null,"HIST 2010","Survey of United States History I",null,{"$f":"IF(F20<>\"\",Front!E20,\"\")","v":""},{"$f":"IF(Front!F20<>\"\",Front!F20,\"\")","v":""},{"$f":"IF(Front!G20<>\"\",Front!G20,\"\")","v":""},{"$f":"IF(Front!H20<>\"\",Front!H20,\"\")","v":""},{"$f":"IF(Front!I20<>\"\",Front!I20,\"\")","v":""},{"$f":"IF(Front!J20<>\"\",Front!J20,\"\")","v":""}]
[null,"HIST 2020","Survey of United States History II",null,{"$f":"IF(F21<>\"\",Front!E21,\"\")","v":""},{"$f":"IF(Front!F21<>\"\",Front!F21,\"\")","v":""},{"$f":"IF(Front!G21<>\"\",Front!G21,\"\")","v":""},{"$f":"IF(Front!H21<>\"\",Front!H21,\"\")","v":""},{"$f":"IF(Front!I21<>\"\",Front!I21,\"\")","v":""},{"$f":"IF(Front!J21<>\"\",Front!J21,\"\")","v":""}]
[null,"HIST 2030","Tennessee History",null,{"$f":"IF(F22<>\"\",Front!E22,\"\")","v":""},{"$f":"IF(Front!F22<>\"\",Front!F22,\"\")","v":""},{"$f":"IF(Front!G22<>\"\",Front!G22,\"\")","v":""},{"$f":"IF(Front!H22<>\"\",Front!H22,\"\")","v":""},{"$f":"IF(Front!I22<>\"\",Front!I22,\"\")","v":""},{"$f":"IF(Front!J22<>\"\",Front!J22,\"\")","v":""}]
[]
[null,"HUMANITIES &/or FINE ARTS (Choose 9 hours): C or better required"]
[null,"One course must be in Literature as indicated by a * sign.\nThe other two courses selected must be with different prefixes.",null,null,"9 hours",null,{"$f":"IF(SUM(IF(F26<>\"\",E26,0)+IF(F27<>\"\",E27,0)+IF(F28<>\"\",E28,0)+IF(F29<>\"\",E29,0)+IF(F30<>\"\",E30,0)+IF(F31<>\"\",E31,0)+IF(F32<>\"\",E32,0)+IF(F33<>\"\",E33,0)+IF(F34<>\"\",E34,0)+IF(F35<>\"\",E35,0)+IF(F36<>\"\",E36,0)+IF(F37<>\"\",E37,0)+IF(F38<>\"\",E38,0)+IF(F39<>\"\",E39,0))>=E25,\"Done\",\"\")","v":""}]
[null,"ENGL 2020","Themes in Literature and Culture *",null,{"$f":"IF(F26<>\"\",Front!E26,\"\")","v":""},{"$f":"IF(Front!F26<>\"\",Front!F26,\"\")","v":""},{"$f":"IF(Front!G26<>\"\",Front!G26,\"\")","v":""},{"$f":"IF(Front!H26<>\"\",Front!H26,\"\")","v":""},{"$f":"IF(Front!I26<>\"\",Front!I26,\"\")","v":""},{"$f":"IF(Front!J26<>\"\",Front!J26,\"\")","v":""}]
[null,"ENGL 2030","The Experience of Literature *",null,{"$f":"IF(F27<>\"\",Front!E27,\"\")","v":""},{"$f":"IF(Front!F27<>\"\",Front!F27,\"\")","v":""},{"$f":"IF(Front!G27<>\"\",Front!G27,\"\")","v":""},{"$f":"IF(Front!H27<>\"\",Front!H27,\"\")","v":""},{"$f":"IF(Front!I27<>\"\",Front!I27,\"\")","v":""},{"$f":"IF(Front!J27<>\"\",Front!J27,\"\")","v":""}]
[null,"HUM 2610","Foreign Literature in Translation *",null,{"$f":"IF(F28<>\"\",Front!E28,\"\")","v":""},{"$f":"IF(Front!F28<>\"\",Front!F28,\"\")","v":""},{"$f":"IF(Front!G28<>\"\",Front!G28,\"\")","v":""},{"$f":"IF(Front!H28<>\"\",Front!H28,\"\")","v":""},{"$f":"IF(Front!I28<>\"\",Front!I28,\"\")","v":""},{"$f":"IF(Front!J28<>\"\",Front!J28,\"\")","v":""}]
[null,"ANTH 2210","Introduction to World Prehistory",null,{"$f":"IF(F29<>\"\",Front!E29,\"\")","v":""},{"$f":"IF(Front!F29<>\"\",Front!F29,\"\")","v":""},{"$f":"IF(Front!G29<>\"\",Front!G29,\"\")","v":""},{"$f":"IF(Front!H29<>\"\",Front!H29,\"\")","v":""},{"$f":"IF(Front!I29<>\"\",Front!I29,\"\")","v":""},{"$f":"IF(Front!J29<>\"\",Front!J29,\"\")","v":""}]
[null,"ART 1030","Art Appreciation",null,{"$f":"IF(F30<>\"\",Front!E30,\"\")","v":""},{"$f":"IF(Front!F30<>\"\",Front!F30,\"\")","v":""},{"$f":"IF(Front!G30<>\"\",Front!G30,\"\")","v":""},{"$f":"IF(Front!H30<>\"\",Front!H30,\"\")","v":""},{"$f":"IF(Front!I30<>\"\",Front!I30,\"\")","v":""},{"$f":"IF(Front!J30<>\"\",Front!J30,\"\")","v":""}]
[null,"ART 1920","Survey of Western Art I",null,{"$f":"IF(F31<>\"\",Front!E31,\"\")","v":""},{"$f":"IF(Front!F31<>\"\",Front!F31,\"\")","v":""},{"$f":"IF(Front!G31<>\"\",Front!G31,\"\")","v":""},{"$f":"IF(Front!H31<>\"\",Front!H31,\"\")","v":""},{"$f":"IF(Front!I31<>\"\",Front!I31,\"\")","v":""},{"$f":"IF(Front!J31<>\"\",Front!J31,\"\")","v":""}]
[null,"DANC 1000","Introduction to Dance",null,{"$f":"IF(F32<>\"\",Front!E32,\"\")","v":""},{"$f":"IF(Front!F32<>\"\",Front!F32,\"\")","v":""},{"$f":"IF(Front!G32<>\"\",Front!G32,\"\")","v":""},{"$f":"IF(Front!H32<>\"\",Front!H32,\"\")","v":""},{"$f":"IF(Front!I32<>\"\",Front!I32,\"\")","v":""},{"$f":"IF(Front!J32<>\"\",Front!J32,\"\")","v":""}]
[null,"HIST 1010","Survey Western Civilization I",null,{"$f":"IF(F33<>\"\",Front!E33,\"\")","v":""},{"$f":"IF(Front!F33<>\"\",Front!F33,\"\")","v":""},{"$f":"IF(Front!G33<>\"\",Front!G33,\"\")","v":""},{"$f":"IF(Front!H33<>\"\",Front!H33,\"\")","v":""},{"$f":"IF(Front!I33<>\"\",Front!I33,\"\")","v":""},{"$f":"IF(Front!J33<>\"\",Front!J33,\"\")","v":""}]
[null,"HIST 1020","Survey Western Civilization II",null,{"$f":"IF(F34<>\"\",Front!E34,\"\")","v":""},{"$f":"IF(Front!F34<>\"\",Front!F34,\"\")","v":""},{"$f":"IF(Front!G34<>\"\",Front!G34,\"\")","v":""},{"$f":"IF(Front!H34<>\"\",Front!H34,\"\")","v":""},{"$f":"IF(Front!I34<>\"\",Front!I34,\"\")","v":""},{"$f":"IF(Front!J34<>\"\",Front!J34,\"\")","v":""}]
[null,"HIST 1110","Survey World Civilization I",null,{"$f":"IF(F35<>\"\",Front!E35,\"\")","v":""},{"$f":"IF(Front!F35<>\"\",Front!F35,\"\")","v":""},{"$f":"IF(Front!G35<>\"\",Front!G35,\"\")","v":""},{"$f":"IF(Front!H35<>\"\",Front!H35,\"\")","v":""},{"$f":"IF(Front!I35<>\"\",Front!I35,\"\")","v":""},{"$f":"IF(Front!J35<>\"\",Front!J35,\"\")","v":""}]
[null,"HIST 1120","Survey World Civilization II",null,{"$f":"IF(F36<>\"\",Front!E36,\"\")","v":""},{"$f":"IF(Front!F36<>\"\",Front!F36,\"\")","v":""},{"$f":"IF(Front!G36<>\"\",Front!G36,\"\")","v":""},{"$f":"IF(Front!H36<>\"\",Front!H36,\"\")","v":""},{"$f":"IF(Front!I36<>\"\",Front!I36,\"\")","v":""},{"$f":"IF(Front!J36<>\"\",Front!J36,\"\")","v":""}]
[null,"MUS 1030","Introduction to Music",null,{"$f":"IF(F37<>\"\",Front!E37,\"\")","v":""},{"$f":"IF(Front!F37<>\"\",Front!F37,\"\")","v":""},{"$f":"IF(Front!G37<>\"\",Front!G37,\"\")","v":""},{"$f":"IF(Front!H37<>\"\",Front!H37,\"\")","v":""},{"$f":"IF(Front!I37<>\"\",Front!I37,\"\")","v":""},{"$f":"IF(Front!J37<>\"\",Front!J37,\"\")","v":""}]
[null,"PHIL 1030","Introduction to Philosophy",null,{"$f":"IF(F38<>\"\",Front!E38,\"\")","v":""},{"$f":"IF(Front!F38<>\"\",Front!F38,\"\")","v":""},{"$f":"IF(Front!G38<>\"\",Front!G38,\"\")","v":""},{"$f":"IF(Front!H38<>\"\",Front!H38,\"\")","v":""},{"$f":"IF(Front!I38<>\"\",Front!I38,\"\")","v":""},{"$f":"IF(Front!J38<>\"\",Front!J38,\"\")","v":""}]
[null,"THEA 1030","Introduction to Theatre",null,{"$f":"IF(F39<>\"\",Front!E39,\"\")","v":""},{"$f":"IF(Front!F39<>\"\",Front!F39,\"\")","v":""},{"$f":"IF(Front!G39<>\"\",Front!G39,\"\")","v":""},{"$f":"IF(Front!H39<>\"\",Front!H39,\"\")","v":""},{"$f":"IF(Front!I39<>\"\",Front!I39,\"\")","v":""},{"$f":"IF(Front!J39<>\"\",Front!J39,\"\")","v":""}]
[]
[null,"MATHEMATICS (3 hours):  C or better required",null,null,"3 hours"]
[null,"MATH 1010","Math for General Studies",null,{"$f":"IF(F42<>\"\",Front!E42,\"\")","v":""},{"$f":"IF(Front!F42<>\"\",Front!F42,\"\")","v":""},{"$f":"IF(Front!G42<>\"\",Front!G42,\"\")","v":""},{"$f":"IF(Front!H42<>\"\",Front!H42,\"\")","v":""},{"$f":"IF(Front!I42<>\"\",Front!I42,\"\")","v":""},{"$f":"IF(Front!J42<>\"\",Front!J42,\"\")","v":""}]
[null,"MATH 1530","Applied Statistics",null,{"$f":"IF(F43<>\"\",Front!E43,\"\")","v":""},{"$f":"IF(Front!F43<>\"\",Front!F43,\"\")","v":""},{"$f":"IF(Front!G43<>\"\",Front!G43,\"\")","v":""},{"$f":"IF(Front!H43<>\"\",Front!H43,\"\")","v":""},{"$f":"IF(Front!I43<>\"\",Front!I43,\"\")","v":""},{"$f":"IF(Front!J43<>\"\",Front!J43,\"\")","v":""}]
[null,"MATH 1630","College Math for Managerial, Social, & Life Sciences",null,{"$f":"IF(F44<>\"\",Front!E44,\"\")","v":""},{"$f":"IF(Front!F44<>\"\",Front!F44,\"\")","v":""},{"$f":"IF(Front!G44<>\"\",Front!G44,\"\")","v":""},{"$f":"IF(Front!H44<>\"\",Front!H44,\"\")","v":""},{"$f":"IF(Front!I44<>\"\",Front!I44,\"\")","v":""},{"$f":"IF(Front!J44<>\"\",Front!J44,\"\")","v":""}]
[null,"MATH 1710","College Algebra (Recommended)",null,{"$f":"IF(F45<>\"\",Front!E45,\"\")","v":""},{"$f":"IF(Front!F45<>\"\",Front!F45,\"\")","v":""},{"$f":"IF(Front!G45<>\"\",Front!G45,\"\")","v":""},{"$f":"IF(Front!H45<>\"\",Front!H45,\"\")","v":""},{"$f":"IF(Front!I45<>\"\",Front!I45,\"\")","v":""},{"$f":"IF(Front!J45<>\"\",Front!J45,\"\")","v":""}]
[null,"MATH 1720","Plane Trigonometry",null,{"$f":"IF(F46<>\"\",Front!E46,\"\")","v":""},{"$f":"IF(Front!F46<>\"\",Front!F46,\"\")","v":""},{"$f":"IF(Front!G46<>\"\",Front!G46,\"\")","v":""},{"$f":"IF(Front!H46<>\"\",Front!H46,\"\")","v":""},{"$f":"IF(Front!I46<>\"\",Front!I46,\"\")","v":""},{"$f":"IF(Front!J46<>\"\",Front!J46,\"\")","v":""}]
[null,"MATH 1730","Pre-Calculus",null,{"$f":"IF(F47<>\"\",Front!E47,\"\")","v":""},{"$f":"IF(Front!F47<>\"\",Front!F47,\"\")","v":""},{"$f":"IF(Front!G47<>\"\",Front!G47,\"\")","v":""},{"$f":"IF(Front!H47<>\"\",Front!H47,\"\")","v":""},{"$f":"IF(Front!I47<>\"\",Front!I47,\"\")","v":""},{"$f":"IF(Front!J47<>\"\",Front!J47,\"\")","v":""}]
[null,"MATH 1810","Applied Calculus I",null,{"$f":"IF(F48<>\"\",Front!E48,\"\")","v":""},{"$f":"IF(Front!F48<>\"\",Front!F48,\"\")","v":""},{"$f":"IF(Front!G48<>\"\",Front!G48,\"\")","v":""},{"$f":"IF(Front!H48<>\"\",Front!H48,\"\")","v":""},{"$f":"IF(Front!I48<>\"\",Front!I48,\"\")","v":""},{"$f":"IF(Front!J48<>\"\",Front!J48,\"\")","v":""}]
[null,"MATH 1910","Calculus I",null,{"$f":"IF(F49<>\"\",Front!E49,\"\")","v":""},{"$f":"IF(Front!F49<>\"\",Front!F49,\"\")","v":""},{"$f":"IF(Front!G49<>\"\",Front!G49,\"\")","v":""},{"$f":"IF(Front!H49<>\"\",Front!H49,\"\")","v":""},{"$f":"IF(Front!I49<>\"\",Front!I49,\"\")","v":""},{"$f":"IF(Front!J49<>\"\",Front!J49,\"\")","v":""}]
[]
[null,"NATURAL SCIENCES (Choose 8 hours)"]
[null,"The two courses selected must be with different prefixes.",null,null,8]
[null,"ASTR 1030/1","Exploring the Universe",null,{"$f":"IF(F53<>\"\",Front!E53,\"\")","v":""},{"$f":"IF(Front!F53<>\"\",Front!F53,\"\")","v":""},{"$f":"IF(Front!G53<>\"\",Front!G53,\"\")","v":""},{"$f":"IF(Front!H53<>\"\",Front!H53,\"\")","v":""},{"$f":"IF(Front!I53<>\"\",Front!I53,\"\")","v":""},{"$f":"IF(Front!J53<>\"\",Front!J53,\"\")","v":""}]
[null,"BIOL 1030/1","Topics in Biology",null,{"$f":"IF(F54<>\"\",Front!E54,\"\")","v":""},{"$f":"IF(Front!F54<>\"\",Front!F54,\"\")","v":""},{"$f":"IF(Front!G54<>\"\",Front!G54,\"\")","v":""},{"$f":"IF(Front!H54<>\"\",Front!H54,\"\")","v":""},{"$f":"IF(Front!I54<>\"\",Front!I54,\"\")","v":""},{"$f":"IF(Front!J54<>\"\",Front!J54,\"\")","v":""}]
[null,"BIOL 1110/1","General Biology",null,{"$f":"IF(F55<>\"\",Front!E55,\"\")","v":""},{"$f":"IF(Front!F55<>\"\",Front!F55,\"\")","v":""},{"$f":"IF(Front!G55<>\"\",Front!G55,\"\")","v":""},{"$f":"IF(Front!H55<>\"\",Front!H55,\"\")","v":""},{"$f":"IF(Front!I55<>\"\",Front!I55,\"\")","v":""},{"$f":"IF(Front!J55<>\"\",Front!J55,\"\")","v":""}]
[null,"BIOL 2010/1","Human Anatomy & Physiology I",null,{"$f":"IF(F56<>\"\",Front!E56,\"\")","v":""},{"$f":"IF(Front!F56<>\"\",Front!F56,\"\")","v":""},{"$f":"IF(Front!G56<>\"\",Front!G56,\"\")","v":""},{"$f":"IF(Front!H56<>\"\",Front!H56,\"\")","v":""},{"$f":"IF(Front!I56<>\"\",Front!I56,\"\")","v":""},{"$f":"IF(Front!J56<>\"\",Front!J56,\"\")","v":""}]
[null,"BIOL 2020/1","Human Anatomy & Physiology II",null,{"$f":"IF(F57<>\"\",Front!E57,\"\")","v":""},{"$f":"IF(Front!F57<>\"\",Front!F57,\"\")","v":""},{"$f":"IF(Front!G57<>\"\",Front!G57,\"\")","v":""},{"$f":"IF(Front!H57<>\"\",Front!H57,\"\")","v":""},{"$f":"IF(Front!I57<>\"\",Front!I57,\"\")","v":""},{"$f":"IF(Front!J57<>\"\",Front!J57,\"\")","v":""}]
[null,"CHEM 1010/1","Introduction to Chemistry",null,{"$f":"IF(F58<>\"\",Front!E58,\"\")","v":""},{"$f":"IF(Front!F58<>\"\",Front!F58,\"\")","v":""},{"$f":"IF(Front!G58<>\"\",Front!G58,\"\")","v":""},{"$f":"IF(Front!H58<>\"\",Front!H58,\"\")","v":""},{"$f":"IF(Front!I58<>\"\",Front!I58,\"\")","v":""},{"$f":"IF(Front!J58<>\"\",Front!J58,\"\")","v":""}]
[null,"CHEM 1030/1","Chemistry for the Consumer",null,{"$f":"IF(F59<>\"\",Front!E59,\"\")","v":""},{"$f":"IF(Front!F59<>\"\",Front!F59,\"\")","v":""},{"$f":"IF(Front!G59<>\"\",Front!G59,\"\")","v":""},{"$f":"IF(Front!H59<>\"\",Front!H59,\"\")","v":""},{"$f":"IF(Front!I59<>\"\",Front!I59,\"\")","v":""},{"$f":"IF(Front!J59<>\"\",Front!J59,\"\")","v":""}]
[null,"CHEM 1110/1","General Chemistry",null,{"$f":"IF(F60<>\"\",Front!E60,\"\")","v":""},{"$f":"IF(Front!F60<>\"\",Front!F60,\"\")","v":""},{"$f":"IF(Front!G60<>\"\",Front!G60,\"\")","v":""},{"$f":"IF(Front!H60<>\"\",Front!H60,\"\")","v":""},{"$f":"IF(Front!I60<>\"\",Front!I60,\"\")","v":""},{"$f":"IF(Front!J60<>\"\",Front!J60,\"\")","v":""}]
[null,"CHEM 1130/1","Contemporary Issues in Science & 1131 Lab",null,{"$f":"IF(F61<>\"\",Front!E61,\"\")","v":""},{"$f":"IF(Front!F61<>\"\",Front!F61,\"\")","v":""},{"$f":"IF(Front!G61<>\"\",Front!G61,\"\")","v":""},{"$f":"IF(Front!H61<>\"\",Front!H61,\"\")","v":""},{"$f":"IF(Front!I61<>\"\",Front!I61,\"\")","v":""},{"$f":"IF(Front!J61<>\"\",Front!J61,\"\")","v":""}]
[null,"GEOL 1030/1","Introduction to Earth Science",null,{"$f":"IF(F62<>\"\",Front!E62,\"\")","v":""},{"$f":"IF(Front!F62<>\"\",Front!F62,\"\")","v":""},{"$f":"IF(Front!G62<>\"\",Front!G62,\"\")","v":""},{"$f":"IF(Front!H62<>\"\",Front!H62,\"\")","v":""},{"$f":"IF(Front!I62<>\"\",Front!I62,\"\")","v":""},{"$f":"IF(Front!J62<>\"\",Front!J62,\"\")","v":""}]
[null,"GEOL 1040/1","Physical Geology",null,{"$f":"IF(F63<>\"\",Front!E63,\"\")","v":""},{"$f":"IF(Front!F63<>\"\",Front!F63,\"\")","v":""},{"$f":"IF(Front!G63<>\"\",Front!G63,\"\")","v":""},{"$f":"IF(Front!H63<>\"\",Front!H63,\"\")","v":""},{"$f":"IF(Front!I63<>\"\",Front!I63,\"\")","v":""},{"$f":"IF(Front!J63<>\"\",Front!J63,\"\")","v":""}]
[null,"PGEO 1030","Physical Geography ",null,{"$f":"IF(F64<>\"\",Front!E64,\"\")","v":""},{"$f":"IF(Front!F64<>\"\",Front!F64,\"\")","v":""},{"$f":"IF(Front!G64<>\"\",Front!G64,\"\")","v":""},{"$f":"IF(Front!H64<>\"\",Front!H64,\"\")","v":""},{"$f":"IF(Front!I64<>\"\",Front!I64,\"\")","v":""},{"$f":"IF(Front!J64<>\"\",Front!J64,\"\")","v":""}]
[null,"PHYS 1110","Discovering Physics",null,{"$f":"IF(F65<>\"\",Front!E65,\"\")","v":""},{"$f":"IF(Front!F65<>\"\",Front!F65,\"\")","v":""},{"$f":"IF(Front!G65<>\"\",Front!G65,\"\")","v":""},{"$f":"IF(Front!H65<>\"\",Front!H65,\"\")","v":""},{"$f":"IF(Front!I65<>\"\",Front!I65,\"\")","v":""},{"$f":"IF(Front!J65<>\"\",Front!J65,\"\")","v":""}]
[null,"PHYS 1130/1                     ","Comtemporary Issues in Science",null,{"$f":"IF(F66<>\"\",Front!E66,\"\")","v":""},{"$f":"IF(Front!F66<>\"\",Front!F66,\"\")","v":""},{"$f":"IF(Front!G66<>\"\",Front!G66,\"\")","v":""},{"$f":"IF(Front!H66<>\"\",Front!H66,\"\")","v":""},{"$f":"IF(Front!I66<>\"\",Front!I66,\"\")","v":""},{"$f":"IF(Front!J66<>\"\",Front!J66,\"\")","v":""}]
[null,"PHYS 2010/1","Non-Calc-Based Physics I",null,{"$f":"IF(F67<>\"\",Front!E67,\"\")","v":""},{"$f":"IF(Front!F67<>\"\",Front!F67,\"\")","v":""},{"$f":"IF(Front!G67<>\"\",Front!G67,\"\")","v":""},{"$f":"IF(Front!H67<>\"\",Front!H67,\"\")","v":""},{"$f":"IF(Front!I67<>\"\",Front!I67,\"\")","v":""},{"$f":"IF(Front!J67<>\"\",Front!J67,\"\")","v":""}]
[null,"PHYS 2110/1","Calculus-Based Physics I",null,{"$f":"IF(F68<>\"\",Front!E68,\"\")","v":""},{"$f":"IF(Front!F68<>\"\",Front!F68,\"\")","v":""},{"$f":"IF(Front!G68<>\"\",Front!G68,\"\")","v":""},{"$f":"IF(Front!H68<>\"\",Front!H68,\"\")","v":""},{"$f":"IF(Front!I68<>\"\",Front!I68,\"\")","v":""},{"$f":"IF(Front!J68<>\"\",Front!J68,\"\")","v":""}]
[null,"PSCI 1030/1","Physical Science",null,{"$f":"IF(F69<>\"\",Front!E69,\"\")","v":""},{"$f":"IF(Front!F69<>\"\",Front!F69,\"\")","v":""},{"$f":"IF(Front!G69<>\"\",Front!G69,\"\")","v":""},{"$f":"IF(Front!H69<>\"\",Front!H69,\"\")","v":""},{"$f":"IF(Front!I69<>\"\",Front!I69,\"\")","v":""},{"$f":"IF(Front!J69<>\"\",Front!J69,\"\")","v":""}]
[null,"PSCI 1130/1","Contemporary Issues in Science & 1131 Lab",null,{"$f":"IF(F70<>\"\",Front!E70,\"\")","v":""},{"$f":"IF(Front!F70<>\"\",Front!F70,\"\")","v":""},{"$f":"IF(Front!G70<>\"\",Front!G70,\"\")","v":""},{"$f":"IF(Front!H70<>\"\",Front!H70,\"\")","v":""},{"$f":"IF(Front!I70<>\"\",Front!I70,\"\")","v":""},{"$f":"IF(Front!J70<>\"\",Front!J70,\"\")","v":""}]
["** Any course substitution(s) must be approved on an MTSU Course Substitution form with appropriate advisor, department chair, and college dean signatures BEFORE being submitted to the Graduation Analyst. "]

{"sheet":"Back-No Fill","index":3,"n_rows":77,"n_cols":12,"rows_kept":77,"cut":false,"hidden":false,"merged":[[65,0,73,0],[75,8,75,9],[76,8,76,9],[18,2,18,3],[20,2,20,3],[22,0,55,0],[57,0,63,0],[12,2,12,3],[14,2,14,3],[15,2,15,3],[16,2,16,3],[17,2,17,3],[0,11,74,11],[0,0,0,2],[0,3,0,7],[1,5,1,7],[2,0,20,0],[2,1,3,3],[2,4,3,4],[2,5,3,5],[2,6,2,9],[4,1,4,3],[19,2,19,3],[5,1,5,3],[6,2,6,3],[7,2,7,3],[10,2,10,3],[11,2,11,3]]}
["Student name: (Last, 1st, MI)",null,null,{"$f":"IF(Front!D6<>\"\",Front!D6,\"\")","v":""},null,null,null,null,"ID#:",{"$f":"IF(Front!J6<>\"\",Front!J6,\"\")","v":""},null,"IMPORTANT: Degrees require a minimum of: (1) 120 semester hours with at least a 2.0 grade point average; 12 of the last 18 hours must be taken at MTSU - not transferred; (2) 42 upper-division hours (3000-4000 level courses) with at least a 2.0 grade point average; \n(3) 30 upper-division hours must be taken at MTSU - not transferred; and (4) 60 senior college hours (taken at a four-year college).\nRemedial/Developmental courses do not count toward the 120-hour requirement or cumulative degree GPA. Courses used to fulfill high school deficiencies can only be counted as ELECTIVE credit.\nNote: Note:  UD courses not chosen in concentration can be used in general electives.  Exchange courses with Northumbria University (Law School) may substitute for guided electives."]
[{"$f":"CONCATENATE(\"Degree: \"&Front!A10)","v":"Degree: "},null,null,{"$f":"CONCATENATE(\"Major: \"&Front!D10)","v":"Major: "},"Minor:",{"$f":"IF(Front!G10=\"\",CONCATENATE(\"Minor: n/a\"),CONCATENATE(\"Minor: \",Front!G10))","v":"Minor: n/a"},null,null,"Catalog:",{"$f":"IF(Front!J10<>\"\",Front!J10,\"\")","v":""}]
["General Education Requirements (Cont'd)","COURSES REQUIRED",null,null,"CREDIT HOURS","GRADE","PROPOSED SUBSTITUTIONS - MUST SUBMIT SUB FORM FOR APPROVAL **"]
[null,null,null,null,null,null,"Course Prefix & Number","Sem Hrs","Institution where course was taken","Approval submitted?"]
[null,"SOCIAL/BEHAVIORAL SCIENCES:  C or better required"]
[null,"The two courses selected must be with different prefixes.",null,null,"6 hours",null,{"$f":"IF(SUM(IF(F7<>\"\",E7,0)+IF(F8<>\"\",E8,0)+IF(F9<>\"\",E9,0)+IF(F10<>\"\",E10,0)+IF(F12<>\"\",E12,0)+IF(F13<>\"\",E13,0)+IF(F14<>\"\",E14,0)+IF(F15<>\"\",E15,0)+IF(F16<>\"\",E16,0)+IF(F17<>\"\",E17,0)+IF(F18<>\"\",E18,0)+IF(F19<>\"\",E19,0)+IF(F20<>\"\",E20,0)+IF(F21<>\"\",E21,0))>=E6,\"Done\",\"\")","v":""}]
[null,"AAS 2100","Introduction to African American Studies",null,{"$f":"IF(F7<>\"\",Back!E7,\"\")","v":""},{"$f":"IF(Back!F7<>\"\",Back!F7,\"\")","v":""},{"$f":"IF(Back!G7<>\"\",Back!G7,\"\")","v":""},{"$f":"IF(Back!H7<>\"\",Back!H7,\"\")","v":""},{"$f":"IF(Back!I7<>\"\",Back!I7,\"\")","v":""},{"$f":"IF(Back!J7<>\"\",Back!J7,\"\")","v":""}]
[null,"ANTH 2010","Cultural Anthropology",null,{"$f":"IF(F8<>\"\",Back!E8,\"\")","v":""},{"$f":"IF(Back!F8<>\"\",Back!F8,\"\")","v":""},{"$f":"IF(Back!G8<>\"\",Back!G8,\"\")","v":""},{"$f":"IF(Back!H8<>\"\",Back!H8,\"\")","v":""},{"$f":"IF(Back!I8<>\"\",Back!I8,\"\")","v":""},{"$f":"IF(Back!J8<>\"\",Back!J8,\"\")","v":""}]
[null,"ECON 2410","Principles of Economics, Macroeconomics",null,{"$f":"IF(F9<>\"\",Back!E9,\"\")","v":""},{"$f":"IF(Back!F9<>\"\",Back!F9,\"\")","v":""},{"$f":"IF(Back!G9<>\"\",Back!G9,\"\")","v":""},{"$f":"IF(Back!H9<>\"\",Back!H9,\"\")","v":""},{"$f":"IF(Back!I9<>\"\",Back!I9,\"\")","v":""},{"$f":"IF(Back!J9<>\"\",Back!J9,\"\")","v":""}]
[null,"ECON 2420","Principles of Economics, Microeconomics",null,{"$f":"IF(F10<>\"\",Back!E10,\"\")","v":""},{"$f":"IF(Back!F10<>\"\",Back!F10,\"\")","v":""},{"$f":"IF(Back!G10<>\"\",Back!G10,\"\")","v":""},{"$f":"IF(Back!H10<>\"\",Back!H10,\"\")","v":""},{"$f":"IF(Back!I10<>\"\",Back!I10,\"\")","v":""},{"$f":"IF(Back!J10<>\"\",Back!J10,\"\")","v":""}]
[null,"GEOG 2000","Introduction to Regional Geography",null,{"$f":"IF(F11<>\"\",Back!E11,\"\")","v":""},{"$f":"IF(Back!F11<>\"\",Back!F11,\"\")","v":""},{"$f":"IF(Back!G11<>\"\",Back!G11,\"\")","v":""},{"$f":"IF(Back!H11<>\"\",Back!H11,\"\")","v":""},{"$f":"IF(Back!I11<>\"\",Back!I11,\"\")","v":""},{"$f":"IF(Back!J11<>\"\",Back!J11,\"\")","v":""}]
[null,"GS 2010","Introduction to Cross-Cultural Experiences",null,{"$f":"IF(F12<>\"\",Back!E12,\"\")","v":""},{"$f":"IF(Back!F12<>\"\",Back!F12,\"\")","v":""},{"$f":"IF(Back!G12<>\"\",Back!G12,\"\")","v":""},{"$f":"IF(Back!H12<>\"\",Back!H12,\"\")","v":""},{"$f":"IF(Back!I12<>\"\",Back!I12,\"\")","v":""},{"$f":"IF(Back!J12<>\"\",Back!J12,\"\")","v":""}]
[null,"HLTH 1530/1","Health and Wellness w/ Lab (Recommended)",null,{"$f":"IF(F13<>\"\",Back!E13,\"\")","v":""},{"$f":"IF(Back!F13<>\"\",Back!F13,\"\")","v":""},{"$f":"IF(Back!G13<>\"\",Back!G13,\"\")","v":""},{"$f":"IF(Back!H13<>\"\",Back!H13,\"\")","v":""},{"$f":"IF(Back!I13<>\"\",Back!I13,\"\")","v":""},{"$f":"IF(Back!J13<>\"\",Back!J13,\"\")","v":""}]
[null,"JOUR/EMC/RIM 1020 American Media & Social Institutions",null,null,{"$f":"IF(F14<>\"\",Back!E14,\"\")","v":""},{"$f":"IF(Back!F14<>\"\",Back!F14,\"\")","v":""},{"$f":"IF(Back!G14<>\"\",Back!G14,\"\")","v":""},{"$f":"IF(Back!H14<>\"\",Back!H14,\"\")","v":""},{"$f":"IF(Back!I14<>\"\",Back!I14,\"\")","v":""},{"$f":"IF(Back!J14<>\"\",Back!J14,\"\")","v":""}]
[null,"P S 1005","Introduction to American Politics",null,{"$f":"IF(F15<>\"\",Back!E15,\"\")","v":""},{"$f":"IF(Back!F15<>\"\",Back!F15,\"\")","v":""},{"$f":"IF(Back!G15<>\"\",Back!G15,\"\")","v":""},{"$f":"IF(Back!H15<>\"\",Back!H15,\"\")","v":""},{"$f":"IF(Back!I15<>\"\",Back!I15,\"\")","v":""},{"$f":"IF(Back!J15<>\"\",Back!J15,\"\")","v":""}]
[null,"P S 1010","Introduction to Global Politics",null,{"$f":"IF(F16<>\"\",Back!E16,\"\")","v":""},{"$f":"IF(Back!F16<>\"\",Back!F16,\"\")","v":""},{"$f":"IF(Back!G16<>\"\",Back!G16,\"\")","v":""},{"$f":"IF(Back!H16<>\"\",Back!H16,\"\")","v":""},{"$f":"IF(Back!I16<>\"\",Back!I16,\"\")","v":""},{"$f":"IF(Back!J16<>\"\",Back!J16,\"\")","v":""}]
[null,"PSY 1410","General Psychology (Recommended)",null,{"$f":"IF(F17<>\"\",Back!E17,\"\")","v":""},{"$f":"IF(Back!F17<>\"\",Back!F17,\"\")","v":""},{"$f":"IF(Back!G17<>\"\",Back!G17,\"\")","v":""},{"$f":"IF(Back!H17<>\"\",Back!H17,\"\")","v":""},{"$f":"IF(Back!I17<>\"\",Back!I17,\"\")","v":""},{"$f":"IF(Back!J17<>\"\",Back!J17,\"\")","v":""}]
[null,"RS 2030","Religion & Society",null,{"$f":"IF(F18<>\"\",Back!E18,\"\")","v":""},{"$f":"IF(Back!F18<>\"\",Back!F18,\"\")","v":""},{"$f":"IF(Back!G18<>\"\",Back!G18,\"\")","v":""},{"$f":"IF(Back!H18<>\"\",Back!H18,\"\")","v":""},{"$f":"IF(Back!I18<>\"\",Back!I18,\"\")","v":""},{"$f":"IF(Back!J18<>\"\",Back!J18,\"\")","v":""}]
[null,"SOC 1010","Introductory Sociology (Recommended)",null,{"$f":"IF(F19<>\"\",Back!E19,\"\")","v":""},{"$f":"IF(Back!F19<>\"\",Back!F19,\"\")","v":""},{"$f":"IF(Back!G19<>\"\",Back!G19,\"\")","v":""},{"$f":"IF(Back!H19<>\"\",Back!H19,\"\")","v":""},{"$f":"IF(Back!I19<>\"\",Back!I19,\"\")","v":""},{"$f":"IF(Back!J19<>\"\",Back!J19,\"\")","v":""}]
[null,"SOC 2010","Social Problems (Recommended)",null,{"$f":"IF(F20<>\"\",Back!E20,\"\")","v":""},{"$f":"IF(Back!F20<>\"\",Back!F20,\"\")","v":""},{"$f":"IF(Back!G20<>\"\",Back!G20,\"\")","v":""},{"$f":"IF(Back!H20<>\"\",Back!H20,\"\")","v":""},{"$f":"IF(Back!I20<>\"\",Back!I20,\"\")","v":""},{"$f":"IF(Back!J20<>\"\",Back!J20,\"\")","v":""}]
[null,"WGST 2100","Introduction to Women's Studies",null,{"$f":"IF(F21<>\"\",Back!E21,\"\")","v":""},{"$f":"IF(Back!F21<>\"\",Back!F21,\"\")","v":""},{"$f":"IF(Back!G21<>\"\",Back!G21,\"\")","v":""},{"$f":"IF(Back!H21<>\"\",Back!H21,\"\")","v":""},{"$f":"IF(Back!I21<>\"\",Back!I21,\"\")","v":""},{"$f":"IF(Back!J21<>\"\",Back!J21,\"\")","v":""}]
[]
["Major Requirements \n2.00 minimum grade point average required in major courses","Major:",{"$f":"Back!C23","v":0},null,"62-63 hours"]
[null,{"$f":"IF(Back!B24<>\"\",Back!B24,\"\")","v":""},{"$f":"IF(Back!C24<>\"\",Back!C24,\"\")","v":""},null,{"$f":"IF(F24<>\"\",Back!E24,\"\")","v":""},{"$f":"IF(Back!F24<>\"\",Back!F24,\"\")","v":""},{"$f":"IF(Back!G24<>\"\",Back!G24,\"\")","v":""},{"$f":"IF(Back!H24<>\"\",Back!H24,\"\")","v":""},{"$f":"IF(Back!I24<>\"\",Back!I24,\"\")","v":""},{"$f":"IF(Back!J24<>\"\",Back!J24,\"\")","v":""}]
[null,{"$f":"IF(Back!B25<>\"\",Back!B25,\"\")","v":""},{"$f":"IF(Back!C25<>\"\",Back!C25,\"\")","v":""},null,{"$f":"IF(F25<>\"\",Back!E25,\"\")","v":""},{"$f":"IF(Back!F25<>\"\",Back!F25,\"\")","v":""},{"$f":"IF(Back!G25<>\"\",Back!G25,\"\")","v":""},{"$f":"IF(Back!H25<>\"\",Back!H25,\"\")","v":""},{"$f":"IF(Back!I25<>\"\",Back!I25,\"\")","v":""},{"$f":"IF(Back!J25<>\"\",Back!J25,\"\")","v":""}]
[null,{"$f":"IF(Back!B26<>\"\",Back!B26,\"\")","v":""},{"$f":"IF(Back!C26<>\"\",Back!C26,\"\")","v":""},null,{"$f":"IF(Back!E26<>\"\",Back!E26,\"\")","v":""},{"$f":"IF(Back!F26<>\"\",Back!F26,\"\")","v":""},{"$f":"IF(Back!G26<>\"\",Back!G26,\"\")","v":""},{"$f":"IF(Back!H26<>\"\",Back!H26,\"\")","v":""},{"$f":"IF(Back!I26<>\"\",Back!I26,\"\")","v":""},{"$f":"IF(Back!J26<>\"\",Back!J26,\"\")","v":""}]
[null,{"$f":"IF(Back!B27<>\"\",Back!B27,\"\")","v":""},{"$f":"IF(Back!C27<>\"\",Back!C27,\"\")","v":""},null,{"$f":"IF(Back!E27<>\"\",Back!E27,\"\")","v":""},{"$f":"IF(Back!F27<>\"\",Back!F27,\"\")","v":""},{"$f":"IF(Back!G27<>\"\",Back!G27,\"\")","v":""},{"$f":"IF(Back!H27<>\"\",Back!H27,\"\")","v":""},{"$f":"IF(Back!I27<>\"\",Back!I27,\"\")","v":""},{"$f":"IF(Back!J27<>\"\",Back!J27,\"\")","v":""}]
[null,{"$f":"IF(Back!B28<>\"\",Back!B28,\"\")","v":""},{"$f":"IF(Back!C28<>\"\",Back!C28,\"\")","v":""},null,{"$f":"IF(Back!E28<>\"\",Back!E28,\"\")","v":""},{"$f":"IF(Back!F28<>\"\",Back!F28,\"\")","v":""},{"$f":"IF(Back!G28<>\"\",Back!G28,\"\")","v":""},{"$f":"IF(Back!H28<>\"\",Back!H28,\"\")","v":""},{"$f":"IF(Back!I28<>\"\",Back!I28,\"\")","v":""},{"$f":"IF(Back!J28<>\"\",Back!J28,\"\")","v":""}]
[null,{"$f":"IF(Back!B29<>\"\",Back!B29,\"\")","v":""},{"$f":"IF(Back!C29<>\"\",Back!C29,\"\")","v":""},null,{"$f":"IF(Back!E29<>\"\",Back!E29,\"\")","v":""},{"$f":"IF(Back!F29<>\"\",Back!F29,\"\")","v":""},{"$f":"IF(Back!G29<>\"\",Back!G29,\"\")","v":""},{"$f":"IF(Back!H29<>\"\",Back!H29,\"\")","v":""},{"$f":"IF(Back!I29<>\"\",Back!I29,\"\")","v":""},{"$f":"IF(Back!J29<>\"\",Back!J29,\"\")","v":""}]
[null,{"$f":"IF(Back!B30<>\"\",Back!B30,\"\")","v":""},{"$f":"IF(Back!C30<>\"\",Back!C30,\"\")","v":""},null,{"$f":"IF(Back!E30<>\"\",Back!E30,\"\")","v":""},{"$f":"IF(Back!F30<>\"\",Back!F30,\"\")","v":""},{"$f":"IF(Back!G30<>\"\",Back!G30,\"\")","v":""},{"$f":"IF(Back!H30<>\"\",Back!H30,\"\")","v":""},{"$f":"IF(Back!I30<>\"\",Back!I30,\"\")","v":""},{"$f":"IF(Back!J30<>\"\",Back!J30,\"\")","v":""}]
[null,{"$f":"IF(Back!B31<>\"\",Back!B31,\"\")","v":""},{"$f":"IF(Back!C31<>\"\",Back!C31,\"\")","v":""},null,{"$f":"IF(Back!E31<>\"\",Back!E31,\"\")","v":""},{"$f":"IF(Back!F31<>\"\",Back!F31,\"\")","v":""},{"$f":"IF(Back!G31<>\"\",Back!G31,\"\")","v":""},{"$f":"IF(Back!H31<>\"\",Back!H31,\"\")","v":""},{"$f":"IF(Back!I31<>\"\",Back!I31,\"\")","v":""},{"$f":"IF(Back!J31<>\"\",Back!J31,\"\")","v":""}]
[null,{"$f":"IF(Back!B32<>\"\",Back!B32,\"\")","v":""},{"$f":"IF(Back!C32<>\"\",Back!C32,\"\")","v":""},null,{"$f":"IF(Back!E32<>\"\",Back!E32,\"\")","v":""},{"$f":"IF(Back!F32<>\"\",Back!F32,\"\")","v":""},{"$f":"IF(Back!G32<>\"\",Back!G32,\"\")","v":""},{"$f":"IF(Back!H32<>\"\",Back!H32,\"\")","v":""},{"$f":"IF(Back!I32<>\"\",Back!I32,\"\")","v":""},{"$f":"IF(Back!J32<>\"\",Back!J32,\"\")","v":""}]
[null,{"$f":"IF(Back!B33<>\"\",Back!B33,\"\")","v":""},{"$f":"IF(Back!C33<>\"\",Back!C33,\"\")","v":""},null,{"$f":"IF(Back!E33<>\"\",Back!E33,\"\")","v":""},{"$f":"IF(Back!F33<>\"\",Back!F33,\"\")","v":""},{"$f":"IF(Back!G33<>\"\",Back!G33,\"\")","v":""},{"$f":"IF(Back!H33<>\"\",Back!H33,\"\")","v":""},{"$f":"IF(Back!I33<>\"\",Back!I33,\"\")","v":""},{"$f":"IF(Back!J33<>\"\",Back!J33,\"\")","v":""}]
[null,{"$f":"IF(Back!B34<>\"\",Back!B34,\"\")","v":""},{"$f":"IF(Back!C34<>\"\",Back!C34,\"\")","v":""},null,{"$f":"IF(Back!E34<>\"\",Back!E34,\"\")","v":""},{"$f":"IF(Back!F34<>\"\",Back!F34,\"\")","v":""},{"$f":"IF(Back!G34<>\"\",Back!G34,\"\")","v":""},{"$f":"IF(Back!H34<>\"\",Back!H34,\"\")","v":""},{"$f":"IF(Back!I34<>\"\",Back!I34,\"\")","v":""},{"$f":"IF(Back!J34<>\"\",Back!J34,\"\")","v":""}]
[null,{"$f":"IF(Back!B35<>\"\",Back!B35,\"\")","v":""},{"$f":"IF(Back!C35<>\"\",Back!C35,\"\")","v":""},null,{"$f":"IF(Back!E35<>\"\",Back!E35,\"\")","v":""},{"$f":"IF(Back!F35<>\"\",Back!F35,\"\")","v":""},{"$f":"IF(Back!G35<>\"\",Back!G35,\"\")","v":""},{"$f":"IF(Back!H35<>\"\",Back!H35,\"\")","v":""},{"$f":"IF(Back!I35<>\"\",Back!I35,\"\")","v":""},{"$f":"IF(Back!J35<>\"\",Back!J35,\"\")","v":""}]
[null,{"$f":"IF(Back!B36<>\"\",Back!B36,\"\")","v":""},{"$f":"IF(Back!C36<>\"\",Back!C36,\"\")","v":""},null,{"$f":"IF(Back!E36<>\"\",Back!E36,\"\")","v":""},{"$f":"IF(Back!F36<>\"\",Back!F36,\"\")","v":""},{"$f":"IF(Back!G36<>\"\",Back!G36,\"\")","v":""},{"$f":"IF(Back!H36<>\"\",Back!H36,\"\")","v":""},{"$f":"IF(Back!I36<>\"\",Back!I36,\"\")","v":""},{"$f":"IF(Back!J36<>\"\",Back!J36,\"\")","v":""}]
[null,{"$f":"IF(Back!B37<>\"\",Back!B37,\"\")","v":""},{"$f":"IF(Back!C37<>\"\",Back!C37,\"\")","v":""},null,{"$f":"IF(Back!E37<>\"\",Back!E37,\"\")","v":""},{"$f":"IF(Back!F37<>\"\",Back!F37,\"\")","v":""},{"$f":"IF(Back!G37<>\"\",Back!G37,\"\")","v":""},{"$f":"IF(Back!H37<>\"\",Back!H37,\"\")","v":""},{"$f":"IF(Back!I37<>\"\",Back!I37,\"\")","v":""},{"$f":"IF(Back!J37<>\"\",Back!J37,\"\")","v":""}]
[null,{"$f":"IF(Back!B38<>\"\",Back!B38,\"\")","v":""},{"$f":"IF(Back!C38<>\"\",Back!C38,\"\")","v":""},null,{"$f":"IF(Back!E38<>\"\",Back!E38,\"\")","v":""},{"$f":"IF(Back!F38<>\"\",Back!F38,\"\")","v":""},{"$f":"IF(Back!G38<>\"\",Back!G38,\"\")","v":""},{"$f":"IF(Back!H38<>\"\",Back!H38,\"\")","v":""},{"$f":"IF(Back!I38<>\"\",Back!I38,\"\")","v":""},{"$f":"IF(Back!J38<>\"\",Back!J38,\"\")","v":""}]
[null,{"$f":"IF(Back!B39<>\"\",Back!B39,\"\")","v":""},{"$f":"IF(Back!C39<>\"\",Back!C39,\"\")","v":""},null,{"$f":"IF(Back!E39<>\"\",Back!E39,\"\")","v":""},{"$f":"IF(Back!F39<>\"\",Back!F39,\"\")","v":""},{"$f":"IF(Back!G39<>\"\",Back!G39,\"\")","v":""},{"$f":"IF(Back!H39<>\"\",Back!H39,\"\")","v":""},{"$f":"IF(Back!I39<>\"\",Back!I39,\"\")","v":""},{"$f":"IF(Back!J39<>\"\",Back!J39,\"\")","v":""}]
[null,{"$f":"IF(Back!B40<>\"\",Back!B40,\"\")","v":""},{"$f":"IF(Back!C40<>\"\",Back!C40,\"\")","v":""},null,{"$f":"IF(Back!E40<>\"\",Back!E40,\"\")","v":""},{"$f":"IF(Back!F40<>\"\",Back!F40,\"\")","v":""},{"$f":"IF(Back!G40<>\"\",Back!G40,\"\")","v":""},{"$f":"IF(Back!H40<>\"\",Back!H40,\"\")","v":""},{"$f":"IF(Back!I40<>\"\",Back!I40,\"\")","v":""},{"$f":"IF(Back!J40<>\"\",Back!J40,\"\")","v":""}]
[null,{"$f":"IF(Back!B41<>\"\",Back!B41,\"\")","v":""},{"$f":"IF(Back!C41<>\"\",Back!C41,\"\")","v":""},null,{"$f":"IF(Back!E41<>\"\",Back!E41,\"\")","v":""},{"$f":"IF(Back!F41<>\"\",Back!F41,\"\")","v":""},{"$f":"IF(Back!G41<>\"\",Back!G41,\"\")","v":""},{"$f":"IF(Back!H41<>\"\",Back!H41,\"\")","v":""},{"$f":"IF(Back!I41<>\"\",Back!I41,\"\")","v":""},{"$f":"IF(Back!J41<>\"\",Back!J41,\"\")","v":""}]
[null,{"$f":"IF(Back!B42<>\"\",Back!B42,\"\")","v":""},{"$f":"IF(Back!C42<>\"\",Back!C42,\"\")","v":""},null,{"$f":"IF(Back!E42<>\"\",Back!E42,\"\")","v":""},{"$f":"IF(Back!F42<>\"\",Back!F42,\"\")","v":""},{"$f":"IF(Back!G42<>\"\",Back!G42,\"\")","v":""},{"$f":"IF(Back!H42<>\"\",Back!H42,\"\")","v":""},{"$f":"IF(Back!I42<>\"\",Back!I42,\"\")","v":""},{"$f":"IF(Back!J42<>\"\",Back!J42,\"\")","v":""}]
[null,{"$f":"IF(Back!B43<>\"\",Back!B43,\"\")","v":""},{"$f":"IF(Back!C43<>\"\",Back!C43,\"\")","v":""},null,{"$f":"IF(Back!E43<>\"\",Back!E43,\"\")","v":""},{"$f":"IF(Back!F43<>\"\",Back!F43,\"\")","v":""},{"$f":"IF(Back!G43<>\"\",Back!G43,\"\")","v":""},{"$f":"IF(Back!H43<>\"\",Back!H43,\"\")","v":""},{"$f":"IF(Back!I43<>\"\",Back!I43,\"\")","v":""},{"$f":"IF(Back!J43<>\"\",Back!J43,\"\")","v":""}]
[null,{"$f":"IF(Back!B44<>\"\",Back!B44,\"\")","v":""},{"$f":"IF(Back!C44<>\"\",Back!C44,\"\")","v":""},null,{"$f":"IF(Back!E44<>\"\",Back!E44,\"\")","v":""},{"$f":"IF(Back!F44<>\"\",Back!F44,\"\")","v":""},{"$f":"IF(Back!G44<>\"\",Back!G44,\"\")","v":""},{"$f":"IF(Back!H44<>\"\",Back!H44,\"\")","v":""},{"$f":"IF(Back!I44<>\"\",Back!I44,\"\")","v":""},{"$f":"IF(Back!J44<>\"\",Back!J44,\"\")","v":""}]
[null,{"$f":"CONCATENATE(\"Choose courses equal to at least \"&E45&\" hrs:\")","v":"Choose courses equal to at least 0 hrs:"},null,null,{"$f":"IF(F45<>\"\",Back!E45,\"\")","v":0},"hrs",null,{"$f":"IF(Back!H45<>\"\",Back!H45,\"\")","v":""},{"$f":"IF(Back!I45<>\"\",Back!I45,\"\")","v":""},{"$f":"IF(Back!J45<>\"\",Back!J45,\"\")","v":""}]
[null,{"$f":"IF(Back!B46<>\"\",Back!B46,\"\")","v":""},{"$f":"IF(Back!C46<>\"\",Back!C46,\"\")","v":""},null,{"$f":"IF(F46<>\"\",Back!E46,\"\")","v":""},{"$f":"IF(Back!F46<>\"\",Back!F46,\"\")","v":""},{"$f":"IF(Back!G46<>\"\",Back!G46,\"\")","v":""},{"$f":"IF(Back!H46<>\"\",Back!H46,\"\")","v":""},{"$f":"IF(Back!I46<>\"\",Back!I46,\"\")","v":""},{"$f":"IF(Back!J46<>\"\",Back!J46,\"\")","v":""}]
[null,{"$f":"IF(Back!B47<>\"\",Back!B47,\"\")","v":""},{"$f":"IF(Back!C47<>\"\",Back!C47,\"\")","v":""},null,{"$f":"IF(Back!E47<>\"\",Back!E47,\"\")","v":""},{"$f":"IF(Back!F47<>\"\",Back!F47,\"\")","v":""},{"$f":"IF(Back!G47<>\"\",Back!G47,\"\")","v":""},{"$f":"IF(Back!H47<>\"\",Back!H47,\"\")","v":""},{"$f":"IF(Back!I47<>\"\",Back!I47,\"\")","v":""},{"$f":"IF(Back!J47<>\"\",Back!J47,\"\")","v":""}]
[null,{"$f":"IF(Back!B48<>\"\",Back!B48,\"\")","v":""},{"$f":"IF(Back!C48<>\"\",Back!C48,\"\")","v":""},null,{"$f":"IF(Back!E48<>\"\",Back!E48,\"\")","v":""},{"$f":"IF(Back!F48<>\"\",Back!F48,\"\")","v":""},{"$f":"IF(Back!G48<>\"\",Back!G48,\"\")","v":""},{"$f":"IF(Back!H48<>\"\",Back!H48,\"\")","v":""},{"$f":"IF(Back!I48<>\"\",Back!I48,\"\")","v":""},{"$f":"IF(Back!J48<>\"\",Back!J48,\"\")","v":""}]
[null,{"$f":"IF(Back!B49<>\"\",Back!B49,\"\")","v":""},{"$f":"IF(Back!C49<>\"\",Back!C49,\"\")","v":""},null,{"$f":"IF(F49<>\"\",Back!E49,\"\")","v":""},{"$f":"IF(Back!F49<>\"\",Back!F49,\"\")","v":""},{"$f":"IF(Back!G49<>\"\",Back!G49,\"\")","v":""},{"$f":"IF(Back!H49<>\"\",Back!H49,\"\")","v":""},{"$f":"IF(Back!I49<>\"\",Back!I49,\"\")","v":""},{"$f":"IF(Back!J49<>\"\",Back!J49,\"\")","v":""}]
[null,{"$f":"CONCATENATE(\"Choose courses equal to at least \"&E50&\" hrs:\")","v":"Choose courses equal to at least 0 hrs:"},null,null,{"$f":"IF(F50<>\"\",Back!E50,\"\")","v":0},"hrs",null,{"$f":"IF(Back!H50<>\"\",Back!H50,\"\")","v":""},{"$f":"IF(Back!I50<>\"\",Back!I50,\"\")","v":""},{"$f":"IF(Back!J50<>\"\",Back!J50,\"\")","v":""}]
[null,{"$f":"IF(Back!B51<>\"\",Back!B51,\"\")","v":""},{"$f":"IF(Back!C51<>\"\",Back!C51,\"\")","v":""},null,{"$f":"IF(F51<>\"\",Back!E51,\"\")","v":""},{"$f":"IF(Back!F51<>\"\",Back!F51,\"\")","v":""},{"$f":"IF(Back!G51<>\"\",Back!G51,\"\")","v":""},{"$f":"IF(Back!H51<>\"\",Back!H51,\"\")","v":""},{"$f":"IF(Back!I51<>\"\",Back!I51,\"\")","v":""},{"$f":"IF(Back!J51<>\"\",Back!J51,\"\")","v":""}]
[null,{"$f":"IF(Back!B52<>\"\",Back!B52,\"\")","v":""},{"$f":"IF(Back!C52<>\"\",Back!C52,\"\")","v":""},null,{"$f":"IF(Back!E52<>\"\",Back!E52,\"\")","v":""},{"$f":"IF(Back!F52<>\"\",Back!F52,\"\")","v":""},{"$f":"IF(Back!G52<>\"\",Back!G52,\"\")","v":""},{"$f":"IF(Back!H52<>\"\",Back!H52,\"\")","v":""},{"$f":"IF(Back!I52<>\"\",Back!I52,\"\")","v":""},{"$f":"IF(Back!J52<>\"\",Back!J52,\"\")","v":""}]
[null,{"$f":"IF(Back!B53<>\"\",Back!B53,\"\")","v":""},{"$f":"IF(Back!C53<>\"\",Back!C53,\"\")","v":""},null,{"$f":"IF(Back!E53<>\"\",Back!E53,\"\")","v":""},{"$f":"IF(Back!F53<>\"\",Back!F53,\"\")","v":""},{"$f":"IF(Back!G53<>\"\",Back!G53,\"\")","v":""},{"$f":"IF(Back!H53<>\"\",Back!H53,\"\")","v":""},{"$f":"IF(Back!I53<>\"\",Back!I53,\"\")","v":""},{"$f":"IF(Back!J53<>\"\",Back!J53,\"\")","v":""}]
[null,{"$f":"IF(Back!B54<>\"\",Back!B54,\"\")","v":""},{"$f":"IF(Back!C54<>\"\",Back!C54,\"\")","v":""},null,{"$f":"IF(Back!E54<>\"\",Back!E54,\"\")","v":""},{"$f":"IF(Back!F54<>\"\",Back!F54,\"\")","v":""},{"$f":"IF(Back!G54<>\"\",Back!G54,\"\")","v":""},{"$f":"IF(Back!H54<>\"\",Back!H54,\"\")","v":""},{"$f":"IF(Back!I54<>\"\",Back!I54,\"\")","v":""},{"$f":"IF(Back!J54<>\"\",Back!J54,\"\")","v":""}]
[null,{"$f":"IF(Back!B55<>\"\",Back!B55,\"\")","v":""},{"$f":"IF(Back!C55<>\"\",Back!C55,\"\")","v":""},null,{"$f":"IF(Back!E55<>\"\",Back!E55,\"\")","v":""},{"$f":"IF(Back!F55<>\"\",Back!F55,\"\")","v":""},{"$f":"IF(Back!G55<>\"\",Back!G55,\"\")","v":""},{"$f":"IF(Back!H55<>\"\",Back!H55,\"\")","v":""},{"$f":"IF(Back!I55<>\"\",Back!I55,\"\")","v":""},{"$f":"IF(Back!J55<>\"\",Back!J55,\"\")","v":""}]
[null,{"$f":"IF(Back!B53<>\"\",Back!B53,\"\")","v":""},{"$f":"IF(Back!C53<>\"\",Back!C53,\"\")","v":""},null,{"$f":"IF(F56<>\"\",Back!E53,\"\")","v":""},{"$f":"IF(Back!F53<>\"\",Back!F53,\"\")","v":""},{"$f":"IF(Back!G53<>\"\",Back!G53,\"\")","v":""},{"$f":"IF(Back!H53<>\"\",Back!H53,\"\")","v":""},{"$f":"IF(Back!I53<>\"\",Back!I53,\"\")","v":""},{"$f":"IF(Back!J53<>\"\",Back!J53,\"\")","v":""}]
[]
["Minor Requirements","Minor:",{"$f":"IF(Back!C58<>\"\",Back!C58,\"\")","v":""},null,{"$f":"IF(Back!E58<>\"\",Back!E58,\"\")","v":""},"hrs"]
[null,{"$f":"IF(Back!B59<>\"\",Back!B59,\"\")","v":""},{"$f":"IF(Back!C59<>\"\",Back!C59,\"\")","v":""},null,{"$f":"IF(Back!E59<>\"\",Back!E59,\"\")","v":""},{"$f":"IF(Back!F59<>\"\",Back!F59,\"\")","v":""},{"$f":"IF(Back!G59<>\"\",Back!G59,\"\")","v":""},{"$f":"IF(Back!H59<>\"\",Back!H59,\"\")","v":""},{"$f":"IF(Back!I59<>\"\",Back!I59,\"\")","v":""},{"$f":"IF(Back!J59<>\"\",Back!J59,\"\")","v":""}]
[null,{"$f":"IF(Back!B60<>\"\",Back!B60,\"\")","v":""},{"$f":"IF(Back!C60<>\"\",Back!C60,\"\")","v":""},null,{"$f":"IF(Back!E60<>\"\",Back!E60,\"\")","v":""},{"$f":"IF(Back!F60<>\"\",Back!F60,\"\")","v":""},{"$f":"IF(Back!G60<>\"\",Back!G60,\"\")","v":""},{"$f":"IF(Back!H60<>\"\",Back!H60,\"\")","v":""},{"$f":"IF(Back!I60<>\"\",Back!I60,\"\")","v":""},{"$f":"IF(Back!J60<>\"\",Back!J60,\"\")","v":""}]
[null,{"$f":"IF(Back!B61<>\"\",Back!B61,\"\")","v":""},{"$f":"IF(Back!C61<>\"\",Back!C61,\"\")","v":""},null,{"$f":"IF(Back!E61<>\"\",Back!E61,\"\")","v":""},{"$f":"IF(Back!F61<>\"\",Back!F61,\"\")","v":""},{"$f":"IF(Back!G61<>\"\",Back!G61,\"\")","v":""},{"$f":"IF(Back!H61<>\"\",Back!H61,\"\")","v":""},{"$f":"IF(Back!I61<>\"\",Back!I61,\"\")","v":""},{"$f":"IF(Back!J61<>\"\",Back!J61,\"\")","v":""}]
[null,{"$f":"IF(Back!B62<>\"\",Back!B62,\"\")","v":""},{"$f":"IF(Back!C62<>\"\",Back!C62,\"\")","v":""},null,{"$f":"IF(Back!E62<>\"\",Back!E62,\"\")","v":""},{"$f":"IF(Back!F62<>\"\",Back!F62,\"\")","v":""},{"$f":"IF(Back!G62<>\"\",Back!G62,\"\")","v":""},{"$f":"IF(Back!H62<>\"\",Back!H62,\"\")","v":""},{"$f":"IF(Back!I62<>\"\",Back!I62,\"\")","v":""},{"$f":"IF(Back!J62<>\"\",Back!J62,\"\")","v":""}]
[null,{"$f":"IF(Back!B63<>\"\",Back!B63,\"\")","v":""},{"$f":"IF(Back!C63<>\"\",Back!C63,\"\")","v":""},null,{"$f":"IF(Back!E63<>\"\",Back!E63,\"\")","v":""},{"$f":"IF(Back!F63<>\"\",Back!F63,\"\")","v":""},{"$f":"IF(Back!G63<>\"\",Back!G63,\"\")","v":""},{"$f":"IF(Back!H63<>\"\",Back!H63,\"\")","v":""},{"$f":"IF(Back!I63<>\"\",Back!I63,\"\")","v":""},{"$f":"IF(Back!J63<>\"\",Back!J63,\"\")","v":""}]
[null,{"$f":"IF(Back!B64<>\"\",Back!B64,\"\")","v":""},{"$f":"IF(Back!C64<>\"\",Back!C64,\"\")","v":""},null,{"$f":"IF(Back!E64<>\"\",Back!E64,\"\")","v":""},{"$f":"IF(Back!F64<>\"\",Back!F64,\"\")","v":""},{"$f":"IF(Back!G64<>\"\",Back!G64,\"\")","v":""},{"$f":"IF(Back!H64<>\"\",Back!H64,\"\")","v":""},{"$f":"IF(Back!I64<>\"\",Back!I64,\"\")","v":""},{"$f":"IF(Back!J64<>\"\",Back!J64,\"\")","v":""}]
[]
["Electives","Electives: ",null,null,{"$f":"IF(Back!E66<>\"\",Back!E66,\"\")","v":""},"hrs"]
[null,{"$f":"IF(Back!B67<>\"\",Back!B67,\"\")","v":""},{"$f":"IF(Back!C67<>\"\",Back!C67,\"\")","v":""},null,{"$f":"IF(Back!E67<>\"\",Back!E67,\"\")","v":""},{"$f":"IF(Back!F67<>\"\",Back!F67,\"\")","v":""},{"$f":"IF(Back!G67<>\"\",Back!G67,\"\")","v":""},{"$f":"IF(Back!H67<>\"\",Back!H67,\"\")","v":""},{"$f":"IF(Back!I67<>\"\",Back!I67,\"\")","v":""},{"$f":"IF(Back!J67<>\"\",Back!J67,\"\")","v":""}]
[null,{"$f":"IF(Back!B68<>\"\",Back!B68,\"\")","v":""},{"$f":"IF(Back!C68<>\"\",Back!C68,\"\")","v":""},null,{"$f":"IF(Back!E68<>\"\",Back!E68,\"\")","v":""},{"$f":"IF(Back!F68<>\"\",Back!F68,\"\")","v":""},{"$f":"IF(Back!G68<>\"\",Back!G68,\"\")","v":""},{"$f":"IF(Back!H68<>\"\",Back!H68,\"\")","v":""},{"$f":"IF(Back!I68<>\"\",Back!I68,\"\")","v":""},{"$f":"IF(Back!J68<>\"\",Back!J68,\"\")","v":""}]
[null,{"$f":"IF(Back!B69<>\"\",Back!B69,\"\")","v":""},{"$f":"IF(Back!C69<>\"\",Back!C69,\"\")","v":""},null,{"$f":"IF(Back!E69<>\"\",Back!E69,\"\")","v":""},{"$f":"IF(Back!F69<>\"\",Back!F69,\"\")","v":""},{"$f":"IF(Back!G69<>\"\",Back!G69,\"\")","v":""},{"$f":"IF(Back!H69<>\"\",Back!H69,\"\")","v":""},{"$f":"IF(Back!I69<>\"\",Back!I69,\"\")","v":""},{"$f":"IF(Back!J69<>\"\",Back!J69,\"\")","v":""}]
[null,{"$f":"IF(Back!B70<>\"\",Back!B70,\"\")","v":""},{"$f":"IF(Back!C70<>\"\",Back!C70,\"\")","v":""},null,{"$f":"IF(Back!E70<>\"\",Back!E70,\"\")","v":""},{"$f":"IF(Back!F70<>\"\",Back!F70,\"\")","v":""},{"$f":"IF(Back!G70<>\"\",Back!G70,\"\")","v":""},{"$f":"IF(Back!H70<>\"\",Back!H70,\"\")","v":""},{"$f":"IF(Back!I70<>\"\",Back!I70,\"\")","v":""},{"$f":"IF(Back!J70<>\"\",Back!J70,\"\")","v":""}]
[null,{"$f":"IF(Back!B71<>\"\",Back!B71,\"\")","v":""},{"$f":"IF(Back!C71<>\"\",Back!C71,\"\")","v":""},null,{"$f":"IF(Back!E71<>\"\",Back!E71,\"\")","v":""},{"$f":"IF(Back!F71<>\"\",Back!F71,\"\")","v":""},{"$f":"IF(Back!G71<>\"\",Back!G71,\"\")","v":""},{"$f":"IF(Back!H71<>\"\",Back!H71,\"\")","v":""},{"$f":"IF(Back!I71<>\"\",Back!I71,\"\")","v":""},{"$f":"IF(Back!J71<>\"\",Back!J71,\"\")","v":""}]
[null,{"$f":"IF(Back!B72<>\"\",Back!B72,\"\")","v":""},{"$f":"IF(Back!C72<>\"\",Back!C72,\"\")","v":""},null,{"$f":"IF(Back!E72<>\"\",Back!E72,\"\")","v":""},{"$f":"IF(Back!F72<>\"\",Back!F72,\"\")","v":""},{"$f":"IF(Back!G72<>\"\",Back!G72,\"\")","v":""},{"$f":"IF(Back!H72<>\"\",Back!H72,\"\")","v":""},{"$f":"IF(Back!I72<>\"\",Back!I72,\"\")","v":""},{"$f":"IF(Back!J72<>\"\",Back!J72,\"\")","v":""}]
[null,{"$f":"IF(Back!B73<>\"\",Back!B73,\"\")","v":""},{"$f":"IF(Back!C73<>\"\",Back!C73,\"\")","v":""},null,{"$f":"IF(Back!E73<>\"\",Back!E73,\"\")","v":""},{"$f":"IF(Back!F73<>\"\",Back!F73,\"\")","v":""},{"$f":"IF(Back!G73<>\"\",Back!G73,\"\")","v":""},{"$f":"IF(Back!H73<>\"\",Back!H73,\"\")","v":""},{"$f":"IF(Back!I73<>\"\",Back!I73,\"\")","v":""},{"$f":"IF(Back!J73<>\"\",Back!J73,\"\")","v":""}]
[null,{"$f":"IF(Back!B74<>\"\",Back!B74,\"\")","v":""},{"$f":"IF(Back!C74<>\"\",Back!C74,\"\")","v":""},null,{"$f":"IF(Back!E74<>\"\",Back!E74,\"\")","v":""},{"$f":"IF(Back!F74<>\"\",Back!F74,\"\")","v":""},{"$f":"IF(Back!G74<>\"\",Back!G74,\"\")","v":""},{"$f":"IF(Back!H74<>\"\",Back!H74,\"\")","v":""},{"$f":"IF(Back!I74<>\"\",Back!I74,\"\")","v":""},{"$f":"IF(Back!J74<>\"\",Back!J74,\"\")","v":""}]
[]
["Major Advisor's Signature",null,null,null,null,null,null,null,"Date",null,null,"Revision:"]
["Minor Advisor's Signature",null,null,null,null,null,null,null,"Date",null,null,{"$f":"Back!L77","v":0}]

{"sheet":"Clear button","index":4,"n_rows":11,"n_cols":1,"rows_kept":11,"cut":false,"hidden":false,"merged":[]}
[]
[]
[]
[]
["If you accidentally saved student data on the master UD form, use this button to clear that data out:"]
["--Save the filled-in form to the correct location (generally, the student's Z drive file)."]
["--Close that form (the one in the student folder)."]
["--Reopen the master UD form."]
["--Click the button above to clear out the student data."]
["--Click on the Front tab."]
["--Save the file."]